vmartinez@vmartinez:~/Drivers/pda/synce-kde$ make
make all-recursive
make[1]: Entering directory `/home/vmartinez/Drivers/pda/synce-kde'
Making all in doc
make[2]: Entering directory `/home/vmartinez/Drivers/pda/synce-kde/doc'
Making all in .
make[3]: Entering directory `/home/vmartinez/Drivers/pda/synce-kde/doc'
make[3]: No se hace nada para `all-am'.
make[3]: Leaving directory `/home/vmartinez/Drivers/pda/synce-kde/doc'
Making all in en
make[3]: Entering directory `/home/vmartinez/Drivers/pda/synce-kde/doc/en'
make[3]: No se hace nada para `all'.
make[3]: Leaving directory `/home/vmartinez/Drivers/pda/synce-kde/doc/en'
make[2]: Leaving directory `/home/vmartinez/Drivers/pda/synce-kde/doc'
Making all in icons
make[2]: Entering directory `/home/vmartinez/Drivers/pda/synce-kde/icons'
Making all in .
make[3]: Entering directory `/home/vmartinez/Drivers/pda/synce-kde/icons'
make[3]: No se hace nada para `all-am'.
make[3]: Leaving directory `/home/vmartinez/Drivers/pda/synce-kde/icons'
make[2]: Leaving directory `/home/vmartinez/Drivers/pda/synce-kde/icons'
Making all in po
make[2]: Entering directory `/home/vmartinez/Drivers/pda/synce-kde/po'
make[2]: No se hace nada para `all'.
make[2]: Leaving directory `/home/vmartinez/Drivers/pda/synce-kde/po'
Making all in raki
make[2]: Entering directory `/home/vmartinez/Drivers/pda/synce-kde/raki'
Making all in plugins
make[3]: Entering directory `/home/vmartinez/Drivers/pda/synce-kde/raki/plugins'
Making all in agsync
make[4]: Entering directory `/home/vmartinez/Drivers/pda/synce-kde/raki/plugins/agsync'
make[4]: No se hace nada para `all'.
make[4]: Leaving directory `/home/vmartinez/Drivers/pda/synce-kde/raki/plugins/agsync'
Making all in pimsync
make[4]: Entering directory `/home/vmartinez/Drivers/pda/synce-kde/raki/plugins/pimsync'
make[4]: No se hace nada para `all'.
make[4]: Leaving directory `/home/vmartinez/Drivers/pda/synce-kde/raki/plugins/pimsync'
make[4]: Entering directory `/home/vmartinez/Drivers/pda/synce-kde/raki/plugins'
make[4]: No se hace nada para `all-am'.
make[4]: Leaving directory `/home/vmartinez/Drivers/pda/synce-kde/raki/plugins'
make[3]: Leaving directory `/home/vmartinez/Drivers/pda/synce-kde/raki/plugins'
Making all in interfaces
make[3]: Entering directory `/home/vmartinez/Drivers/pda/synce-kde/raki/interfaces'
source='rakisyncplugin.cpp' object='rakisyncplugin.o' libtool=no \
depfile='.deps/rakisyncplugin.Po' tmpdepfile='.deps/rakisyncplugin.TPo' \
depmode=gcc3 /bin/sh ../../admin/depcomp \
g++ -DHAVE_CONFIG_H -I. -I. -I../.. -I../../raki -I../../raki/interfaces -I../ -I/usr/include/kde -I/usr/share/qt3/include -I. -DQT_THREAD_SUPPORT -D_REENTRANT -Wnon-virtual-dtor -Wno-long-long -Wundef -ansi -D_XOPEN_SOURCE=500 -D_BSD_SOURCE -Wcast-align -Wconversion -Wchar-subscripts -Wall -W -Wpointer-arith -Wwrite-strings -O2 -Wformat-security -Wmissing-format-attribute -fno-exceptions -fno-check-new -fno-common -c -o rakisyncplugin.o `test -f 'rakisyncplugin.cpp' || echo './'`rakisyncplugin.cpp
../../raki/threadevent.h:48: error: los argumentos por defecto sólo se permiten para parámetros de función
rakisyncplugin.cpp: In member function void RakiSyncPlugin::incTotalSteps(int):
rakisyncplugin.cpp:142: error: los argumentos por defecto sólo se permiten para parámetros de función
rakisyncplugin.cpp: In member function void RakiSyncPlugin::decTotalSteps(int):
rakisyncplugin.cpp:150: error: los argumentos por defecto sólo se permiten para parámetros de función
rakisyncplugin.cpp: In member function void RakiSyncPlugin::advanceProgress():
rakisyncplugin.cpp:156: error: los argumentos por defecto sólo se permiten para parámetros de función
rakisyncplugin.cpp: In member function void RakiSyncPlugin::setTotalSteps(int):
rakisyncplugin.cpp:164: error: los argumentos por defecto sólo se permiten para parámetros de función
rakisyncplugin.cpp: In member function void RakiSyncPlugin::setProgress(int):
rakisyncplugin.cpp:172: error: los argumentos por defecto sólo se permiten para parámetros de función
rakisyncplugin.cpp: In member function void RakiSyncPlugin::setTask(const char*):
rakisyncplugin.cpp:178: error: los argumentos por defecto sólo se permiten para parámetros de función
make[3]: *** [rakisyncplugin.o] Error 1
make[3]: Leaving directory `/home/vmartinez/Drivers/pda/synce-kde/raki/interfaces'
make[2]: *** [all-recursive] Error 1
make[2]: Leaving directory `/home/vmartinez/Drivers/pda/synce-kde/raki'
make[1]: *** [all-recursive] Error 1
make[1]: Leaving directory `/home/vmartinez/Drivers/pda/synce-kde'
make: *** [all] Error 2