rendered paste bodymake[3]: *** [amule] Error 1
make[3]: Leaving directory `/var/tmp/portage/amule-2.0.3/work/aMule-2.0.3/src'
make[2]: *** [all-recursive] Error 1
make[2]: Leaving directory `/var/tmp/portage/amule-2.0.3/work/aMule-2.0.3/src'
make[1]: *** [all-recursive] Error 1
make[1]: Leaving directory `/var/tmp/portage/amule-2.0.3/work/aMule-2.0.3'
make: *** [all] Error 2
!!! ERROR: net-p2p/amule-2.0.3 failed.
!!! Function src_compile, Line 71, Exitcode 2
!!! (no error message)
!!! If you need support, post the topmost build error, NOT this status message.