Miscellany
public text v1 · immutablemake[2]: *** [libfile.la] Error 1
make[2]: Leaving directory `/var/tmp/portage/gnome-vfs-2.10.1-r2/work/gnome-vfs-2.10.1/modules'
make[1]: *** [all-recursive] Error 1
make[1]: Leaving directory `/var/tmp/portage/gnome-vfs-2.10.1-r2/work/gnome-vfs-2.10.1'
make: *** [all] Error 2
!!! ERROR: gnome-base/gnome-vfs-2.10.1-r2 failed.
!!! Function gnome2_src_compile, Line 48, Exitcode 2
!!! compile failure
!!! If you need support, post the topmost build error, NOT this status message.