All pastes #3027 Raw Edit

spca5xx

public text v1 · immutable
#3027 ·published 2004-12-16 08:07 UTC
rendered paste body
version 0.50 of the spca5xx video for linux (v4l) driver

[shaun@DiRTY spca532-23062004]$ make
   Building SPCA5XX driver for 2.5/2.6 kernel.
   PLEASE IGNORE THE "Overriding SUBDIRS" WARNING
   Remember: you must have read/write access to your kernel source tree.
make -C /lib/modules/`uname -r`/build SUBDIRS=/home/shaun/spca532-23062004 modules
make[1]: Entering directory `/usr/src/linux-2.6.9-ARCH'
  CC [M]  /home/shaun/spca532-23062004/drivers/usb/spcadecoder.o
/home/shaun/spca532-23062004/drivers/usb/spcadecoder.c: In function `jpeg_decode':
/home/shaun/spca532-23062004/drivers/usb/spcadecoder.c:52: sorry, unimplemented: inlining failed in call to 'decode_mcus': function body not available
/home/shaun/spca532-23062004/drivers/usb/spcadecoder.c:535: sorry, unimplemented: called from here
/home/shaun/spca532-23062004/drivers/usb/spcadecoder.c:51: sorry, unimplemented: inlining failed in call to 'idct': function body not available
/home/shaun/spca532-23062004/drivers/usb/spcadecoder.c:541: sorry, unimplemented: called from here
/home/shaun/spca532-23062004/drivers/usb/spcadecoder.c:51: sorry, unimplemented: inlining failed in call to 'idct': function body not available
/home/shaun/spca532-23062004/drivers/usb/spcadecoder.c:545: sorry, unimplemented: called from here
/home/shaun/spca532-23062004/drivers/usb/spcadecoder.c:51: sorry, unimplemented: inlining failed in call to 'idct': function body not available
/home/shaun/spca532-23062004/drivers/usb/spcadecoder.c:550: sorry, unimplemented: called from here
/home/shaun/spca532-23062004/drivers/usb/spcadecoder.c:51: sorry, unimplemented: inlining failed in call to 'idct': function body not available
/home/shaun/spca532-23062004/drivers/usb/spcadecoder.c:555: sorry, unimplemented: called from here
/home/shaun/spca532-23062004/drivers/usb/spcadecoder.c:51: sorry, unimplemented: inlining failed in call to 'idct': function body not available
/home/shaun/spca532-23062004/drivers/usb/spcadecoder.c:560: sorry, unimplemented: called from here
/home/shaun/spca532-23062004/drivers/usb/spcadecoder.c:51: sorry, unimplemented: inlining failed in call to 'idct': function body not available
/home/shaun/spca532-23062004/drivers/usb/spcadecoder.c:565: sorry, unimplemented: called from here
/home/shaun/spca532-23062004/drivers/usb/spcadecoder.c:52: sorry, unimplemented: inlining failed in call to 'decode_mcus': function body not available
/home/shaun/spca532-23062004/drivers/usb/spcadecoder.c:652: sorry, unimplemented: called from here
/home/shaun/spca532-23062004/drivers/usb/spcadecoder.c:51: sorry, unimplemented: inlining failed in call to 'idct': function body not available
/home/shaun/spca532-23062004/drivers/usb/spcadecoder.c:658: sorry, unimplemented: called from here
/home/shaun/spca532-23062004/drivers/usb/spcadecoder.c:51: sorry, unimplemented: inlining failed in call to 'idct': function body not available
/home/shaun/spca532-23062004/drivers/usb/spcadecoder.c:662: sorry, unimplemented: called from here
/home/shaun/spca532-23062004/drivers/usb/spcadecoder.c:51: sorry, unimplemented: inlining failed in call to 'idct': function body not available
/home/shaun/spca532-23062004/drivers/usb/spcadecoder.c:667: sorry, unimplemented: called from here
/home/shaun/spca532-23062004/drivers/usb/spcadecoder.c:51: sorry, unimplemented: inlining failed in call to 'idct': function body not available
/home/shaun/spca532-23062004/drivers/usb/spcadecoder.c:672: sorry, unimplemented: called from here
/home/shaun/spca532-23062004/drivers/usb/spcadecoder.c:51: sorry, unimplemented: inlining failed in call to 'idct': function body not available
/home/shaun/spca532-23062004/drivers/usb/spcadecoder.c:677: sorry, unimplemented: called from here
/home/shaun/spca532-23062004/drivers/usb/spcadecoder.c:51: sorry, unimplemented: inlining failed in call to 'idct': function body not available
/home/shaun/spca532-23062004/drivers/usb/spcadecoder.c:682: sorry, unimplemented: called from here
/home/shaun/spca532-23062004/drivers/usb/spcadecoder.c:52: sorry, unimplemented: inlining failed in call to 'decode_mcus': function body not available
/home/shaun/spca532-23062004/drivers/usb/spcadecoder.c:768: sorry, unimplemented: called from here
/home/shaun/spca532-23062004/drivers/usb/spcadecoder.c:51: sorry, unimplemented: inlining failed in call to 'idct': function body not available
/home/shaun/spca532-23062004/drivers/usb/spcadecoder.c:774: sorry, unimplemented: called from here
/home/shaun/spca532-23062004/drivers/usb/spcadecoder.c:51: sorry, unimplemented: inlining failed in call to 'idct': function body not available
/home/shaun/spca532-23062004/drivers/usb/spcadecoder.c:778: sorry, unimplemented: called from here
/home/shaun/spca532-23062004/drivers/usb/spcadecoder.c:51: sorry, unimplemented: inlining failed in call to 'idct': function body not available
/home/shaun/spca532-23062004/drivers/usb/spcadecoder.c:783: sorry, unimplemented: called from here
/home/shaun/spca532-23062004/drivers/usb/spcadecoder.c:51: sorry, unimplemented: inlining failed in call to 'idct': function body not available
/home/shaun/spca532-23062004/drivers/usb/spcadecoder.c:788: sorry, unimplemented: called from here
/home/shaun/spca532-23062004/drivers/usb/spcadecoder.c:51: sorry, unimplemented: inlining failed in call to 'idct': function body not available
/home/shaun/spca532-23062004/drivers/usb/spcadecoder.c:793: sorry, unimplemented: called from here
/home/shaun/spca532-23062004/drivers/usb/spcadecoder.c:51: sorry, unimplemented: inlining failed in call to 'idct': function body not available
/home/shaun/spca532-23062004/drivers/usb/spcadecoder.c:798: sorry, unimplemented: called from here
make[2]: *** [/home/shaun/spca532-23062004/drivers/usb/spcadecoder.o] Error 1
make[1]: *** [_module_/home/shaun/spca532-23062004] Error 2
make[1]: Leaving directory `/usr/src/linux-2.6.9-ARCH'
make: *** [default] Error 2