All pastes #30022 Raw Edit

Miscellany

public text v1 · immutable
#30022 ·published 2005-11-21 19:13 UTC
rendered paste body
tclrrd.c:68: warning: `getopt_cleanup' defined but not used
{standard input}: Assembler messages:
{standard input}:59: Error: symbol `argv2' is already defined
{standard input}:79: Error: symbol `argv2' is already defined
{standard input}:85: Error: symbol `argv2' is already defined
gmake[3]: *** [tclrrd.o] Error 1
gmake[3]: Leaving directory `/usr/pkgsrc/databases/rrdtool/work/rrdtool-1.2.11/bindings/tcl'
gmake[3]: Entering directory `/usr/pkgsrc/databases/rrdtool/work/rrdtool-1.2.11/bindings'
cd perl-piped && /usr/pkg/bin/gmake
gmake[4]: Entering directory `/usr/pkgsrc/databases/rrdtool/work/rrdtool-1.2.11/bindings/perl-piped'
gmake[4]: Leaving directory `/usr/pkgsrc/databases/rrdtool/work/rrdtool-1.2.11/bindings/perl-piped'
cd perl-shared && /usr/pkg/bin/gmake RPATH=/usr/pkg/lib
gmake[4]: Entering directory `/usr/pkgsrc/databases/rrdtool/work/rrdtool-1.2.11/bindings/perl-shared'
gmake[4]: Leaving directory `/usr/pkgsrc/databases/rrdtool/work/rrdtool-1.2.11/bindings/perl-shared'
gmake[3]: Leaving directory `/usr/pkgsrc/databases/rrdtool/work/rrdtool-1.2.11/bindings'
gmake[2]: *** [all-recursive] Error 1
gmake[2]: Leaving directory `/usr/pkgsrc/databases/rrdtool/work/rrdtool-1.2.11/bindings'
Making all in doc
gmake[2]: Entering directory `/usr/pkgsrc/databases/rrdtool/work/rrdtool-1.2.11/doc'
gmake[2]: Nothing to be done for `all'.
gmake[2]: Leaving directory `/usr/pkgsrc/databases/rrdtool/work/rrdtool-1.2.11/doc'
Making all in examples
gmake[2]: Entering directory `/usr/pkgsrc/databases/rrdtool/work/rrdtool-1.2.11/examples'
gmake[2]: Nothing to be done for `all'.
gmake[2]: Leaving directory `/usr/pkgsrc/databases/rrdtool/work/rrdtool-1.2.11/examples'
gmake[2]: Entering directory `/usr/pkgsrc/databases/rrdtool/work/rrdtool-1.2.11'
gmake[2]: Leaving directory `/usr/pkgsrc/databases/rrdtool/work/rrdtool-1.2.11'
gmake[1]: *** [all-recursive] Error 1
gmake[1]: Leaving directory `/usr/pkgsrc/databases/rrdtool/work/rrdtool-1.2.11'
gmake: *** [all] Error 2
*** Error code 2

Stop.
make: stopped in /usr/pkgsrc/databases/rrdtool
===> 
===> There was an error during the ``build'' phase.
===> Please investigate the following for more information:
===>      * log of the build
===>      * /usr/pkgsrc/databases/rrdtool/work/.work.log
===> 
*** Error code 1

Stop.
make: stopped in /usr/pkgsrc/databases/rrdtool
*** Error code 1

Stop.
make: stopped in /usr/pkgsrc/databases/rrdtool