All pastes #29734 Raw Edit

qor

public text v1 · immutable
#29734 ·published 2005-11-20 21:09 UTC
rendered paste body
- emotion .................... ERROR!      
-----------------------------------------------------------------------------

LAST LOGLINES FROM /tmp/easy_e17/install_logs/emotion.log:
-----------------------------------------------------------------------------
emotion_xine_vo_out.c: In function '_emotion_frame_display':
emotion_xine_vo_out.c:450: warning: assignment from incompatible pointer type
emotion_xine_vo_out.c: In function '_emotion_overlay_blend_yuv':
emotion_xine_vo_out.c:577: error: 'struct vo_overlay_s' has no member named 'clip_color'
emotion_xine_vo_out.c:578: error: 'struct vo_overlay_s' has no member named 'clip_trans'
emotion_xine_vo_out.c:581: error: 'struct vo_overlay_s' has no member named 'clip_right'
emotion_xine_vo_out.c:582: error: 'struct vo_overlay_s' has no member named 'clip_right'
emotion_xine_vo_out.c:592: error: 'struct vo_overlay_s' has no member named 'clip_top'
emotion_xine_vo_out.c:592: error: 'struct vo_overlay_s' has no member named 'clip_bottom'
emotion_xine_vo_out.c:612: error: 'struct vo_overlay_s' has no member named 'clip_left'
emotion_xine_vo_out.c:614: error: 'struct vo_overlay_s' has no member named 'clip_left'
emotion_xine_vo_out.c:616: error: 'struct vo_overlay_s' has no member named 'clip_left'
emotion_xine_vo_out.c:638: error: 'struct vo_overlay_s' has no member named 'clip_color'
emotion_xine_vo_out.c:639: error: 'struct vo_overlay_s' has no member named 'clip_trans'
emotion_xine_vo_out.c:646: error: 'struct vo_overlay_s' has no member named 'clip_color'
emotion_xine_vo_out.c:647: error: 'struct vo_overlay_s' has no member named 'clip_trans'
make[4]: *** [emotion_xine_vo_out.lo] Error 1
make[4]: Leaving directory `/home/frank/e17_cvs/e17/libs/emotion/src/modules/xine'
make[3]: *** [all-recursive] Error 1
make[3]: Leaving directory `/home/frank/e17_cvs/e17/libs/emotion/src/modules'
make[2]: *** [all-recursive] Error 1
make[2]: Leaving directory `/home/frank/e17_cvs/e17/libs/emotion/src'
make[1]: *** [all-recursive] Error 1
make[1]: Leaving directory `/home/frank/e17_cvs/e17/libs/emotion'
make: *** [all] Error 2
-----------------------------------------------------------------------------