All pastes #29682 Raw Edit

Unnamed

public text v1 · immutable
#29682 ·published 2005-11-20 18:07 UTC
rendered paste body
| pyrexc dbus_bindings.pyx
| Traceback (most recent call last):
|   File "/usr/bin/pyrexc", line 7, in ?
|     from Pyrex.Compiler.Main import main
| ImportError: No module named Pyrex.Compiler.Main
| make[3]: [dbus_bindings.c] Error 1 (ignored)
| if /bin/sh ../arm-linux-libtool --tag=CC --mode=compile arm-linux-gcc -march=armv4 -mtune=xscale -DHAVE_CONFIG_H -I. -I/mnt/usbext2/bitbakery/oe/build/tmp/work/dbus-0.23.4-r1/dbus-0.23.4/python -I.. -I.. -I../dbus  -I/mnt/usbext2/bitbakery/oe/build/tmp/staging/arm-linux/include/glib-2.0 -I/mnt/usbext2/bitbakery/oe/build/tmp/staging/arm-linux/lib/glib-2.0/include    -I/usr/include/python2.4  -DDBUS_API_SUBJECT_TO_CHANGE=1 -I/mnt/usbext2/bitbakery/oe/build/tmp/staging/arm-linux/include  -I/mnt/usbext2/bitbakery/oe/build/tmp/staging/arm-linux/include -fexpensive-optimizations -fomit-frame-pointer -frename-registers -O2 -Wall -Wchar-subscripts -Wmissing-declarations -Wmissing-prototypes -Wnested-externs -Wpointer-arith -Wcast-align -Wfloat-equal -Wsign-compare -MT dbus_bindings.lo -MD -MP -MF ".deps/dbus_bindings.Tpo" -c -o dbus_bindings.lo dbus_bindings.c; \
| then mv -f ".deps/dbus_bindings.Tpo" ".deps/dbus_bindings.Plo"; else rm -f ".deps/dbus_bindings.Tpo"; exit 1; fi
|  arm-linux-gcc -march=armv4 -mtune=xscale -DHAVE_CONFIG_H -I. -I/mnt/usbext2/bitbakery/oe/build/tmp/work/dbus-0.23.4-r1/dbus-0.23.4/python -I.. -I.. -I../dbus -I/mnt/usbext2/bitbakery/oe/build/tmp/staging/arm-linux/include/glib-2.0 -I/mnt/usbext2/bitbakery/oe/build/tmp/staging/arm-linux/lib/glib-2.0/include -I/usr/include/python2.4 -DDBUS_API_SUBJECT_TO_CHANGE=1 -I/mnt/usbext2/bitbakery/oe/build/tmp/staging/arm-linux/include -I/mnt/usbext2/bitbakery/oe/build/tmp/staging/arm-linux/include -fexpensive-optimizations -fomit-frame-pointer -frename-registers -O2 -Wall -Wchar-subscripts -Wmissing-declarations -Wmissing-prototypes -Wnested-externs -Wpointer-arith -Wcast-align -Wfloat-equal -Wsign-compare -MT dbus_bindings.lo -MD -MP -MF .deps/dbus_bindings.Tpo -c dbus_bindings.c  -fPIC -DPIC -o .libs/dbus_bindings.o
| arm-linux-gcc: dbus_bindings.c: No such file or directory
| arm-linux-gcc: no input files
| make[3]: *** [dbus_bindings.lo] Error 1
| make[3]: Leaving directory `/mnt/usbext2/bitbakery/oe/build/tmp/work/dbus-0.23.4-r1/dbus-0.23.4/python'
| make[2]: *** [all-recursive] Error 1
| make[2]: Leaving directory `/mnt/usbext2/bitbakery/oe/build/tmp/work/dbus-0.23.4-r1/dbus-0.23.4/python'
| make[1]: *** [all-recursive] Error 1
| make[1]: Leaving directory `/mnt/usbext2/bitbakery/oe/build/tmp/work/dbus-0.23.4-r1/dbus-0.23.4'
| make: *** [all] Error 2
| FATAL: oe_runmake failed
NOTE: Task failed: /mnt/usbext2/bitbakery/oe/build/tmp/work/dbus-0.23.4-r1/temp/log.do_compile.18338
NOTE: package dbus-0.23.4-r1: task do_compile: failed
ERROR: TaskFailed event exception, aborting
NOTE: package dbus-0.23.4: failed
ERROR: Build of gpe-image failed