exhibit_image.c: In function '_ex_image_undo':
exhibit_image.c:201: error: 'Etk_Image' has no member named 'use_edje'
exhibit_image.c:211: error: 'Etk_Image' has no member named 'image_object'
exhibit_image.c:212: error: 'Etk_Image' has no member named 'image_object'
exhibit_image.c: In function '_ex_image_flip_horizontal':
exhibit_image.c:225: error: 'Etk_Image' has no member named 'use_edje'
exhibit_image.c:229: error: 'Etk_Image' has no member named 'image_object'
exhibit_image.c:246: error: 'Etk_Image' has no member named 'image_object'
exhibit_image.c:247: error: 'Etk_Image' has no member named 'image_object'
exhibit_image.c: In function '_ex_image_flip_vertical':
exhibit_image.c:258: error: 'Etk_Image' has no member named 'use_edje'
exhibit_image.c:262: error: 'Etk_Image' has no member named 'image_object'
exhibit_image.c:279: error: 'Etk_Image' has no member named 'image_object'
exhibit_image.c:280: error: 'Etk_Image' has no member named 'image_object'
exhibit_image.c: In function '_ex_image_flip_diagonal':
exhibit_image.c:295: error: 'Etk_Image' has no member named 'use_edje'
exhibit_image.c:299: error: 'Etk_Image' has no member named 'image_object'
exhibit_image.c:341: error: 'Etk_Image' has no member named 'image_object'
exhibit_image.c:342: error: 'Etk_Image' has no member named 'image_object'
exhibit_image.c:343: error: 'Etk_Image' has no member named 'image_object'
exhibit_image.c: In function '_ex_image_blur':
exhibit_image.c:362: error: 'Etk_Image' has no member named 'use_edje'
exhibit_image.c:366: error: 'Etk_Image' has no member named 'image_object'
exhibit_image.c:452: error: 'Etk_Image' has no member named 'image_object'
exhibit_image.c:453: error: 'Etk_Image' has no member named 'image_object'
exhibit_image.c: In function '_ex_image_sharpen':
exhibit_image.c:466: error: 'Etk_Image' has no member named 'use_edje'
exhibit_image.c:470: error: 'Etk_Image' has no member named 'image_object'
exhibit_image.c:531: error: 'Etk_Image' has no member named 'image_object'
exhibit_image.c:532: error: 'Etk_Image' has no member named 'image_object'
exhibit_image.c: In function '_ex_image_save':
exhibit_image.c:540: error: 'Etk_Image' has no member named 'filename'
exhibit_image.c:543: error: 'Etk_Image' has no member named 'filename'
exhibit_image.c:549: error: 'Etk_Image' has no member named 'image_object'
exhibit_image.c:549: error: 'Etk_Image' has no member named 'filename'
exhibit_image.c: In function '_ex_image_save_as_cb':
exhibit_image.c:583: error: 'Etk_Image' has no member named 'image_object'
exhibit_image.c: In function '_ex_image_zoom':
exhibit_image.c:838: error: 'Etk_Image' has no member named 'use_edje'
exhibit_image.c: In function '_ex_image_brightness':
exhibit_image.c:869: error: 'Etk_Image' has no member named 'use_edje'
exhibit_image.c:881: error: 'Etk_Image' has no member named 'image_object'
exhibit_image.c:928: error: 'Etk_Image' has no member named 'image_object'
exhibit_image.c:929: error: 'Etk_Image' has no member named 'image_object'
exhibit_image.c: In function '_ex_image_brightness2':
exhibit_image.c:941: error: 'Etk_Image' has no member named 'use_edje'
exhibit_image.c:954: error: 'Etk_Image' has no member named 'image_object'
exhibit_image.c:973: error: 'Etk_Image' has no member named 'image_object'
exhibit_image.c:974: error: 'Etk_Image' has no member named 'image_object'
exhibit_image.c: In function '_ex_image_wallpaper_set':
exhibit_image.c:1009: error: 'Etk_Image' has no member named 'filename'
exhibit_image.c:1010: error: 'Etk_Image' has no member named 'filename'
exhibit_image.c:1012: error: 'Etk_Image' has no member named 'filename'
exhibit_image.c:1013: error: 'Etk_Image' has no member named 'filename'
exhibit_image.c:1015: error: 'Etk_Image' has no member named 'filename'
exhibit_image.c:1028: error: 'Etk_Image' has no member named 'filename'
exhibit_image.c:1028: error: 'Etk_Image' has no member named 'filename'
exhibit_image.c:1028: error: 'Etk_Image' has no member named 'filename'
exhibit_image.c:1028: error: 'Etk_Image' has no member named 'filename'
exhibit_image.c:1028: error: 'Etk_Image' has no member named 'filename'
exhibit_image.c:1028: error: 'Etk_Image' has no member named 'filename'
exhibit_image.c:1028: error: 'Etk_Image' has no member named 'filename'
exhibit_image.c:1028: error: 'Etk_Image' has no member named 'filename'
exhibit_image.c:1028: error: 'Etk_Image' has no member named 'filename'
exhibit_image.c:1028: error: 'Etk_Image' has no member named 'filename'
exhibit_image.c:1028: error: 'Etk_Image' has no member named 'filename'
exhibit_image.c:1028: error: 'Etk_Image' has no member named 'filename'
exhibit_image.c:1028: error: 'Etk_Image' has no member named 'filename'
exhibit_image.c:1028: error: 'Etk_Image' has no member named 'filename'
exhibit_image.c:1028: error: 'Etk_Image' has no member named 'filename'
exhibit_image.c:1028: error: 'Etk_Image' has no member named 'filename'
exhibit_image.c:1028: error: 'Etk_Image' has no member named 'filename'
exhibit_image.c:1028: error: 'Etk_Image' has no member named 'filename'
exhibit_image.c:1028: error: 'Etk_Image' has no member named 'filename'
exhibit_image.c:1028: error: 'Etk_Image' has no member named 'filename'
exhibit_image.c:1028: error: 'Etk_Image' has no member named 'filename'
exhibit_image.c:1028: error: 'Etk_Image' has no member named 'filename'
exhibit_image.c:1028: error: 'Etk_Image' has no member named 'filename'
exhibit_image.c:1028: error: 'Etk_Image' has no member named 'filename'
exhibit_image.c:1028: error: 'Etk_Image' has no member named 'filename'
exhibit_image.c:1028: error: 'Etk_Image' has no member named 'filename'
exhibit_image.c:1028: error: 'Etk_Image' has no member named 'filename'
exhibit_image.c:1028: error: 'Etk_Image' has no member named 'filename'
exhibit_image.c:1028: error: 'Etk_Image' has no member named 'filename'
exhibit_image.c:1028: error: 'Etk_Image' has no member named 'filename'
exhibit_image.c:1028: error: 'Etk_Image' has no member named 'filename'
exhibit_image.c:1028: error: 'Etk_Image' has no member named 'filename'
exhibit_image.c:1028: error: 'Etk_Image' has no member named 'filename'
exhibit_image.c:1028: error: 'Etk_Image' has no member named 'filename'
exhibit_image.c:1028: error: 'Etk_Image' has no member named 'filename'
exhibit_image.c:1028: error: 'Etk_Image' has no member named 'filename'
exhibit_image.c:1028: error: 'Etk_Image' has no member named 'filename'
exhibit_image.c:1028: error: 'Etk_Image' has no member named 'filename'
exhibit_image.c:1028: error: 'Etk_Image' has no member named 'filename'
exhibit_image.c:1028: error: 'Etk_Image' has no member named 'filename'
exhibit_image.c:1043: error: 'Etk_Image' has no member named 'filename'
exhibit_image.c:1044: error: 'Etk_Image' has no member named 'filename'
exhibit_image.c:1072: error: 'Etk_Image' has no member named 'filename'
exhibit_image.c:1148: error: 'Etk_Image' has no member named 'filename'
exhibit_image.c:1149: error: 'Etk_Image' has no member named 'filename'
exhibit_image.c:1150: error: 'Etk_Image' has no member named 'filename'
make[3]: *** [exhibit_image.o] Error 1