rendered paste bodyclude -I/mnt/usbext2/bitbakery/oe/build/tmp/staging/arm-linux/include -fexpensive-optimizations -fomit-frame-pointer -frename-registers -O2 -Wall -Wchar-subscripts -Wmissing-declarations -Wmissing-prototypes -Wnested-externs -Wpointer-arith -Wcast-align -Wfloat-equal -Wsign-compare -MT dbus_bindings.lo -MD -MP -MF .deps/dbus_bindings.Tpo -c dbus_bindings.c -fPIC -DPIC -o .libs/dbus_bindings.o
| arm-linux-gcc: dbus_bindings.c: No such file or directory
| arm-linux-gcc: no input files
| make[3]: *** [dbus_bindings.lo] Error 1
| make[3]: Leaving directory `/mnt/usbext2/bitbakery/oe/build/tmp/work/dbus-0.23.4-r1/dbus-0.23.4/python'
| make[2]: *** [all-recursive] Error 1
| make[2]: Leaving directory `/mnt/usbext2/bitbakery/oe/build/tmp/work/dbus-0.23.4-r1/dbus-0.23.4/python'
| make[1]: *** [all-recursive] Error 1
| make[1]: Leaving directory `/mnt/usbext2/bitbakery/oe/build/tmp/work/dbus-0.23.4-r1/dbus-0.23.4'
| make: *** [all] Error 2
| FATAL: oe_runmake failed
NOTE: Task failed: /mnt/usbext2/bitbakery/oe/build/tmp/work/dbus-0.23.4-r1/temp/log.do_compile.2202
NOTE: package dbus-0.23.4-r1: task do_compile: failed
ERROR: TaskFailed event exception, aborting
NOTE: package dbus-0.23.4: fail