All pastes #295939 Raw Edit

Stuff

public text v1 · immutable
#295939 ·published 2006-12-29 21:26 UTC
rendered paste body
make[1]: Nothing to be done for `all'.
make[1]: Leaving directory `/usr/src/asterisk-1.2.14/pbx'
make[1]: Entering directory `/usr/src/asterisk-1.2.14/apps'
gcc  -pipe  -Wall -Wstrict-prototypes -Wmissing-prototypes -Wmissing-declarations -g3  -Iinclude -I../include -D_REENTRANT -D_GNU_SOURCE  -O6 -march=i686 -DZAPTEL_OPTIMIZATIONS         -fomit-frame-pointer  -fPIC   -c -o app_zapras.o app_zapras.c
gcc -shared -Xlinker -x -o app_zapras.so  app_zapras.o
gcc  -pipe  -Wall -Wstrict-prototypes -Wmissing-prototypes -Wmissing-declarations -g3  -Iinclude -I../include -D_REENTRANT -D_GNU_SOURCE  -O6 -march=i686 -DZAPTEL_OPTIMIZATIONS         -fomit-frame-pointer  -fPIC   -c -o app_meetme.o app_meetme.c
gcc -shared -Xlinker -x -o app_meetme.so  app_meetme.o
gcc  -pipe  -Wall -Wstrict-prototypes -Wmissing-prototypes -Wmissing-declarations -g3  -Iinclude -I../include -D_REENTRANT -D_GNU_SOURCE  -O6 -march=i686 -DZAPTEL_OPTIMIZATIONS         -fomit-frame-pointer  -fPIC   -c -o app_flash.o app_flash.c
gcc -shared -Xlinker -x -o app_flash.so  app_flash.o
gcc  -pipe  -Wall -Wstrict-prototypes -Wmissing-prototypes -Wmissing-declarations -g3  -Iinclude -I../include -D_REENTRANT -D_GNU_SOURCE  -O6 -march=i686 -DZAPTEL_OPTIMIZATIONS         -fomit-frame-pointer  -fPIC   -c -o app_zapbarge.o app_zapbarge.c
gcc -shared -Xlinker -x -o app_zapbarge.so  app_zapbarge.o
gcc  -pipe  -Wall -Wstrict-prototypes -Wmissing-prototypes -Wmissing-declarations -g3  -Iinclude -I../include -D_REENTRANT -D_GNU_SOURCE  -O6 -march=i686 -DZAPTEL_OPTIMIZATIONS         -fomit-frame-pointer  -fPIC   -c -o app_zapscan.o app_zapscan.c
gcc -shared -Xlinker -x -o app_zapscan.so  app_zapscan.o
gcc  -pipe  -Wall -Wstrict-prototypes -Wmissing-prototypes -Wmissing-declarations -g3  -Iinclude -I../include -D_REENTRANT -D_GNU_SOURCE  -O6 -march=i686 -DZAPTEL_OPTIMIZATIONS         -fomit-frame-pointer  -fPIC   -c -o app_rxfax.o app_rxfax.c
app_rxfax.c: In function `phase_e_handler':
app_rxfax.c:105: error: structure has no member named `column_resolution'
app_rxfax.c:105: error: structure has no member named `row_resolution'
app_rxfax.c:116: error: structure has no member named `row_resolution'
app_rxfax.c:122: error: structure has no member named `row_resolution'
app_rxfax.c: In function `phase_d_handler':
app_rxfax.c:147: error: structure has no member named `columns'
app_rxfax.c:147: error: structure has no member named `rows'
app_rxfax.c:148: error: structure has no member named `column_resolution'
app_rxfax.c:148: error: structure has no member named `row_resolution'
app_rxfax.c: In function `rxfax_exec':
app_rxfax.c:281: warning: passing arg 1 of `fax_init' from incompatible pointer type
app_rxfax.c:281: error: too many arguments to function `fax_init'
app_rxfax.c:304: warning: passing arg 1 of `fax_rx' from incompatible pointer type
app_rxfax.c:307: warning: passing arg 1 of `fax_tx' from incompatible pointer type
app_rxfax.c:344: warning: passing arg 1 of `fax_release' from incompatible pointer type
app_rxfax.c: At top level:
app_rxfax.c:81: warning: 't30_flush' defined but not used
make[1]: *** [app_rxfax.o] Error 1
make[1]: Leaving directory `/usr/src/asterisk-1.2.14/apps'
make: *** [subdirs] Error 1