.5/kdesu/kdesu'
make[2]: *** [all-recursive] Error 1
make[2]: Leaving directory `/var/tmp/portage/kde-base/kdesu-3.5.5/work/kdesu-3.5.5/kdesu'
make[1]: *** [all-recursive] Error 1
make[1]: Leaving directory `/var/tmp/portage/kde-base/kdesu-3.5.5/work/kdesu-3.5.5'
make: *** [all] Error 2
!!! ERROR: kde-base/kdesu-3.5.5 failed.
Call stack:
ebuild.sh, line 1580: Called dyn_compile
ebuild.sh, line 945: Called src_compile
kdesu-3.5.5.ebuild, line 20: Called kde-meta_src_compile
kde-meta.eclass, line 379: Called kde_src_compile
kde.eclass, line 170: Called kde_src_compile 'all'
kde.eclass, line 340: Called kde_src_compile 'myconf' 'configure' 'make'
kde.eclass, line 336: Called die
!!! died running emake, kde_src_compile:make
!!! If you need support, post the topmost build error, and the call stack if relevant.