All pastes #295527 Raw Edit

alesan

public text v1 · immutable
#295527 ·published 2006-12-29 14:05 UTC
rendered paste body
Making all in ptp2
make[8]: Entering directory `/pr0n/openwrt/trunk/build_mipsel/libgphoto2-2.3.1/camlibs/ptp2'
if /bin/sh ../../libtool --tag=CC --mode=compile mipsel-linux-uclibc-gcc -DHAVE_CONFIG_H -I. -I. -I../..  -I/pr0n/openwrt/trunk/staging_dir_mipsel/usr/include -I/pr0n/openwrt/trunk/staging_dir_mipsel/include -I../.. -I../.. -I../../libgphoto2_port -I../../libgphoto2 -I../../libgphoto2 -DLOCALEDIR=\"/usr/share/locale\" -DCAMLIBS=\"/usr/lib/libgphoto2/2.3.1\" -Wall -g -D_GPHOTO2_INTERNAL_CODE -I/pr0n/openwrt/trunk/staging_dir_mipsel/usr/include -I/pr0n/openwrt/trunk/staging_dir_mipsel/include -Wmissing-declarations -Wmissing-prototypes -Os -pipe -mips32 -mtune=mips32 -funit-at-a-time -MT ptp.lo -MD -MP -MF ".deps/ptp.Tpo" -c -o ptp.lo ptp.c; \
        then mv -f ".deps/ptp.Tpo" ".deps/ptp.Plo"; else rm -f ".deps/ptp.Tpo"; exit 1; fi
 mipsel-linux-uclibc-gcc -DHAVE_CONFIG_H -I. -I. -I../.. -I/pr0n/openwrt/trunk/staging_dir_mipsel/usr/include -I/pr0n/openwrt/trunk/staging_dir_mipsel/include -I../.. -I../.. -I../../libgphoto2_port -I../../libgphoto2 -I../../libgphoto2 -DLOCALEDIR=\"/usr/share/locale\" -DCAMLIBS=\"/usr/lib/libgphoto2/2.3.1\" -Wall -g -D_GPHOTO2_INTERNAL_CODE -I/pr0n/openwrt/trunk/staging_dir_mipsel/usr/include -I/pr0n/openwrt/trunk/staging_dir_mipsel/include -Wmissing-declarations -Wmissing-prototypes -Os -pipe -mips32 -mtune=mips32 -funit-at-a-time -MT ptp.lo -MD -MP -MF .deps/ptp.Tpo -c ptp.c  -fPIC -DPIC -o .libs/ptp.o
In file included from ptp.c:24:
ptp.h:26:19: iconv.h: No such file or directory
In file included from ptp.c:24:
ptp.h:1156: error: syntax error before "iconv_t"
ptp.h:1156: warning: no semicolon at end of struct or union
ptp.h:1157: warning: type defaults to `int' in declaration of `cd_ucs2_to_locale'
ptp.h:1157: warning: data definition has no type or storage class
ptp.c: In function `ptp_debug':
ptp.c:61: error: dereferencing pointer to incomplete type
ptp.c:62: error: dereferencing pointer to incomplete type
ptp.c:62: error: dereferencing pointer to incomplete type
ptp.c: In function `ptp_error':
ptp.c:78: error: dereferencing pointer to incomplete type
ptp.c:79: error: dereferencing pointer to incomplete type
ptp.c:79: error: dereferencing pointer to incomplete type
In file included from ptp.c:91:
ptp-pack.c: In function `htod16p':
ptp-pack.c:8: error: dereferencing pointer to incomplete type
ptp-pack.c: In function `htod32p':
ptp-pack.c:14: error: dereferencing pointer to incomplete type
ptp-pack.c: In function `htod16ap':
ptp-pack.c:20: error: dereferencing pointer to incomplete type
ptp-pack.c: In function `htod32ap':
ptp-pack.c:29: error: dereferencing pointer to incomplete type
ptp-pack.c: In function `dtoh16p':
ptp-pack.c:38: error: dereferencing pointer to incomplete type
ptp-pack.c: In function `dtoh32p':
ptp-pack.c:44: error: dereferencing pointer to incomplete type
ptp-pack.c: In function `dtoh16ap':
ptp-pack.c:50: error: dereferencing pointer to incomplete type
ptp-pack.c: In function `dtoh32ap':
ptp-pack.c:56: error: dereferencing pointer to incomplete type
ptp-pack.c: In function `dtoh64ap':
ptp-pack.c:65: error: dereferencing pointer to incomplete type
ptp-pack.c: In function `ptp_unpack_string':
ptp-pack.c:116: warning: implicit declaration of function `iconv'
ptp-pack.c:116: error: dereferencing pointer to incomplete type
ptp-pack.c: In function `ptp_pack_string':
ptp-pack.c:153: error: dereferencing pointer to incomplete type
ptp.c: In function `ptp_usb_sendreq':
ptp.c:113: error: dereferencing pointer to incomplete type
ptp.c:115: error: dereferencing pointer to incomplete type
ptp.c: In function `ptp_usb_senddata':
ptp.c:144: error: dereferencing pointer to incomplete type
ptp.c:160: error: dereferencing pointer to incomplete type
ptp.c:160: error: dereferencing pointer to incomplete type
ptp.c:171: error: dereferencing pointer to incomplete type
ptp.c:171: error: dereferencing pointer to incomplete type
ptp.c:196: error: dereferencing pointer to incomplete type
ptp.c:196: error: dereferencing pointer to incomplete type
ptp.c: In function `ptp_usb_getdata':
ptp.c:227: error: dereferencing pointer to incomplete type
ptp.c:228: error: dereferencing pointer to incomplete type
ptp.c:248: error: dereferencing pointer to incomplete type
ptp.c:249: error: dereferencing pointer to incomplete type
ptp.c:286: error: dereferencing pointer to incomplete type
ptp.c:305: error: dereferencing pointer to incomplete type
ptp.c:308: error: dereferencing pointer to incomplete type
ptp.c:345: error: dereferencing pointer to incomplete type
ptp.c:347: error: dereferencing pointer to incomplete type
ptp.c: In function `ptp_usb_getresp':
ptp.c:390: error: dereferencing pointer to incomplete type
ptp.c:391: error: dereferencing pointer to incomplete type
ptp.c:410: error: dereferencing pointer to incomplete type
ptp.c: In function `_ptp_transaction':
ptp.c:464: error: dereferencing pointer to incomplete type
ptp.c:465: error: dereferencing pointer to incomplete type
ptp.c:467: error: dereferencing pointer to incomplete type
ptp.c:471: error: dereferencing pointer to incomplete type
ptp.c:475: error: dereferencing pointer to incomplete type
ptp.c:484: error: dereferencing pointer to incomplete type
ptp.c:485: error: dereferencing pointer to incomplete type
ptp.c:488: error: dereferencing pointer to incomplete type
ptp.c: In function `ptp_usb_event':
ptp.c:536: error: dereferencing pointer to incomplete type
ptp.c:537: error: dereferencing pointer to incomplete type
ptp.c:540: error: dereferencing pointer to incomplete type
ptp.c:541: error: dereferencing pointer to incomplete type
ptp.c:559: error: dereferencing pointer to incomplete type
ptp.c:560: error: dereferencing pointer to incomplete type
ptp.c:570: error: dereferencing pointer to incomplete type
ptp.c: In function `ptp_opensession':
ptp.c:644: error: dereferencing pointer to incomplete type
ptp.c:646: error: dereferencing pointer to incomplete type
ptp.c:654: error: dereferencing pointer to incomplete type
ptp.c: In function `ptp_nikon_getwifiprofilelist':
ptp.c:2210: error: dereferencing pointer to incomplete type
ptp.c:2211: error: dereferencing pointer to incomplete type
ptp.c:2212: error: dereferencing pointer to incomplete type
ptp.c:2213: error: dereferencing pointer to incomplete type
ptp.c:2215: error: dereferencing pointer to incomplete type
ptp.c:2215: error: dereferencing pointer to incomplete type
ptp.c:2216: error: dereferencing pointer to incomplete type
ptp.c:2216: error: dereferencing pointer to incomplete type
ptp.c:2220: error: dereferencing pointer to incomplete type
ptp.c:2222: error: dereferencing pointer to incomplete type
ptp.c:2223: error: dereferencing pointer to incomplete type
ptp.c:2228: error: dereferencing pointer to incomplete type
ptp.c:2229: error: dereferencing pointer to incomplete type
ptp.c:2232: error: dereferencing pointer to incomplete type
ptp.c:2233: error: dereferencing pointer to incomplete type
ptp.c:2234: error: dereferencing pointer to incomplete type
ptp.c:2237: error: dereferencing pointer to incomplete type
ptp.c:2237: error: dereferencing pointer to incomplete type
ptp.c:2242: error: dereferencing pointer to incomplete type
ptp.c:2242: error: dereferencing pointer to incomplete type
ptp.c:2249: error: dereferencing pointer to incomplete type
ptp.c:2250: error: dereferencing pointer to incomplete type
ptp.c: In function `ptp_nikon_writewifiprofile':
ptp.c:2325: error: dereferencing pointer to incomplete type
ptp.c:2328: error: dereferencing pointer to incomplete type
ptp.c:2329: error: dereferencing pointer to incomplete type
ptp.c:2330: error: dereferencing pointer to incomplete type
ptp.c: In function `ptp_mtp_sendobjectproplist':
ptp.c:2610: error: dereferencing pointer to incomplete type
ptp.c:2611: error: dereferencing pointer to incomplete type
ptp.c:2622: error: dereferencing pointer to incomplete type
ptp.c: In function `ptp_operation_issupported':
ptp.c:2635: error: dereferencing pointer to incomplete type
ptp.c:2636: error: dereferencing pointer to incomplete type
ptp.c: In function `ptp_event_issupported':
ptp.c:2648: error: dereferencing pointer to incomplete type
ptp.c:2649: error: dereferencing pointer to incomplete type
ptp.c: In function `ptp_property_issupported':
ptp.c:2661: error: dereferencing pointer to incomplete type
ptp.c:2662: error: dereferencing pointer to incomplete type
ptp.c: In function `ptp_get_property_description':
ptp.c:3119: error: dereferencing pointer to incomplete type
ptp.c:3124: error: dereferencing pointer to incomplete type
ptp.c:3129: error: dereferencing pointer to incomplete type
ptp.c:3134: error: dereferencing pointer to incomplete type
ptp.c: In function `ptp_render_property_value':
ptp.c:3354: error: dereferencing pointer to incomplete type
ptp.c:3385: error: dereferencing pointer to incomplete type
ptp.c: In function `ptp_render_ofc':
ptp.c:3499: error: dereferencing pointer to incomplete type
ptp.c: In function `ptp_render_opcode':
ptp.c:3591: error: dereferencing pointer to incomplete type
make[8]: *** [ptp.lo] Error 1
make[8]: Leaving directory `/pr0n/openwrt/trunk/build_mipsel/libgphoto2-2.3.1/camlibs/ptp2'
make[7]: *** [all-recursive] Error 1
make[7]: Leaving directory `/pr0n/openwrt/trunk/build_mipsel/libgphoto2-2.3.1/camlibs'
make[6]: *** [all-recursive] Error 1
make[6]: Leaving directory `/pr0n/openwrt/trunk/build_mipsel/libgphoto2-2.3.1'
make[5]: *** [all] Error 2
make[5]: Leaving directory `/pr0n/openwrt/trunk/build_mipsel/libgphoto2-2.3.1'
make[4]: *** [/pr0n/openwrt/trunk/build_mipsel/libgphoto2-2.3.1/.built] Error 2
make[4]: Leaving directory `/pr0n/openwrt/packages/libs/libgphoto2'
make[3]: *** [libgphoto2-compile] Error 2
make[3]: Leaving directory `/pr0n/openwrt/trunk/package'
make[2]: *** [compile] Error 2
make[2]: Leaving directory `/pr0n/openwrt/trunk/package'
make[1]: *** [package/compile] Error 2
make[1]: Leaving directory `/pr0n/openwrt/trunk'
make: *** [world] Error 2