rendered paste bodytrict-aliasing -pipe -Wdeclaration-after-statement -D_LARGEFILE_SOURCE -D_FILE_OFFSET_BITS=64 -I/usr/include/gdbm -I/usr/lib/perl5/5.8.8/i686-linux-thread-multi/CORE init.c search.c close.c config.c bind.c compare.c modify.c add.c modrdn.c delete.c
make[3]: Leaving directory `/var/tmp/portage/net-nds/openldap-2.3.31/work/openldap-2.3.31/servers/slapd/back-perl'
cd back-relay; make -w --jobserver-fds=3,4 - --jobserver-fds=3,4 - --jobserver-fds=3,4 - --jobserver-fds=3,4 -j depend
make[3]: Entering directory `/var/tmp/portage/net-nds/openldap-2.3.31/work/openldap-2.3.31/servers/slapd/back-relay'
../../../build/mkdep -l -d "." -c "cc" -m "-M" -I../../../include -I../../../include -I.. -I./.. init.c config.c op.c
make[3]: Leaving directory `/var/tmp/portage/net-nds/openldap-2.3.31/work/openldap-2.3.31/servers/slapd/back-relay'
cd back-shell; make -w --jobserver-fds=3,4 - --jobserver-fds=3,4 - --jobserver-fds=3,4 - --jobserver-fds=3,4 -j depend
make[3]: Entering directory `/var/tmp/portage/net-nds/openldap-2.3.31/work/openldap-2.3.31/servers/slapd/back-shell'
../../../build/mkdep -l -d "." -c "cc" -m "-M" -I../../../include -I../../../include -I.. -I./.. init.c config.c fork.c search.c bind.c unbind.c add.c delete.c modify.c modrdn.c compare.c result.c
make[3]: Leaving directory `/var/tmp/portage/net-nds/openldap-2.3.31/work/openldap-2.3.31/servers/slapd/back-shell'
cd back-sql; make -w --jobserver-fds=3,4 - --jobserver-fds=3,4 - --jobserver-fds=3,4 - --jobserver-fds=3,4 -j depend
make[3]: Entering directory `/var/tmp/portage/net-nds/openldap-2.3.31/work/openldap-2.3.31/servers/slapd/back-sql'
run configure with --enable-sql to make back_sql
make[3]: Leaving directory `/var/tmp/portage/net-nds/openldap-2.3.31/work/openldap-2.3.31/servers/slapd/back-sql'
cd shell-backends; make -w --jobserver-fds=3,4 - --jobserver-fds=3,4 - --jobserver-fds=3,4 - --jobserver-fds=3,4 -j depend
make[3]: Entering directory `/var/tmp/portage/net-nds/openldap-2.3.31/work/openldap-2.3.31/servers/slapd/shell-backends'
../../../build/mkdep -d "." -c "cc" -m "-M" -I../../../include -I../../../include passwd-shell.c shellutil.c
make[3]: Leaving directory `/var/tmp/portage/net-nds/openldap-2.3.31/work/openldap-2.3.31/servers/slapd/shell-backends'
cd slapi; make -w --jobserver-fds=3,4 - --jobserver-fds=3,4 - --jobserver-fds=3,4 - --jobserver-fds=3,4 -j depend
make[3]: Entering directory `/var/tmp/portage/net-nds/openldap-2.3.31/work/openldap-2.3.31/servers/slapd/slapi'
../../../build/mkdep -l -d "." -c "cc" -m "-M" -I../../../include -I.. -I. -I../../../include -I./.. -I. plugin.c slapi_pblock.c slapi_utils.c printmsg.c slapi_ops.c slapi_dn.c slapi_ext.c slapi_overlay.c
make[3]: Leaving directory `/var/tmp/portage/net-nds/openldap-2.3.31/work/openldap-2.3.31/servers/slapd/slapi'
cd overlays; make -w --jobserver-fds=3,4 - --jobserver-fds=3,4 - --jobserver-fds=3,4 - --jobserver-fds=3,4 -j depend
make[3]: Entering directory `/var/tmp/portage/net-nds/openldap-2.3.31/work/openldap-2.3.31/servers/slapd/overlays'
../../../build/mkdep -l -d "." -c "cc" -m "-M" -I../../../include -I../../../include -I.. -I./.. overlays.c accesslog.c auditlog.c denyop.c dyngroup.c dynlist.c lastmod.c pcache.c ppolicy.c refint.c retcode.c rwm.c rwmconf.c rwmdn.c rwmmap.c syncprov.c translucent.c unique.c valsort.c
cp: cannot open `Makefile' for reading: No such file or directory
make[3]: *** [depend-common] Error 1
make[3]: *** Waiting for unfinished jobs....
make[3]: Leaving directory `/var/tmp/portage/net-nds/openldap-2.3.31/work/openldap-2.3.31/servers/slapd/overlays'
make[2]: *** [depend-local-srv] Error 1
make[2]: Leaving directory `/var/tmp/portage/net-nds/openldap-2.3.31/work/openldap-2.3.31/servers/slapd'
make[1]: *** [depend-common] Error 1
make[1]: Leaving directory `/var/tmp/portage/net-nds/openldap-2.3.31/work/openldap-2.3.31/servers'
make: *** [depend-common] Error 1
!!! ERROR: net-nds/openldap-2.3.31 failed.
Call stack:
ebuild.sh, line 1580: Called dyn_compile
ebuild.sh, line 945: Called src_compile
openldap-2.3.31.ebuild, line 291: Called die
!!! make depend failed
!!! If you need support, post the topmost build error, and the call stack if relevant