All pastes #29445 Raw Edit

Miscellany

public text v1 · immutable
#29445 ·published 2005-11-20 02:18 UTC
rendered paste body
    MT_Vector4.h already installed
    NM_Scalar.h already installed
====> make all in intern/container
hostname: No address associated with name
====> make all in intern/container/intern
hostname: No address associated with name
====> make debug in intern/container/intern
hostname: No address associated with name
    libcontainer.a already installed
    libcontainer.a already installed
    CTR_List.h already installed
    CTR_Map.h already installed
    CTR_TaggedIndex.h already installed
    CTR_TaggedSetOps.h already installed
    CTR_UHeap.h already installed
====> make all in intern/memutil
hostname: No address associated with name
====> make all in intern/memutil/intern
hostname: No address associated with name
====> make debug in intern/memutil/intern
hostname: No address associated with name
    libmemutil.a already installed
    libmemutil.a already installed
    MEM_NonCopyable.h already installed
    MEM_RefCountedC-Api.h already installed
    MEM_RefCounted.h already installed
    MEM_RefCountPtr.h already installed
    MEM_SmartPtr.h already installed
====> make all in intern/decimation
hostname: No address associated with name
====> make all in intern/decimation/intern
hostname: No address associated with name
====> make debug in intern/decimation/intern
hostname: No address associated with name
    libdecimation.a already installed
    libdecimation.a already installed
    LOD_decimation.h already installed
====> make all in intern/iksolver
hostname: No address associated with name
====> make all in intern/iksolver/intern
hostname: No address associated with name
====> make debug in intern/iksolver/intern
hostname: No address associated with name
    libiksolver.a already installed
    libiksolver.a already installed
    IK_solver.h already installed
====> make all in intern/bsp
hostname: No address associated with name
====> make all in intern/bsp/intern
hostname: No address associated with name
====> make debug in intern/bsp/intern
hostname: No address associated with name
    libbsp.a already installed
    libbsp.a already installed
    CSG_BooleanOps.h already installed
====> make all in intern/SoundSystem
hostname: No address associated with name
====> make all in intern/SoundSystem/intern
====> make all in intern/SoundSystem/dummy
hostname: No address associated with name
====> make debug in intern/SoundSystem/intern
====> make debug in intern/SoundSystem/dummy
hostname: No address associated with name
    libSoundSystem.a already installed
    libSoundSystem.a already installed
    SND_C-api.h already installed
    SND_CDObject.h already installed
    SND_DependKludge.h already installed
    SND_DeviceManager.h already installed
    SND_IAudioDevice.h already installed
    SND_Object.h already installed
    SND_Scene.h already installed
    SND_SoundListener.h already installed
    SND_SoundObject.h already installed
    SND_Utils.h already installed
    SND_WaveCache.h already installed
    SND_WaveSlot.h already installed
    SoundDefines.h already installed
====> make all in intern/opennl
hostname: No address associated with name
====> make all in intern/opennl/intern
====> make all in intern/opennl/superlu
hostname: No address associated with name
====> make debug in intern/opennl/intern
====> make debug in intern/opennl/superlu
hostname: No address associated with name
    libopennl.a already installed
    libopennl.a already installed
    ONL_opennl.h already installed
    libsuperlu.a already installed
    libsuperlu.a already installed
====> make all in intern/elbeem
hostname: No address associated with name
====> make all in intern/elbeem/intern
hostname: No address associated with name
====> make debug in intern/elbeem/intern
hostname: No address associated with name
    libelbeem.a already installed
    libelbeem.a already installed
    LBM_fluidsim.h already installed
====> make all in intern/boolop
hostname: No address associated with name
====> make all in intern/boolop/intern
hostname: No address associated with name
====> make debug in intern/boolop/intern
hostname: No address associated with name
    libboolop.a already installed
    libboolop.a already installed
    BOP_Interface.h already installed
====> make all in source
hostname: No address associated with name
hostname: No address associated with name
hostname: No address associated with name
****> Make all by aaron@ at 18:16:56 19-Nov-2005 on linux-glibc2.3.5-i386
      NAN_NO_OPENAL=true
hostname: No address associated with name
====> make all in source/creator
====> make all in source/blender
====> make all in source/blender/blenloader
====> make all in source/blender/blenloader/intern
====> make all in source/blender/readblenfile
====> make all in source/blender/readblenfile/intern
====> make all in source/blender/readblenfile/stub
====> make all in source/blender/avi
====> make all in source/blender/avi/intern
====> make all in source/blender/imbuf
====> make all in source/blender/imbuf/intern
====> make all in source/blender/img
====> make all in source/blender/img/intern
====> make all in source/blender/render
====> make all in source/blender/render/intern
====> make all in source/blender/render/intern/source
====> make all in source/blender/radiosity
====> make all in source/blender/radiosity/intern
====> make all in source/blender/radiosity/intern/source
====> make all in source/blender/blenlib
====> make all in source/blender/blenlib/intern
====> make all in source/blender/blenkernel
====> make all in source/blender/blenkernel/intern
====> make all in source/blender/blenkernel/bad_level_call_stubs
====> make all in source/blender/blenpluginapi
====> make all in source/blender/blenpluginapi/intern
====> make all in source/blender/makesdna
====> make all in source/blender/makesdna/intern
====> make all in source/blender/src
====> make publisher subtarget in /home/aaron/dev/blender/blender/source/blender/src
make[4]: Nothing to be done for `lib'.
====> make all in source/blender/renderconverter
====> make all in source/blender/renderconverter/intern
====> make all in source/blender/yafray
====> make all in source/blender/yafray/intern
====> make all in source/blender/python
====> make all in source/blender/python/api2_2x
gcc -c -DGAMEBLENDER=1 -DUSE_SUMO_SOLID -pipe -fPIC  -DNDEBUG -O2 -funsigned-char -fno-strict-aliasing -Wall -Wno-char-subscripts -DMOZ_NOT_NET -I../Physics/common -I../Physics/Dummy -I/usr/X11R6/include -I/home/aaron/dev/blender/blender/../lib/linux-glibc2.3.5-i386/guardedalloc/include -I../../makesdna -I../../blenkernel -I../../blenlib -I../../blenloader -I../../include -I../../render/extern/include -I../../radiosity/extern/include -I/home/aaron/dev/blender/blender/../lib/linux-glibc2.3.5-i386/bmfont/include -I../../imbuf -I/usr/include/python2.3 Armature.c -o /home/aaron/dev/blender/blender/obj/linux-glibc2.3.5-i386/blender/python/Armature.o
In file included from Armature.c:29:
Armature.h:34:20: error: Python.h: No such file or directory
In file included from Armature.c:29:
Armature.h:41: error: syntax error before ‘*’ token
Armature.h:41: warning: type defaults to ‘int’ in declaration of ‘Armature_Init’
Armature.h:41: warning: data definition has no type or storage class
Armature.h:43: error: syntax error before ‘Armature_Type’
Armature.h:43: warning: type defaults to ‘int’ in declaration of ‘Armature_Type’
Armature.h:43: warning: data definition has no type or storage class
Armature.h:44: error: syntax error before ‘BonesDict_Type’
Armature.h:44: warning: type defaults to ‘int’ in declaration of ‘BonesDict_Type’
Armature.h:44: warning: data definition has no type or storage class
Armature.h:48: error: syntax error before ‘PyObject_HEAD’
Armature.h:48: warning: no semicolon at end of struct or union
Armature.h:50: warning: type defaults to ‘int’ in declaration of ‘editBoneDict’
Armature.h:50: warning: data definition has no type or storage class
Armature.h:52: error: syntax error before ‘}’ token
Armature.h:52: warning: type defaults to ‘int’ in declaration of ‘BPy_BonesDict’
Armature.h:52: warning: data definition has no type or storage class
Armature.h:55: error: syntax error before ‘PyObject_HEAD’
Armature.h:55: warning: no semicolon at end of struct or union
Armature.h:57: warning: type defaults to ‘int’ in declaration of ‘Bones’
Armature.h:57: warning: data definition has no type or storage class
Armature.h:58: error: syntax error before ‘}’ token
Armature.h:58: warning: type defaults to ‘int’ in declaration of ‘BPy_Armature’
Armature.h:58: warning: data definition has no type or storage class
Armature.h:61: error: syntax error before ‘*’ token
Armature.h:61: warning: type defaults to ‘int’ in declaration of ‘PyArmature_FromArmature’
Armature.h:61: warning: data definition has no type or storage class
Armature.h:62: error: syntax error before ‘*’ token
In file included from Armature.c:40:
Bone.h:41: error: syntax error before ‘EditBone_Type’
Bone.h:41: warning: type defaults to ‘int’ in declaration of ‘EditBone_Type’
Bone.h:41: warning: data definition has no type or storage class
Bone.h:42: error: syntax error before ‘Bone_Type’
Bone.h:42: warning: type defaults to ‘int’ in declaration of ‘Bone_Type’
Bone.h:42: warning: data definition has no type or storage class
Bone.h:45: error: syntax error before ‘PyObject_HEAD’
Bone.h:45: warning: no semicolon at end of struct or union
Bone.h:47: warning: type defaults to ‘int’ in declaration of ‘BPy_Bone’
Bone.h:47: warning: data definition has no type or storage class
Bone.h:50: error: syntax error before ‘PyObject_HEAD’
Bone.h:50: warning: no semicolon at end of struct or union
Bone.h:68: error: syntax error before ‘}’ token
Bone.h:68: warning: type defaults to ‘int’ in declaration of ‘BPy_EditBone’
Bone.h:68: warning: data definition has no type or storage class
Bone.h:70: error: syntax error before ‘*’ token
Bone.h:70: warning: type defaults to ‘int’ in declaration of ‘PyBone_FromBone’
Bone.h:70: warning: data definition has no type or storage class
Bone.h:71: error: syntax error before ‘*’ token
In file included from Armature.c:40:
Bone.h:144:3: warning: no newline at end of file
In file included from Armature.c:41:
NLA.h:40: error: syntax error before ‘*’ token
NLA.h:40: warning: type defaults to ‘int’ in declaration of ‘NLA_Init’
NLA.h:40: warning: data definition has no type or storage class
NLA.h:44: error: syntax error before ‘PyObject_HEAD’
NLA.h:44: warning: no semicolon at end of struct or union
NLA.h:46: warning: type defaults to ‘int’ in declaration of ‘BPy_Action’
NLA.h:46: warning: data definition has no type or storage class
NLA.h:48: error: syntax error before ‘*’ token
NLA.h:48: warning: type defaults to ‘int’ in declaration of ‘Action_CreatePyObject’
NLA.h:48: warning: data definition has no type or storage class
NLA.h:49: error: syntax error before ‘*’ token
NLA.h:50: error: syntax error before ‘*’ token
In file included from gen_utils.h:41,
                 from Armature.c:42:
constant.h:41: error: syntax error before ‘constant_Type’
constant.h:41: warning: type defaults to ‘int’ in declaration of ‘constant_Type’
constant.h:41: warning: data definition has no type or storage class
constant.h:44: error: syntax error before ‘PyObject_HEAD’
constant.h:44: warning: no semicolon at end of struct or union
constant.h:46: warning: type defaults to ‘int’ in declaration of ‘BPy_constant’
constant.h:46: warning: data definition has no type or storage class
constant.h:48: error: syntax error before ‘*’ token
constant.h:48: warning: type defaults to ‘int’ in declaration of ‘PyConstant_New’
constant.h:48: warning: data definition has no type or storage class
constant.h:49: error: syntax error before ‘*’ token
constant.h:50: error: syntax error before ‘*’ token
constant.h:50: warning: type defaults to ‘int’ in declaration of ‘PyConstant_NewInt’
constant.h:50: warning: data definition has no type or storage class
constant.h:51: error: syntax error before ‘*’ token
constant.h:51: warning: type defaults to ‘int’ in declaration of ‘PyConstant_NewString’
constant.h:51: warning: data definition has no type or storage class
In file included from Armature.c:42:
gen_utils.h:56: error: syntax error before ‘*’ token
gen_utils.h:56: warning: type defaults to ‘int’ in declaration of ‘EXPP_GetModuleConstant’
gen_utils.h:56: warning: data definition has no type or storage class
gen_utils.h:62: error: syntax error before ‘*’ token
gen_utils.h:62: error: syntax error before ‘*’ token
gen_utils.h:62: warning: type defaults to ‘int’ in declaration of ‘PythonReturnErrorObject’
gen_utils.h:62: warning: data definition has no type or storage class
gen_utils.h:63: error: syntax error before ‘*’ token
gen_utils.h:63: error: syntax error before ‘*’ token
gen_utils.h:63: warning: type defaults to ‘int’ in declaration of ‘PythonIncRef’
gen_utils.h:63: warning: data definition has no type or storage class
gen_utils.h:70: error: syntax error before ‘*’ token
gen_utils.h:71: error: syntax error before ‘*’ token
gen_utils.h:72: error: syntax error before ‘*’ token
gen_utils.h:73: error: syntax error before ‘*’ token
gen_utils.h:74: error: syntax error before ‘*’ token
gen_utils.h:74: error: syntax error before ‘*’ token
gen_utils.h:74: warning: type defaults to ‘int’ in declaration of ‘EXPP_incr_ret’
gen_utils.h:74: warning: data definition has no type or storage class
gen_utils.h:75: error: syntax error before ‘*’ token
gen_utils.h:75: warning: type defaults to ‘int’ in declaration of ‘EXPP_incr_ret_True’
gen_utils.h:75: warning: data definition has no type or storage class
gen_utils.h:76: error: syntax error before ‘*’ token
gen_utils.h:76: warning: type defaults to ‘int’ in declaration of ‘EXPP_incr_ret_False’
gen_utils.h:76: warning: data definition has no type or storage class
gen_utils.h:77: error: syntax error before ‘*’ token
gen_utils.h:77: error: syntax error before ‘*’ token
gen_utils.h:77: warning: type defaults to ‘int’ in declaration of ‘EXPP_ReturnPyObjError’
gen_utils.h:77: warning: data definition has no type or storage class
gen_utils.h:78: error: syntax error before ‘*’ token
gen_utils.h:80: error: syntax error before ‘*’ token
gen_utils.h:80: error: syntax error before ‘*’ token
gen_utils.h:80: warning: type defaults to ‘int’ in declaration of ‘EXPP_objError’
gen_utils.h:80: warning: data definition has no type or storage class
gen_utils.h:81: error: syntax error before ‘*’ token
gen_utils.h:83: error: syntax error before ‘*’ token
gen_utils.h:84: error: syntax error before ‘*’ token
gen_utils.h:84: error: syntax error before ‘*’ token
gen_utils.h:84: warning: type defaults to ‘int’ in declaration of ‘EXPP_tuple_repr’
gen_utils.h:84: warning: data definition has no type or storage class
gen_utils.h:104: error: syntax error before ‘*’ token
gen_utils.h:106: error: syntax error before ‘*’ token
gen_utils.h:108: error: syntax error before ‘*’ token
gen_utils.h:110: error: syntax error before ‘*’ token
gen_utils.h:115: error: syntax error before ‘*’ token
gen_utils.h:120: error: syntax error before ‘*’ token
gen_utils.h:120: warning: type defaults to ‘int’ in declaration of ‘EXPP_getBitfield’
gen_utils.h:120: warning: data definition has no type or storage class
gen_utils.h:121: error: syntax error before ‘*’ token
gen_utils.h:128: error: syntax error before ‘*’ token
gen_utils.h:128: error: syntax error before ‘*’ token
gen_utils.h:129: warning: type defaults to ‘int’ in declaration of ‘EXPP_setterWrapper’
gen_utils.h:129: warning: data definition has no type or storage class
gen_utils.h:131: error: syntax error before ‘*’ token
gen_utils.h:131: error: syntax error before ‘*’ token
gen_utils.h:132: warning: type defaults to ‘int’ in declaration of ‘EXPP_setterWrapperTuple’
gen_utils.h:132: warning: data definition has no type or storage class
gen_utils.h:135: error: syntax error before ‘*’ token
gen_utils.h:135: error: syntax error before ‘PyObject’
gen_utils.h:135: warning: type defaults to ‘int’ in declaration of ‘EXPP_getScriptLinks’
gen_utils.h:135: warning: data definition has no type or storage class
gen_utils.h:136: error: syntax error before ‘*’ token
gen_utils.h:136: error: syntax error before ‘PyObject’
gen_utils.h:136: warning: type defaults to ‘int’ in declaration of ‘EXPP_addScriptLink’
gen_utils.h:136: warning: data definition has no type or storage class
gen_utils.h:137: error: syntax error before ‘*’ token
gen_utils.h:137: error: syntax error before ‘PyObject’
gen_utils.h:137: warning: type defaults to ‘int’ in declaration of ‘EXPP_clearScriptLinks’
gen_utils.h:137: warning: data definition has no type or storage class
Armature.c:71: error: syntax error before ‘*’ token
Armature.c:71: error: syntax error before ‘*’ token
Armature.c:72: warning: return type defaults to ‘int’
Armature.c: In function ‘BonesDict_items’:
Armature.c:73: error: ‘self’ undeclared (first use in this function)
Armature.c:73: error: (Each undeclared identifier is reported only once
Armature.c:73: error: for each function it appears in.)
Armature.c:74: warning: implicit declaration of function ‘PyDict_Items’
Armature.c:74: warning: return makes pointer from integer without a cast
Armature.c:76: warning: return makes pointer from integer without a cast
Armature.c: At top level:
Armature.c:81: error: syntax error before ‘*’ token
Armature.c:81: error: syntax error before ‘*’ token
Armature.c:82: warning: return type defaults to ‘int’
Armature.c: In function ‘BonesDict_keys’:
Armature.c:83: error: ‘self’ undeclared (first use in this function)
Armature.c:84: warning: implicit declaration of function ‘PyDict_Keys’
Armature.c:84: warning: return makes pointer from integer without a cast
Armature.c:86: warning: return makes pointer from integer without a cast
Armature.c: At top level:
Armature.c:91: error: syntax error before ‘*’ token
Armature.c:91: error: syntax error before ‘*’ token
Armature.c:92: warning: return type defaults to ‘int’
Armature.c: In function ‘BonesDict_values’:
Armature.c:93: error: ‘self’ undeclared (first use in this function)
Armature.c:94: warning: implicit declaration of function ‘PyDict_Values’
Armature.c:94: warning: return makes pointer from integer without a cast
Armature.c:96: warning: return makes pointer from integer without a cast
Armature.c: At top level:
Armature.c:108: error: syntax error before ‘BPy_BonesDict_methods’
Armature.c:108: warning: type defaults to ‘int’ in declaration of ‘BPy_BonesDict_methods’
Armature.c:109: warning: braces around scalar initializer
Armature.c:109: warning: (near initialization for ‘BPy_BonesDict_methods[0]’)
Armature.c:109: warning: initialization makes integer from pointer without a cast
Armature.c:109: error: ‘PyCFunction’ undeclared here (not in a function)
Armature.c:109: warning: excess elements in scalar initializer
Armature.c:109: warning: (near initialization for ‘BPy_BonesDict_methods[0]’)
Armature.c:109: error: syntax error before ‘BonesDict_items’
Armature.c:109: error: ‘METH_NOARGS’ undeclared here (not in a function)
Armature.c:109: warning: excess elements in scalar initializer
Armature.c:109: warning: (near initialization for ‘BPy_BonesDict_methods[0]’)
Armature.c:110: warning: excess elements in scalar initializer
Armature.c:110: warning: (near initialization for ‘BPy_BonesDict_methods[0]’)
Armature.c:111: warning: braces around scalar initializer
Armature.c:111: warning: (near initialization for ‘BPy_BonesDict_methods[1]’)
Armature.c:111: warning: initialization makes integer from pointer without a cast
Armature.c:111: warning: excess elements in scalar initializer
Armature.c:111: warning: (near initialization for ‘BPy_BonesDict_methods[1]’)
Armature.c:111: error: syntax error before ‘BonesDict_keys’
Armature.c:111: warning: excess elements in scalar initializer
Armature.c:111: warning: (near initialization for ‘BPy_BonesDict_methods[1]’)
Armature.c:112: warning: excess elements in scalar initializer
Armature.c:112: warning: (near initialization for ‘BPy_BonesDict_methods[1]’)
Armature.c:113: warning: braces around scalar initializer
Armature.c:113: warning: (near initialization for ‘BPy_BonesDict_methods[2]’)
Armature.c:113: warning: initialization makes integer from pointer without a cast
Armature.c:113: warning: excess elements in scalar initializer
Armature.c:113: warning: (near initialization for ‘BPy_BonesDict_methods[2]’)
Armature.c:113: error: syntax error before ‘BonesDict_values’
Armature.c:113: warning: excess elements in scalar initializer
Armature.c:113: warning: (near initialization for ‘BPy_BonesDict_methods[2]’)
Armature.c:114: warning: excess elements in scalar initializer
Armature.c:114: warning: (near initialization for ‘BPy_BonesDict_methods[2]’)
Armature.c:115: warning: braces around scalar initializer
Armature.c:115: warning: (near initialization for ‘BPy_BonesDict_methods[3]’)
Armature.c:115: warning: initialization makes integer from pointer without a cast
Armature.c:116: warning: data definition has no type or storage class
Armature.c:120: error: syntax error before ‘*’ token
Armature.c:120: error: syntax error before ‘*’ token
Armature.c:121: warning: return type defaults to ‘int’
Armature.c: In function ‘BonesDict_new’:
Armature.c:122: error: ‘py_BonesDict’ undeclared (first use in this function)
Armature.c:124: error: syntax error before ‘)’ token
Armature.c:128: warning: implicit declaration of function ‘PyDict_New’
Armature.c:138: error: ‘PyObject’ undeclared (first use in this function)
Armature.c:138: error: syntax error before ‘)’ token
Armature.c:141: error: ‘PyExc_RuntimeError’ undeclared (first use in this function)
Armature.c: At top level:
Armature.c:146: error: syntax error before ‘*’ token
Armature.c:146: error: syntax error before ‘*’ token
Armature.c:147: warning: return type defaults to ‘int’
Armature.c: In function ‘BonesDict_repr’:
Armature.c:149: error: ‘PyObject’ undeclared (first use in this function)
Armature.c:149: error: ‘key’ undeclared (first use in this function)
Armature.c:149: error: ‘value’ undeclared (first use in this function)
Armature.c:149: warning: left-hand operand of comma expression has no effect
Armature.c:149: warning: statement with no effect
Armature.c:154: warning: implicit declaration of function ‘strcat’
Armature.c:154: warning: incompatible implicit declaration of built-in function ‘strcat’
Armature.c:155: error: ‘self’ undeclared (first use in this function)
Armature.c:156: warning: implicit declaration of function ‘PyDict_Next’
Armature.c:157: warning: implicit declaration of function ‘PyString_AsString’
Armature.c:158: warning: format ‘%s’ expects type ‘char *’, but argument 3 has type ‘int’
Armature.c:158: warning: format ‘%s’ expects type ‘char *’, but argument 4 has type ‘int’
Armature.c:164: warning: format ‘%s’ expects type ‘char *’, but argument 3 has type ‘int’
Armature.c:164: warning: format ‘%s’ expects type ‘char *’, but argument 4 has type ‘int’
Armature.c:170: warning: implicit declaration of function ‘PyString_FromString’
Armature.c:170: warning: return makes pointer from integer without a cast
Armature.c: At top level:
Armature.c:175: error: syntax error before ‘*’ token
Armature.c: In function ‘BonesDict_dealloc’:
Armature.c:177: warning: implicit declaration of function ‘Py_DECREF’
Armature.c:177: error: ‘self’ undeclared (first use in this function)
Armature.c:179: error: ‘PyObject’ undeclared (first use in this function)
Armature.c:179: error: syntax error before ‘)’ token
Armature.c:179: error: syntax error before ‘)’ token
Armature.c: At top level:
Armature.c:184: error: syntax error before ‘*’ token
Armature.c: In function ‘BonesDict_len’:
Armature.c:186: error: ‘self’ undeclared (first use in this function)
Armature.c:187: warning: implicit declaration of function ‘PyDict_Size’
Armature.c: At top level:
Armature.c:194: error: syntax error before ‘*’ token
Armature.c:194: error: syntax error before ‘*’ token
Armature.c:195: warning: return type defaults to ‘int’
Armature.c: In function ‘BonesDict_GetItem’:
Armature.c:196: error: ‘PyObject’ undeclared (first use in this function)
Armature.c:196: error: ‘value’ undeclared (first use in this function)
Armature.c:198: error: ‘self’ undeclared (first use in this function)
Armature.c:199: warning: implicit declaration of function ‘PyDict_GetItem’
Armature.c:199: error: ‘key’ undeclared (first use in this function)
Armature.c:204: error: ‘Py_None’ undeclared (first use in this function)
Armature.c: At top level:
Armature.c:210: error: syntax error before ‘*’ token
Armature.c: In function ‘BonesDict_SetItem’:
Armature.c:216: error: ‘key’ undeclared (first use in this function)
Armature.c:216: warning: implicit declaration of function ‘PyString_Check’
Armature.c:217: warning: assignment makes pointer from integer without a cast
Armature.c:223: error: ‘value’ undeclared (first use in this function)
Armature.c:223: warning: implicit declaration of function ‘PyDict_Check’
Armature.c:224: warning: implicit declaration of function ‘PyArg_ParseTupleAndKeywords’
Armature.c:224: warning: implicit declaration of function ‘Py_BuildValue’
Armature.c:233: error: ‘PyExc_AttributeError’ undeclared (first use in this function)
Armature.c: At top level:
Armature.c:238: error: syntax error before ‘BonesDict_MapMethods’
Armature.c:238: warning: type defaults to ‘int’ in declaration of ‘BonesDict_MapMethods’
Armature.c:239: error: ‘inquiry’ undeclared here (not in a function)
Armature.c:239: error: syntax error before ‘BonesDict_len’
Armature.c:240: error: ‘binaryfunc’ undeclared here (not in a function)
Armature.c:240: warning: excess elements in scalar initializer
Armature.c:240: warning: (near initialization for ‘BonesDict_MapMethods’)
Armature.c:240: error: syntax error before ‘BonesDict_GetItem’
Armature.c:241: error: ‘objobjargproc’ undeclared here (not in a function)
Armature.c:241: warning: excess elements in scalar initializer
Armature.c:241: warning: (near initialization for ‘BonesDict_MapMethods’)
Armature.c:241: error: syntax error before ‘BonesDict_SetItem’
Armature.c:242: warning: data definition has no type or storage class
Armature.c:244: error: syntax error before ‘BonesDict_Type’
Armature.c:244: warning: type defaults to ‘int’ in declaration of ‘BonesDict_Type’
Armature.c:245: warning: implicit declaration of function ‘PyObject_HEAD_INIT’
Armature.c:246: error: initializer element is not constant
Armature.c:246: error: (near initialization for ‘BonesDict_Type’)
Armature.c:246: error: syntax error before numeric constant
Armature.c:247: warning: excess elements in scalar initializer
Armature.c:247: warning: (near initialization for ‘BonesDict_Type’)
Armature.c:248: warning: excess elements in scalar initializer
Armature.c:248: warning: (near initialization for ‘BonesDict_Type’)
Armature.c:249: warning: excess elements in scalar initializer
Armature.c:249: warning: (near initialization for ‘BonesDict_Type’)
Armature.c:250: error: ‘destructor’ undeclared here (not in a function)
Armature.c:250: warning: excess elements in scalar initializer
Armature.c:250: warning: (near initialization for ‘BonesDict_Type’)
Armature.c:250: error: syntax error before ‘BonesDict_dealloc’
Armature.c:251: warning: excess elements in scalar initializer
Armature.c:251: warning: (near initialization for ‘BonesDict_Type’)
Armature.c:252: warning: excess elements in scalar initializer
Armature.c:252: warning: (near initialization for ‘BonesDict_Type’)
Armature.c:253: warning: excess elements in scalar initializer
Armature.c:253: warning: (near initialization for ‘BonesDict_Type’)
Armature.c:254: warning: excess elements in scalar initializer
Armature.c:254: warning: (near initialization for ‘BonesDict_Type’)
Armature.c:255: error: ‘reprfunc’ undeclared here (not in a function)
Armature.c:255: warning: excess elements in scalar initializer
Armature.c:255: warning: (near initialization for ‘BonesDict_Type’)
Armature.c:255: error: syntax error before ‘BonesDict_repr’
Armature.c:256: warning: excess elements in scalar initializer
Armature.c:256: warning: (near initialization for ‘BonesDict_Type’)
Armature.c:257: warning: excess elements in scalar initializer
Armature.c:257: warning: (near initialization for ‘BonesDict_Type’)
Armature.c:258: warning: excess elements in scalar initializer
Armature.c:258: warning: (near initialization for ‘BonesDict_Type’)
Armature.c:259: warning: excess elements in scalar initializer
Armature.c:259: warning: (near initialization for ‘BonesDict_Type’)
Armature.c:260: warning: excess elements in scalar initializer
Armature.c:260: warning: (near initialization for ‘BonesDict_Type’)
Armature.c:261: warning: excess elements in scalar initializer
Armature.c:261: warning: (near initialization for ‘BonesDict_Type’)
Armature.c:262: warning: excess elements in scalar initializer
Armature.c:262: warning: (near initialization for ‘BonesDict_Type’)
Armature.c:263: warning: excess elements in scalar initializer
Armature.c:263: warning: (near initialization for ‘BonesDict_Type’)
Armature.c:264: warning: excess elements in scalar initializer
Armature.c:264: warning: (near initialization for ‘BonesDict_Type’)
Armature.c:265: error: ‘Py_TPFLAGS_DEFAULT’ undeclared here (not in a function)
Armature.c:265: warning: excess elements in scalar initializer
Armature.c:265: warning: (near initialization for ‘BonesDict_Type’)
Armature.c:266: warning: excess elements in scalar initializer
Armature.c:266: warning: (near initialization for ‘BonesDict_Type’)
Armature.c:267: warning: excess elements in scalar initializer
Armature.c:267: warning: (near initialization for ‘BonesDict_Type’)
Armature.c:268: warning: excess elements in scalar initializer
Armature.c:268: warning: (near initialization for ‘BonesDict_Type’)
Armature.c:269: warning: excess elements in scalar initializer
Armature.c:269: warning: (near initialization for ‘BonesDict_Type’)
Armature.c:270: warning: excess elements in scalar initializer
Armature.c:270: warning: (near initialization for ‘BonesDict_Type’)
Armature.c:271: warning: excess elements in scalar initializer
Armature.c:271: warning: (near initialization for ‘BonesDict_Type’)
Armature.c:272: warning: excess elements in scalar initializer
Armature.c:272: warning: (near initialization for ‘BonesDict_Type’)
Armature.c:273: warning: excess elements in scalar initializer
Armature.c:273: warning: (near initialization for ‘BonesDict_Type’)
Armature.c:274: warning: excess elements in scalar initializer
Armature.c:274: warning: (near initialization for ‘BonesDict_Type’)
Armature.c:275: warning: excess elements in scalar initializer
Armature.c:275: warning: (near initialization for ‘BonesDict_Type’)
Armature.c:276: warning: excess elements in scalar initializer
Armature.c:276: warning: (near initialization for ‘BonesDict_Type’)
Armature.c:277: warning: excess elements in scalar initializer
Armature.c:277: warning: (near initialization for ‘BonesDict_Type’)
Armature.c:278: warning: excess elements in scalar initializer
Armature.c:278: warning: (near initialization for ‘BonesDict_Type’)
Armature.c:279: warning: excess elements in scalar initializer
Armature.c:279: warning: (near initialization for ‘BonesDict_Type’)
Armature.c:280: warning: excess elements in scalar initializer
Armature.c:280: warning: (near initialization for ‘BonesDict_Type’)
Armature.c:281: warning: excess elements in scalar initializer
Armature.c:281: warning: (near initialization for ‘BonesDict_Type’)
Armature.c:282: warning: excess elements in scalar initializer
Armature.c:282: warning: (near initialization for ‘BonesDict_Type’)
Armature.c:283: error: ‘newfunc’ undeclared here (not in a function)
Armature.c:283: warning: excess elements in scalar initializer
Armature.c:283: warning: (near initialization for ‘BonesDict_Type’)
Armature.c:283: error: syntax error before ‘BonesDict_new’
Armature.c:284: warning: excess elements in scalar initializer
Armature.c:284: warning: (near initialization for ‘BonesDict_Type’)
Armature.c:285: warning: excess elements in scalar initializer
Armature.c:285: warning: (near initialization for ‘BonesDict_Type’)
Armature.c:286: warning: excess elements in scalar initializer
Armature.c:286: warning: (near initialization for ‘BonesDict_Type’)
Armature.c:287: warning: excess elements in scalar initializer
Armature.c:287: warning: (near initialization for ‘BonesDict_Type’)
Armature.c:288: warning: excess elements in scalar initializer
Armature.c:288: warning: (near initialization for ‘BonesDict_Type’)
Armature.c:289: warning: excess elements in scalar initializer
Armature.c:289: warning: (near initialization for ‘BonesDict_Type’)
Armature.c:290: warning: excess elements in scalar initializer
Armature.c:290: warning: (near initialization for ‘BonesDict_Type’)
Armature.c:292: warning: excess elements in scalar initializer
Armature.c:292: warning: (near initialization for ‘BonesDict_Type’)
Armature.c:292: warning: data definition has no type or storage class
Armature.c:294: error: syntax error before ‘*’ token
Armature.c: In function ‘BonesDict_Init’:
Armature.c:296: error: ‘PyObject’ undeclared (first use in this function)
Armature.c:296: error: ‘py_bone’ undeclared (first use in this function)
Armature.c:298: error: ‘bones’ undeclared (first use in this function)
Armature.c:303: warning: implicit declaration of function ‘PyDict_SetItem’
Armature.c:303: error: ‘dictionary’ undeclared (first use in this function)
Armature.c:312: error: ‘PyExc_RuntimeError’ undeclared (first use in this function)
Armature.c: At top level:
Armature.c:324: error: syntax error before ‘*’ token
Armature.c: In function ‘PyArmature_InitEditBoneDict’:
Armature.c:327: error: ‘PyObject’ undeclared (first use in this function)
Armature.c:327: error: ‘args’ undeclared (first use in this function)
Armature.c:327: error: ‘py_editBone’ undeclared (first use in this function)
Armature.c:327: warning: left-hand operand of comma expression has no effect
Armature.c:327: error: ‘py_bone’ undeclared (first use in this function)
Armature.c:327: warning: left-hand operand of comma expression has no effect
Armature.c:327: warning: statement with no effect
Armature.c:329: error: ‘branch’ undeclared (first use in this function)
Armature.c:338: error: request for member ‘tp_new’ in something not a structure or union
Armature.c:343: warning: implicit declaration of function ‘PyDict_SetItemString’
Armature.c:343: error: ‘dictionary’ undeclared (first use in this function)
Armature.c:353: error: ‘PyExc_RuntimeError’ undeclared (first use in this function)
Armature.c: At top level:
Armature.c:358: error: syntax error before ‘*’ token
Armature.c:358: error: syntax error before ‘*’ token
Armature.c:359: warning: return type defaults to ‘int’
Armature.c: In function ‘Armature_makeEditable’:
Armature.c:360: error: syntax error before ‘)’ token
Armature.c:361: error: ‘self’ undeclared (first use in this function)
Armature.c:364: error: syntax error before ‘)’ token
Armature.c:365: error: ‘Py_None’ undeclared (first use in this function)
Armature.c: At top level:
Armature.c:368: error: syntax error before ‘PyObject’
Armature.c: In function ‘PyArmature_FixRolls’:
Armature.c:372: error: ‘py_editBone’ undeclared (first use in this function)
Armature.c:376: error: ‘branch’ undeclared (first use in this function)
Armature.c:380: warning: implicit declaration of function ‘PySequence_Contains’
Armature.c:380: error: ‘dictionary’ undeclared (first use in this function)
Armature.c:383: error: syntax error before ‘)’ token
Armature.c:391: warning: implicit declaration of function ‘atan’
Armature.c:391: warning: incompatible implicit declaration of built-in function ‘atan’
Armature.c: At top level:
Armature.c:406: error: syntax error before ‘*’ token
Armature.c:406: error: syntax error before ‘*’ token
Armature.c:407: warning: return type defaults to ‘int’
Armature.c: In function ‘EditBoneDict_CheckForKey’:
Armature.c:408: error: ‘editbone’ undeclared (first use in this function)
Armature.c:409: error: ‘PyObject’ undeclared (first use in this function)
Armature.c:409: error: ‘value’ undeclared (first use in this function)
Armature.c:409: error: ‘key’ undeclared (first use in this function)
Armature.c:409: warning: left-hand operand of comma expression has no effect
Armature.c:409: warning: statement with no effect
Armature.c:412: error: ‘dictionary’ undeclared (first use in this function)
Armature.c:413: error: syntax error before ‘)’ token
Armature.c:414: warning: implicit declaration of function ‘strcmp’
Armature.c:415: warning: implicit declaration of function ‘Py_INCREF’
Armature.c: At top level:
Armature.c:422: error: syntax error before ‘*’ token
Armature.c:422: error: syntax error before ‘*’ token
Armature.c:423: warning: return type defaults to ‘int’
Armature.c: In function ‘Armature_saveChanges’:
Armature.c:426: error: invalid operands to binary *
Armature.c:426: error: ‘editbone’ undeclared (first use in this function)
Armature.c:426: warning: left-hand operand of comma expression has no effect
Armature.c:426: warning: statement with no effect
Armature.c:429: error: ‘PyObject’ undeclared (first use in this function)
Armature.c:429: error: ‘key’ undeclared (first use in this function)
Armature.c:429: error: ‘value’ undeclared (first use in this function)
Armature.c:429: warning: left-hand operand of comma expression has no effect
Armature.c:429: warning: statement with no effect
Armature.c:433: error: ‘self’ undeclared (first use in this function)
Armature.c:436: error: syntax error before ‘)’ token
Armature.c:438: error: syntax error before ‘)’ token
Armature.c:442: warning: implicit declaration of function ‘strcpy’
Armature.c:442: warning: incompatible implicit declaration of built-in function ‘strcpy’
Armature.c:443: warning: implicit declaration of function ‘memcpy’
Armature.c:443: warning: incompatible implicit declaration of built-in function ‘memcpy’
Armature.c:461: error: syntax error before ‘)’ token
Armature.c:464: error: syntax error before ‘)’ token
Armature.c:468: error: syntax error before ‘)’ token
Armature.c:472: error: request for member ‘temp’ in something not a structure or union
Armature.c:473: error: request for member ‘temp’ in something not a structure or union
Armature.c:475: error: request for member ‘tail’ in something not a structure or union
Armature.c:475: error: request for member ‘head’ in something not a structure or union
Armature.c:476: error: request for member ‘roll’ in something not a structure or union
Armature.c:481: error: request for member ‘tail’ in something not a structure or union
Armature.c:482: error: request for member ‘tail’ in something not a structure or union
Armature.c:490: error: incompatible types in assignment
Armature.c:499: error: syntax error before ‘)’ token
Armature.c:510: warning: implicit declaration of function ‘PyDict_Clear’
Armature.c:510: error: syntax error before ‘)’ token
Armature.c:511: error: syntax error before ‘)’ token
Armature.c:514: error: syntax error before ‘)’ token
Armature.c:515: error: syntax error before ‘)’ token
Armature.c:519: error: ‘Py_None’ undeclared (first use in this function)
Armature.c: At top level:
Armature.c:524: error: syntax error before ‘*’ token
Armature.c:524: error: syntax error before ‘*’ token
Armature.c:525: warning: return type defaults to ‘int’
Armature.c: In function ‘Armature_getName’:
Armature.c:526: error: ‘self’ undeclared (first use in this function)
Armature.c:526: warning: return makes pointer from integer without a cast
Armature.c: At top level:
Armature.c:530: error: syntax error before ‘*’ token
Armature.c: In function ‘Armature_setName’:
Armature.c:535: error: ‘value’ undeclared (first use in this function)
Armature.c:537: warning: assignment makes pointer from integer without a cast
Armature.c:538: warning: implicit declaration of function ‘PyOS_snprintf’
Armature.c:539: error: ‘self’ undeclared (first use in this function)
Armature.c:546: error: ‘PyExc_AttributeError’ undeclared (first use in this function)
Armature.c: At top level:
Armature.c:551: error: syntax error before ‘*’ token
Armature.c:551: error: syntax error before ‘*’ token
Armature.c:552: warning: return type defaults to ‘int’
Armature.c: In function ‘Armature_getBoneDict’:
Armature.c:553: error: ‘self’ undeclared (first use in this function)
Armature.c: At top level:
Armature.c:559: error: syntax error before ‘*’ token
Armature.c: In function ‘Armature_setBoneDict’:
Armature.c:564: error: ‘PyExc_AttributeError’ undeclared (first use in this function)
Armature.c: At top level:
Armature.c:574: error: syntax error before ‘BPy_Armature_methods’
Armature.c:574: warning: type defaults to ‘int’ in declaration of ‘BPy_Armature_methods’
Armature.c:575: warning: braces around scalar initializer
Armature.c:575: warning: (near initialization for ‘BPy_Armature_methods[0]’)
Armature.c:575: warning: initialization makes integer from pointer without a cast
Armature.c:575: warning: excess elements in scalar initializer
Armature.c:575: warning: (near initialization for ‘BPy_Armature_methods[0]’)
Armature.c:575: error: syntax error before ‘Armature_makeEditable’
Armature.c:575: warning: excess elements in scalar initializer
Armature.c:575: warning: (near initialization for ‘BPy_Armature_methods[0]’)
Armature.c:576: warning: excess elements in scalar initializer
Armature.c:576: warning: (near initialization for ‘BPy_Armature_methods[0]’)
Armature.c:577: warning: braces around scalar initializer
Armature.c:577: warning: (near initialization for ‘BPy_Armature_methods[1]’)
Armature.c:577: warning: initialization makes integer from pointer without a cast
Armature.c:577: warning: excess elements in scalar initializer
Armature.c:577: warning: (near initialization for ‘BPy_Armature_methods[1]’)
Armature.c:577: error: syntax error before ‘Armature_saveChanges’
Armature.c:577: warning: excess elements in scalar initializer
Armature.c:577: warning: (near initialization for ‘BPy_Armature_methods[1]’)
Armature.c:578: warning: excess elements in scalar initializer
Armature.c:578: warning: (near initialization for ‘BPy_Armature_methods[1]’)
Armature.c:579: warning: braces around scalar initializer
Armature.c:579: warning: (near initialization for ‘BPy_Armature_methods[2]’)
Armature.c:579: warning: initialization makes integer from pointer without a cast
Armature.c:580: warning: data definition has no type or storage class
Armature.c:584: error: syntax error before ‘BPy_Armature_getset’
Armature.c:584: warning: type defaults to ‘int’ in declaration of ‘BPy_Armature_getset’
Armature.c:585: warning: braces around scalar initializer
Armature.c:585: warning: (near initialization for ‘BPy_Armature_getset[0]’)
Armature.c:585: warning: initialization makes integer from pointer without a cast
Armature.c:585: error: ‘getter’ undeclared here (not in a function)
Armature.c:585: warning: excess elements in scalar initializer
Armature.c:585: warning: (near initialization for ‘BPy_Armature_getset[0]’)
Armature.c:585: error: syntax error before ‘Armature_getName’
Armature.c:585: error: ‘setter’ undeclared here (not in a function)
Armature.c:585: warning: excess elements in scalar initializer
Armature.c:585: warning: (near initialization for ‘BPy_Armature_getset[0]’)
Armature.c:585: error: syntax error before ‘Armature_setName’
Armature.c:586: warning: excess elements in scalar initializer
Armature.c:586: warning: (near initialization for ‘BPy_Armature_getset[0]’)
Armature.c:586: warning: excess elements in scalar initializer
Armature.c:586: warning: (near initialization for ‘BPy_Armature_getset[0]’)
Armature.c:587: warning: braces around scalar initializer
Armature.c:587: warning: (near initialization for ‘BPy_Armature_getset[1]’)
Armature.c:587: warning: initialization makes integer from pointer without a cast
Armature.c:587: warning: excess elements in scalar initializer
Armature.c:587: warning: (near initialization for ‘BPy_Armature_getset[1]’)
Armature.c:587: error: syntax error before ‘Armature_getBoneDict’
Armature.c:587: warning: excess elements in scalar initializer
Armature.c:587: warning: (near initialization for ‘BPy_Armature_getset[1]’)
Armature.c:587: error: syntax error before ‘Armature_setBoneDict’
Armature.c:588: warning: excess elements in scalar initializer
Armature.c:588: warning: (near initialization for ‘BPy_Armature_getset[1]’)
Armature.c:588: warning: excess elements in scalar initializer
Armature.c:588: warning: (near initialization for ‘BPy_Armature_getset[1]’)
Armature.c:589: warning: braces around scalar initializer
Armature.c:589: warning: (near initialization for ‘BPy_Armature_getset[2]’)
Armature.c:589: warning: initialization makes integer from pointer without a cast
Armature.c:590: warning: data definition has no type or storage class
Armature.c:594: error: syntax error before ‘*’ token
Armature.c:594: error: syntax error before ‘*’ token
Armature.c:595: warning: return type defaults to ‘int’
Armature.c: In function ‘Armature_new’:
Armature.c:596: error: ‘py_armature’ undeclared (first use in this function)
Armature.c:604: error: syntax error before ‘)’ token
Armature.c:614: error: syntax error before ‘)’ token
Armature.c:620: error: ‘PyObject’ undeclared (first use in this function)
Armature.c:620: error: syntax error before ‘)’ token
Armature.c:623: error: ‘PyExc_RuntimeError’ undeclared (first use in this function)
Armature.c: At top level:
Armature.c:630: error: syntax error before ‘*’ token
Armature.c: In function ‘Armature_init’:
Armature.c:636: error: ‘args’ undeclared (first use in this function)
Armature.c:636: error: ‘kwds’ undeclared (first use in this function)
Armature.c:643: error: ‘self’ undeclared (first use in this function)
Armature.c:649: error: ‘PyExc_AttributeError’ undeclared (first use in this function)
Armature.c: At top level:
Armature.c:655: error: syntax error before ‘*’ token
Armature.c:655: error: syntax error before ‘*’ token
Armature.c:656: warning: return type defaults to ‘int’
Armature.c: In function ‘Armature_richcmpr’:
Armature.c:657: error: ‘Py_None’ undeclared (first use in this function)
Armature.c: At top level:
Armature.c:662: error: syntax error before ‘*’ token
Armature.c:662: error: syntax error before ‘*’ token
Armature.c:663: warning: return type defaults to ‘int’
Armature.c: In function ‘Armature_repr’:
Armature.c:664: warning: implicit declaration of function ‘PyString_FromFormat’
Armature.c:664: error: ‘self’ undeclared (first use in this function)
Armature.c:664: warning: return makes pointer from integer without a cast
Armature.c: At top level:
Armature.c:670: error: syntax error before ‘*’ token
Armature.c: In function ‘Armature_dealloc’:
Armature.c:672: error: ‘self’ undeclared (first use in this function)
Armature.c:673: error: ‘PyObject’ undeclared (first use in this function)
Armature.c:673: error: syntax error before ‘)’ token
Armature.c:673: error: syntax error before ‘)’ token
Armature.c: At top level:
Armature.c:677: error: syntax error before ‘Armature_Type’
Armature.c:677: warning: type defaults to ‘int’ in declaration of ‘Armature_Type’
Armature.c:679: error: initializer element is not constant
Armature.c:679: error: (near initialization for ‘Armature_Type’)
Armature.c:679: error: syntax error before numeric constant
Armature.c:680: warning: excess elements in scalar initializer
Armature.c:680: warning: (near initialization for ‘Armature_Type’)
Armature.c:681: warning: excess elements in scalar initializer
Armature.c:681: warning: (near initialization for ‘Armature_Type’)
Armature.c:682: warning: excess elements in scalar initializer
Armature.c:682: warning: (near initialization for ‘Armature_Type’)
Armature.c:683: warning: excess elements in scalar initializer
Armature.c:683: warning: (near initialization for ‘Armature_Type’)
Armature.c:683: error: syntax error before ‘Armature_dealloc’
Armature.c:684: warning: excess elements in scalar initializer
Armature.c:684: warning: (near initialization for ‘Armature_Type’)
Armature.c:685: warning: excess elements in scalar initializer
Armature.c:685: warning: (near initialization for ‘Armature_Type’)
Armature.c:686: warning: excess elements in scalar initializer
Armature.c:686: warning: (near initialization for ‘Armature_Type’)
Armature.c:687: warning: excess elements in scalar initializer
Armature.c:687: warning: (near initialization for ‘Armature_Type’)
Armature.c:688: warning: excess elements in scalar initializer
Armature.c:688: warning: (near initialization for ‘Armature_Type’)
Armature.c:688: error: syntax error before ‘Armature_repr’
Armature.c:689: warning: excess elements in scalar initializer
Armature.c:689: warning: (near initialization for ‘Armature_Type’)
Armature.c:690: warning: excess elements in scalar initializer
Armature.c:690: warning: (near initialization for ‘Armature_Type’)
Armature.c:691: warning: excess elements in scalar initializer
Armature.c:691: warning: (near initialization for ‘Armature_Type’)
Armature.c:692: warning: excess elements in scalar initializer
Armature.c:692: warning: (near initialization for ‘Armature_Type’)
Armature.c:693: warning: excess elements in scalar initializer
Armature.c:693: warning: (near initialization for ‘Armature_Type’)
Armature.c:694: warning: excess elements in scalar initializer
Armature.c:694: warning: (near initialization for ‘Armature_Type’)
Armature.c:695: warning: excess elements in scalar initializer
Armature.c:695: warning: (near initialization for ‘Armature_Type’)
Armature.c:696: warning: excess elements in scalar initializer
Armature.c:696: warning: (near initialization for ‘Armature_Type’)
Armature.c:697: warning: excess elements in scalar initializer
Armature.c:697: warning: (near initialization for ‘Armature_Type’)
Armature.c:698: warning: excess elements in scalar initializer
Armature.c:698: warning: (near initialization for ‘Armature_Type’)
Armature.c:699: warning: excess elements in scalar initializer
Armature.c:699: warning: (near initialization for ‘Armature_Type’)
Armature.c:700: warning: excess elements in scalar initializer
Armature.c:700: warning: (near initialization for ‘Armature_Type’)
Armature.c:701: warning: excess elements in scalar initializer
Armature.c:701: warning: (near initialization for ‘Armature_Type’)
Armature.c:702: error: ‘richcmpfunc’ undeclared here (not in a function)
Armature.c:702: warning: excess elements in scalar initializer
Armature.c:702: warning: (near initialization for ‘Armature_Type’)
Armature.c:702: error: syntax error before ‘Armature_richcmpr’
Armature.c:703: warning: excess elements in scalar initializer
Armature.c:703: warning: (near initialization for ‘Armature_Type’)
Armature.c:704: warning: excess elements in scalar initializer
Armature.c:704: warning: (near initialization for ‘Armature_Type’)
Armature.c:705: warning: excess elements in scalar initializer
Armature.c:705: warning: (near initialization for ‘Armature_Type’)
Armature.c:706: warning: excess elements in scalar initializer
Armature.c:706: warning: (near initialization for ‘Armature_Type’)
Armature.c:707: warning: excess elements in scalar initializer
Armature.c:707: warning: (near initialization for ‘Armature_Type’)
Armature.c:708: warning: excess elements in scalar initializer
Armature.c:708: warning: (near initialization for ‘Armature_Type’)
Armature.c:709: warning: excess elements in scalar initializer
Armature.c:709: warning: (near initialization for ‘Armature_Type’)
Armature.c:710: warning: excess elements in scalar initializer
Armature.c:710: warning: (near initialization for ‘Armature_Type’)
Armature.c:711: warning: excess elements in scalar initializer
Armature.c:711: warning: (near initialization for ‘Armature_Type’)
Armature.c:712: warning: excess elements in scalar initializer
Armature.c:712: warning: (near initialization for ‘Armature_Type’)
Armature.c:713: warning: excess elements in scalar initializer
Armature.c:713: warning: (near initialization for ‘Armature_Type’)
Armature.c:714: error: ‘initproc’ undeclared here (not in a function)
Armature.c:714: warning: excess elements in scalar initializer
Armature.c:714: warning: (near initialization for ‘Armature_Type’)
Armature.c:714: error: syntax error before ‘Armature_init’
Armature.c:715: warning: excess elements in scalar initializer
Armature.c:715: warning: (near initialization for ‘Armature_Type’)
Armature.c:716: warning: excess elements in scalar initializer
Armature.c:716: warning: (near initialization for ‘Armature_Type’)
Armature.c:716: error: syntax error before ‘Armature_new’
Armature.c:717: warning: excess elements in scalar initializer
Armature.c:717: warning: (near initialization for ‘Armature_Type’)
Armature.c:718: warning: excess elements in scalar initializer
Armature.c:718: warning: (near initialization for ‘Armature_Type’)
Armature.c:719: warning: excess elements in scalar initializer
Armature.c:719: warning: (near initialization for ‘Armature_Type’)
Armature.c:720: warning: excess elements in scalar initializer
Armature.c:720: warning: (near initialization for ‘Armature_Type’)
Armature.c:721: warning: excess elements in scalar initializer
Armature.c:721: warning: (near initialization for ‘Armature_Type’)
Armature.c:722: warning: excess elements in scalar initializer
Armature.c:722: warning: (near initialization for ‘Armature_Type’)
Armature.c:723: warning: excess elements in scalar initializer
Armature.c:723: warning: (near initialization for ‘Armature_Type’)
Armature.c:725: warning: excess elements in scalar initializer
Armature.c:725: warning: (near initialization for ‘Armature_Type’)
Armature.c:725: warning: data definition has no type or storage class
Armature.c:732: error: syntax error before ‘*’ token
Armature.c:732: error: syntax error before ‘*’ token
Armature.c:733: warning: return type defaults to ‘int’
Armature.c: In function ‘M_Armature_Get’:
Armature.c:734: error: ‘PyObject’ undeclared (first use in this function)
Armature.c:734: error: ‘seq’ undeclared (first use in this function)
Armature.c:734: error: ‘item’ undeclared (first use in this function)
Armature.c:734: warning: left-hand operand of comma expression has no effect
Armature.c:734: error: ‘dict’ undeclared (first use in this function)
Armature.c:734: warning: left-hand operand of comma expression has no effect
Armature.c:734: error: ‘py_armature’ undeclared (first use in this function)
Armature.c:734: warning: left-hand operand of comma expression has no effect
Armature.c:734: warning: statement with no effect
Armature.c:740: warning: implicit declaration of function ‘PySequence_Length’
Armature.c:740: error: ‘args’ undeclared (first use in this function)
Armature.c:742: warning: implicit declaration of function ‘PySequence_GetItem’
Armature.c:746: warning: implicit declaration of function ‘PySequence_Check’
Armature.c:794: warning: assignment makes pointer from integer without a cast
Armature.c:804: error: ‘Py_None’ undeclared (first use in this function)
Armature.c:816: warning: assignment makes pointer from integer without a cast
Armature.c:819: warning: assignment makes pointer from integer without a cast
Armature.c:831: error: ‘PyExc_RuntimeError’ undeclared (first use in this function)
Armature.c:835: error: ‘PyExc_AttributeError’ undeclared (first use in this function)
Armature.c: At top level:
Armature.c:840: error: syntax error before ‘*’ token
Armature.c:840: error: syntax error before ‘*’ token
Armature.c:840: warning: type defaults to ‘int’ in declaration of ‘M_Armature_Get’
Armature.c:840: warning: data definition has no type or storage class
Armature.c:846: error: array type has incomplete element type
Armature.c:847: error: ‘METH_VARARGS’ undeclared here (not in a function)
Armature.c:853: error: syntax error before ‘*’ token
Armature.c:854: warning: return type defaults to ‘int’
Armature.c: In function ‘PyArmature_FromArmature’:
Armature.c:855: error: ‘py_armature’ undeclared (first use in this function)
Armature.c:858: error: syntax error before ‘)’ token
Armature.c:868: error: syntax error before ‘)’ token
Armature.c:872: error: ‘PyObject’ undeclared (first use in this function)
Armature.c:872: error: syntax error before ‘)’ token
Armature.c:875: error: ‘PyExc_RuntimeError’ undeclared (first use in this function)
Armature.c: At top level:
Armature.c:880: error: syntax error before ‘*’ token
Armature.c: In function ‘PyArmature_AsArmature’:
Armature.c:882: error: ‘py_armature’ undeclared (first use in this function)
Armature.c: At top level:
Armature.c:885: error: syntax error before ‘*’ token
Armature.c:886: warning: return type defaults to ‘int’
Armature.c: In function ‘Armature_Init’:
Armature.c:887: error: ‘PyObject’ undeclared (first use in this function)
Armature.c:887: error: ‘module’ undeclared (first use in this function)
Armature.c:887: error: ‘dict’ undeclared (first use in this function)
Armature.c:887: warning: left-hand operand of comma expression has no effect
Armature.c:887: warning: statement with no effect
Armature.c:890: warning: implicit declaration of function ‘PyType_Ready’
Armature.c:892: error: ‘Py_None’ undeclared (first use in this function)
Armature.c:896: warning: implicit declaration of function ‘Py_InitModule3’
Armature.c:900: warning: implicit declaration of function ‘PyModule_AddObject’
Armature.c:901: error: syntax error before ‘)’ token
Armature.c:903: error: syntax error before ‘)’ token
Armature.c:925: warning: implicit declaration of function ‘PyModule_GetDict’
make[4]: *** [/home/aaron/dev/blender/blender/obj/linux-glibc2.3.5-i386/blender/python/Armature.o] Error 1
make[3]: *** [all] Error 1
make[2]: *** [all] Error 1
make[1]: *** [all] Error 1
make: *** [all] Error 1