- evfs ....................... ERROR!
--------------------------------------------------------------------------------
----------------------------------- Last loglines ------------------------------
evfs_fs_bzip2.c:164: error: bzip2_file has no member named buffer
evfs_fs_bzip2.c:165: error: bzip2_file has no member named stream
evfs_fs_bzip2.c: In function evfs_file_read:
evfs_fs_bzip2.c:190: error: bzip2_file has no member named stream
evfs_fs_bzip2.c:191: error: bzip2_file has no member named stream
evfs_fs_bzip2.c:193: error: bzip2_file has no member named stream
evfs_fs_bzip2.c:198: error: bzip2_file has no member named stream
evfs_fs_bzip2.c:211: error: bzip2_file has no member named stream
evfs_fs_bzip2.c:215: error: bzip2_file has no member named stream
evfs_fs_bzip2.c:215: error: bzip2_file has no member named stream
evfs_fs_bzip2.c:217: error: bzip2_file has no member named stream
evfs_fs_bzip2.c:219: error: bzip2_file has no member named stream
evfs_fs_bzip2.c: In function evfs_file_close:
evfs_fs_bzip2.c:230: error: bzip2_file has no member named stream
evfs_fs_bzip2.c:230: error: BZ_OK undeclared (first use in this function)
evfs_fs_bzip2.c:235: error: bzip2_file has no member named buffer
make[4]: *** [bzip2_la-evfs_fs_bzip2.lo] Error 1
make[4]: Leaving directory `/home/raventux/e17_cvs/e17/apps/evfs/src/plugins/file'
make[3]: *** [all-recursive] Error 1
make[3]: Leaving directory `/home/raventux/e17_cvs/e17/apps/evfs/src/plugins'
make[2]: *** [all-recursive] Error 1
make[2]: Leaving directory `/home/raventux/e17_cvs/e17/apps/evfs/src'
make[1]: *** [all-recursive] Error 1
make[1]: Leaving directory `/home/raventux/e17_cvs/e17/apps/evfs'
make: *** [all] Error 2