All pastes #293504 Raw Edit

Anonyme

public text v1 · immutable
#293504 ·published 2006-12-27 17:45 UTC
rendered paste body
make[4]: *** Waiting for unfinished jobs....
 x86_64-pc-linux-gnu-g++ -DHAVE_CONFIG_H -DG_LOG_DOMAIN=\"libgnomevfsmm\" -I../../libgnomevfs -I../../libgnomevfs -pthread -DORBIT2=1 -I/usr/include/glibmm-2.4 -I/usr/lib64/glibmm-2.4/include -I/usr/include/sigc++-2.0 -I/usr/lib64/sigc++-2.0/include -I/usr/include/glib-2.0 -I/usr/lib64/glib-2.0/include -I/usr/include/gnome-vfs-2.0 -I/usr/lib64/gnome-vfs-2.0/include -I/usr/include/gconf/2 -I/usr/include/orbit-2.0 -I/usr/include/gnome-vfs-module-2.0 -O2 -march=nocona -fomit-frame-pointer -pipe -MT transfer.lo -MD -MP -MF .deps/transfer.Tpo -c transfer.cc  -fPIC -DPIC -o .libs/transfer.o
make[4]: Leaving directory `/var/tmp/portage/gnome-vfsmm-2.12.0/work/gnome-vfsmm-2.12.0/libgnomevfs/libgnomevfsmm'
make[3]: *** [all-recursive] Error 1
make[3]: Leaving directory `/var/tmp/portage/gnome-vfsmm-2.12.0/work/gnome-vfsmm-2.12.0/libgnomevfs/libgnomevfsmm'
make[2]: *** [all-recursive] Error 1
make[2]: Leaving directory `/var/tmp/portage/gnome-vfsmm-2.12.0/work/gnome-vfsmm-2.12.0/libgnomevfs'
make[1]: *** [all] Error 2
make[1]: Leaving directory `/var/tmp/portage/gnome-vfsmm-2.12.0/work/gnome-vfsmm-2.12.0/libgnomevfs'
make: *** [all-recursive] Error 1

!!! ERROR: dev-cpp/gnome-vfsmm-2.12.0 failed.
Call stack:
  ebuild.sh, line 1546:   Called dyn_compile
  ebuild.sh, line 937:   Called src_compile
  gnome-vfsmm-2.12.0.ebuild, line 30:   Called gnome2_src_compile
  gnome2.eclass, line 71:   Called die

!!! compile failure
!!! If you need support, post the topmost build error, and the call stack if relevant.