venkat@venkat:~/work/cv/src/server> make install NOJAVA=1
echo `cvs status GNUmakefile | grep "Sticky Tag"` > /cv/server/VERSION.txt
Password:
==> Building include
==> Building libsrc
==> Building conf
==> Building click_data
==> Building report_templates
==> Building certs
==> Building verisign
==> Building efrontier
==> Building binsrc
cc1plus: warning: command line option "-Wmissing-prototypes" is valid for Ada/C/ObjC but not for C++
cc1plus: warning: command line option "-Wstrict-prototypes" is valid for Ada/C/ObjC but not for C++
In file included from /cv/vendor/include/boost-1_32/boost/config.hpp:35,
from /cv/vendor/include/boost-1_32/boost/timer.hpp:20,
from /cv/vendor/include/boost-1_32/boost/progress.hpp:22,
from ../../../src/server/include/mfm_common.h:4,
from mfm.cc:1:
/cv/vendor/include/boost-1_32/boost/config/compiler/gcc.hpp:92:7: warning: #warning "Unknown compiler version - please run the configure tests and report the results"
/cv/vendor/include/boost-1_32/boost/numeric/ublas/functional.hpp:1421: warning: unused parameter âsize1â
/cv/vendor/include/boost-1_32/boost/numeric/ublas/functional.hpp:1430: warning: unused parameter âsize1â
/cv/vendor/include/boost-1_32/boost/numeric/ublas/functional.hpp:1480: warning: unused parameter âsize1â
/cv/vendor/include/boost-1_32/boost/numeric/ublas/functional.hpp:1480: warning: unused parameter âsize2â
/cv/vendor/include/boost-1_32/boost/numeric/ublas/functional.hpp:1501: warning: unused parameter âsize1â
/cv/vendor/include/boost-1_32/boost/numeric/ublas/functional.hpp:1507: warning: unused parameter âsize2â
/cv/vendor/include/boost-1_32/boost/numeric/ublas/functional.hpp:1513: warning: unused parameter âsize1â
/cv/vendor/include/boost-1_32/boost/numeric/ublas/functional.hpp:1519: warning: unused parameter âsize2â
/cv/vendor/include/boost-1_32/boost/numeric/ublas/functional.hpp:1587: warning: unused parameter âsize2â
/cv/vendor/include/boost-1_32/boost/numeric/ublas/functional.hpp:1596: warning: unused parameter âsize2â
/cv/vendor/include/boost-1_32/boost/numeric/ublas/functional.hpp:1656: warning: unused parameter âsize1â
/cv/vendor/include/boost-1_32/boost/numeric/ublas/functional.hpp:1656: warning: unused parameter âsize2â
/cv/vendor/include/boost-1_32/boost/numeric/ublas/functional.hpp:1667: warning: unused parameter âsize2â
/cv/vendor/include/boost-1_32/boost/numeric/ublas/functional.hpp:1673: warning: unused parameter âsize1â
/cv/vendor/include/boost-1_32/boost/numeric/ublas/functional.hpp:1679: warning: unused parameter âsize2â
/cv/vendor/include/boost-1_32/boost/numeric/ublas/functional.hpp:1685: warning: unused parameter âsize1â
../../../src/server/include/keyword.h:107: error: extra qualification âKeyword::â on member âis_modelableâ
mfm.cc:32: warning: âvoid print_cidxs(std::vector<std::vector<int, std::allocator<int> >, std::allocator<std::vector<int, std::allocator<int> > > >&)â defined but not used
make[1]: *** [mfm] Error 1
make: *** [install] Error 1