Rabbit:/usr/src/ieee80211-1.1.6# make
Checking in /lib/modules/2.6.8-2-686/build/ for ieee80211 components...
make -C /lib/modules/2.6.8-2-686/build M=/usr/src/ieee80211-1.1.6 MODVERDIR=/usr/src/ieee80211-1.1.6 modules
make[1]: Entering directory `/usr/src/kernel-headers-2.6.8-2-686'
CC [M] /usr/src/ieee80211-1.1.6/ieee80211_module.o
In file included from /usr/src/ieee80211-1.1.6/ieee80211_module.c:54:
/usr/src/ieee80211-1.1.6/net/ieee80211.h:530: error: syntax error before "__le16"
/usr/src/ieee80211-1.1.6/net/ieee80211.h:530: warning: no semicolon at end of struct or union
/usr/src/ieee80211-1.1.6/net/ieee80211.h:531: warning: type defaults to `int' in declaration of `duration_id'
/usr/src/ieee80211-1.1.6/net/ieee80211.h:531: warning: data definition has no type or storage class
/usr/src/ieee80211-1.1.6/net/ieee80211.h:533: error: syntax error before '}' token
/usr/src/ieee80211-1.1.6/net/ieee80211.h:533: warning: empty declaration
/usr/src/ieee80211-1.1.6/net/ieee80211.h:536: error: syntax error before "__le16"
/usr/src/ieee80211-1.1.6/net/ieee80211.h:536: warning: no semicolon at end of struct or union
/usr/src/ieee80211-1.1.6/net/ieee80211.h:537: warning: type defaults to `int' in declaration of `duration_id'
/usr/src/ieee80211-1.1.6/net/ieee80211.h:537: warning: data definition has no type or storage class
/usr/src/ieee80211-1.1.6/net/ieee80211.h:540: error: syntax error before '}' token
/usr/src/ieee80211-1.1.6/net/ieee80211.h:540: warning: empty declaration
/usr/src/ieee80211-1.1.6/net/ieee80211.h:543: error: syntax error before "__le16"
/usr/src/ieee80211-1.1.6/net/ieee80211.h:543: warning: no semicolon at end of struct or union
/usr/src/ieee80211-1.1.6/net/ieee80211.h:544: warning: type defaults to `int' in declaration of `duration_id'
/usr/src/ieee80211-1.1.6/net/ieee80211.h:544: warning: data definition has no type or storage class
/usr/src/ieee80211-1.1.6/net/ieee80211.h:548: error: syntax error before '}' token
/usr/src/ieee80211-1.1.6/net/ieee80211.h:548: warning: empty declaration
/usr/src/ieee80211-1.1.6/net/ieee80211.h:551: error: syntax error before "__le16"
/usr/src/ieee80211-1.1.6/net/ieee80211.h:551: warning: no semicolon at end of struct or union
/usr/src/ieee80211-1.1.6/net/ieee80211.h:552: warning: type defaults to `int' in declaration of `duration_id'
/usr/src/ieee80211-1.1.6/net/ieee80211.h:552: warning: data definition has no type or storage class
/usr/src/ieee80211-1.1.6/net/ieee80211.h:556: error: syntax error before "seq_ctl"
/usr/src/ieee80211-1.1.6/net/ieee80211.h:556: warning: type defaults to `int' in declaration of `seq_ctl'
/usr/src/ieee80211-1.1.6/net/ieee80211.h:556: warning: data definition has no type or storage class
/usr/src/ieee80211-1.1.6/net/ieee80211.h:558: error: syntax error before '}' token
/usr/src/ieee80211-1.1.6/net/ieee80211.h:558: warning: empty declaration
/usr/src/ieee80211-1.1.6/net/ieee80211.h:561: error: syntax error before "__le16"
/usr/src/ieee80211-1.1.6/net/ieee80211.h:561: warning: no semicolon at end of struct or union
/usr/src/ieee80211-1.1.6/net/ieee80211.h:562: warning: type defaults to `int' in declaration of `duration_id'
/usr/src/ieee80211-1.1.6/net/ieee80211.h:562: warning: data definition has no type or storage class
/usr/src/ieee80211-1.1.6/net/ieee80211.h:566: error: syntax error before "seq_ctl"
/usr/src/ieee80211-1.1.6/net/ieee80211.h:566: warning: type defaults to `int' in declaration of `seq_ctl'
/usr/src/ieee80211-1.1.6/net/ieee80211.h:566: warning: type defaults to `int' in declaration of `seq_ctl'
/usr/src/ieee80211-1.1.6/net/ieee80211.h:566: warning: data definition has no type or storage class
/usr/src/ieee80211-1.1.6/net/ieee80211.h:569: error: syntax error before '}' token
/usr/src/ieee80211-1.1.6/net/ieee80211.h:569: warning: empty declaration
/usr/src/ieee80211-1.1.6/net/ieee80211.h:572: error: syntax error before "__le16"
/usr/src/ieee80211-1.1.6/net/ieee80211.h:572: warning: no semicolon at end of struct or union
/usr/src/ieee80211-1.1.6/net/ieee80211.h:573: warning: type defaults to `int' in declaration of `duration_id'
/usr/src/ieee80211-1.1.6/net/ieee80211.h:573: warning: data definition has no type or storage class
/usr/src/ieee80211-1.1.6/net/ieee80211.h:577: error: syntax error before "seq_ctl"
/usr/src/ieee80211-1.1.6/net/ieee80211.h:577: warning: type defaults to `int' in declaration of `seq_ctl'
/usr/src/ieee80211-1.1.6/net/ieee80211.h:577: warning: data definition has no type or storage class
/usr/src/ieee80211-1.1.6/net/ieee80211.h:579: error: syntax error before "qos_ctl"
/usr/src/ieee80211-1.1.6/net/ieee80211.h:579: warning: type defaults to `int' in declaration of `qos_ctl'
/usr/src/ieee80211-1.1.6/net/ieee80211.h:579: warning: data definition has no type or storage class
/usr/src/ieee80211-1.1.6/net/ieee80211.h:580: warning: empty declaration
/usr/src/ieee80211-1.1.6/net/ieee80211.h:583: error: syntax error before "__le16"
/usr/src/ieee80211-1.1.6/net/ieee80211.h:583: warning: no semicolon at end of struct or union
/usr/src/ieee80211-1.1.6/net/ieee80211.h:584: warning: type defaults to `int' in declaration of `duration_id'
/usr/src/ieee80211-1.1.6/net/ieee80211.h:584: warning: data definition has no type or storage class
/usr/src/ieee80211-1.1.6/net/ieee80211.h:588: error: syntax error before "seq_ctl"
/usr/src/ieee80211-1.1.6/net/ieee80211.h:588: warning: type defaults to `int' in declaration of `seq_ctl'
/usr/src/ieee80211-1.1.6/net/ieee80211.h:588: warning: data definition has no type or storage class
/usr/src/ieee80211-1.1.6/net/ieee80211.h:591: error: syntax error before "qos_ctl"
/usr/src/ieee80211-1.1.6/net/ieee80211.h:591: warning: type defaults to `int' in declaration of `qos_ctl'
/usr/src/ieee80211-1.1.6/net/ieee80211.h:591: warning: data definition has no type or storage class
/usr/src/ieee80211-1.1.6/net/ieee80211.h:592: warning: empty declaration
/usr/src/ieee80211-1.1.6/net/ieee80211.h:618: error: field `header' has incomplete type
/usr/src/ieee80211-1.1.6/net/ieee80211.h:619: error: syntax error before "__le16"
/usr/src/ieee80211-1.1.6/net/ieee80211.h:619: warning: no semicolon at end of struct or union
/usr/src/ieee80211-1.1.6/net/ieee80211.h:620: warning: type defaults to `int' in declaration of `transaction'
/usr/src/ieee80211-1.1.6/net/ieee80211.h:620: warning: data definition has no type or storage class
/usr/src/ieee80211-1.1.6/net/ieee80211.h:621: error: syntax error before "status"
/usr/src/ieee80211-1.1.6/net/ieee80211.h:621: warning: type defaults to `int' in declaration of `status'
/usr/src/ieee80211-1.1.6/net/ieee80211.h:621: warning: data definition has no type or storage class
/usr/src/ieee80211-1.1.6/net/ieee80211.h:624: error: syntax error before '}' token
/usr/src/ieee80211-1.1.6/net/ieee80211.h:624: warning: empty declaration
/usr/src/ieee80211-1.1.6/net/ieee80211.h:627: error: field `header' has incomplete type
/usr/src/ieee80211-1.1.6/net/ieee80211.h:628: error: syntax error before "__le16"
/usr/src/ieee80211-1.1.6/net/ieee80211.h:628: warning: no semicolon at end of struct or union
/usr/src/ieee80211-1.1.6/net/ieee80211.h:629: warning: empty declaration
/usr/src/ieee80211-1.1.6/net/ieee80211.h:635: error: field `header' has incomplete type
/usr/src/ieee80211-1.1.6/net/ieee80211.h:641: error: field `header' has incomplete type
/usr/src/ieee80211-1.1.6/net/ieee80211.h:643: error: syntax error before "__le16"
/usr/src/ieee80211-1.1.6/net/ieee80211.h:643: warning: no semicolon at end of struct or union
/usr/src/ieee80211-1.1.6/net/ieee80211.h:644: warning: type defaults to `int' in declaration of `capability'
/usr/src/ieee80211-1.1.6/net/ieee80211.h:644: warning: data definition has no type or storage class
/usr/src/ieee80211-1.1.6/net/ieee80211.h:648: error: syntax error before '}' token
/usr/src/ieee80211-1.1.6/net/ieee80211.h:648: warning: empty declaration
/usr/src/ieee80211-1.1.6/net/ieee80211.h:654: error: field `header' has incomplete type
/usr/src/ieee80211-1.1.6/net/ieee80211.h:655: error: syntax error before "__le16"
/usr/src/ieee80211-1.1.6/net/ieee80211.h:655: warning: no semicolon at end of struct or union
/usr/src/ieee80211-1.1.6/net/ieee80211.h:656: warning: type defaults to `int' in declaration of `listen_interval'
/usr/src/ieee80211-1.1.6/net/ieee80211.h:656: warning: data definition has no type or storage class
/usr/src/ieee80211-1.1.6/net/ieee80211.h:659: error: syntax error before '}' token
/usr/src/ieee80211-1.1.6/net/ieee80211.h:659: warning: empty declaration
/usr/src/ieee80211-1.1.6/net/ieee80211.h:662: error: field `header' has incomplete type
/usr/src/ieee80211-1.1.6/net/ieee80211.h:663: error: syntax error before "__le16"
/usr/src/ieee80211-1.1.6/net/ieee80211.h:663: warning: no semicolon at end of struct or union
/usr/src/ieee80211-1.1.6/net/ieee80211.h:664: warning: type defaults to `int' in declaration of `listen_interval'
/usr/src/ieee80211-1.1.6/net/ieee80211.h:664: warning: data definition has no type or storage class
/usr/src/ieee80211-1.1.6/net/ieee80211.h:667: error: syntax error before '}' token
/usr/src/ieee80211-1.1.6/net/ieee80211.h:667: warning: empty declaration
/usr/src/ieee80211-1.1.6/net/ieee80211.h:670: error: field `header' has incomplete type
/usr/src/ieee80211-1.1.6/net/ieee80211.h:671: error: syntax error before "__le16"
/usr/src/ieee80211-1.1.6/net/ieee80211.h:671: warning: no semicolon at end of struct or union
/usr/src/ieee80211-1.1.6/net/ieee80211.h:672: warning: type defaults to `int' in declaration of `status'
/usr/src/ieee80211-1.1.6/net/ieee80211.h:672: warning: data definition has no type or storage class
/usr/src/ieee80211-1.1.6/net/ieee80211.h:673: error: syntax error before "aid"
/usr/src/ieee80211-1.1.6/net/ieee80211.h:673: warning: type defaults to `int' in declaration of `aid'
/usr/src/ieee80211-1.1.6/net/ieee80211.h:673: warning: data definition has no type or storage class
/usr/src/ieee80211-1.1.6/net/ieee80211.h:676: error: syntax error before '}' token
/usr/src/ieee80211-1.1.6/net/ieee80211.h:676: warning: empty declaration
/usr/src/ieee80211-1.1.6/net/ieee80211.h:683: error: syntax error before "__le16"
/usr/src/ieee80211-1.1.6/net/ieee80211.h:683: warning: no semicolon at end of struct or union
/usr/src/ieee80211-1.1.6/net/ieee80211.h:684: warning: type defaults to `int' in declaration of `payload_size'
/usr/src/ieee80211-1.1.6/net/ieee80211.h:684: warning: data definition has no type or storage class
/usr/src/ieee80211-1.1.6/net/ieee80211.h:686: error: syntax error before '}' token
/usr/src/ieee80211-1.1.6/net/ieee80211.h:734: error: syntax error before "__le16"
/usr/src/ieee80211-1.1.6/net/ieee80211.h:734: warning: no semicolon at end of struct or union
/usr/src/ieee80211-1.1.6/net/ieee80211.h:735: warning: empty declaration
/usr/src/ieee80211-1.1.6/net/ieee80211.h:740: error: field `ac_params_record' has incomplete type
/usr/src/ieee80211-1.1.6/net/ieee80211.h:744: error: syntax error before "__le16"
/usr/src/ieee80211-1.1.6/net/ieee80211.h:744: warning: no semicolon at end of struct or union
/usr/src/ieee80211-1.1.6/net/ieee80211.h:745: warning: type defaults to `int' in declaration of `cw_max'
/usr/src/ieee80211-1.1.6/net/ieee80211.h:745: warning: data definition has no type or storage class
/usr/src/ieee80211-1.1.6/net/ieee80211.h:748: error: syntax error before "tx_op_limit"
/usr/src/ieee80211-1.1.6/net/ieee80211.h:748: warning: type defaults to `int' in declaration of `tx_op_limit'
/usr/src/ieee80211-1.1.6/net/ieee80211.h:748: warning: data definition has no type or storage class
/usr/src/ieee80211-1.1.6/net/ieee80211.h:749: error: syntax error before '}' token
/usr/src/ieee80211-1.1.6/net/ieee80211.h:749: warning: empty declaration
/usr/src/ieee80211-1.1.6/net/ieee80211.h:752: error: field `parameters' has incomplete type
In file included from /usr/src/ieee80211-1.1.6/ieee80211_module.c:54:
/usr/src/ieee80211-1.1.6/net/ieee80211.h: In function `ieee80211_get_payload':
/usr/src/ieee80211-1.1.6/net/ieee80211.h:1065: error: dereferencing pointer to incomplete type
/usr/src/ieee80211-1.1.6/net/ieee80211.h:1067: error: dereferencing pointer to incomplete type
/usr/src/ieee80211-1.1.6/net/ieee80211.h:1069: error: dereferencing pointer to incomplete type
/usr/src/ieee80211-1.1.6/net/ieee80211.h:1071: error: dereferencing pointer to incomplete type
/usr/src/ieee80211-1.1.6/net/ieee80211.h:1073: error: dereferencing pointer to incomplete type
make[2]: *** [/usr/src/ieee80211-1.1.6/ieee80211_module.o] Error 1
make[1]: *** [_module_/usr/src/ieee80211-1.1.6] Error 2
make[1]: Leaving directory `/usr/src/kernel-headers-2.6.8-2-686'
make: *** [modules] Error 2
Rabbit:/usr/src/ieee80211-1.1.6#