All pastes #292639 Raw Edit

compile error

public text v1 · immutable
#292639 ·published 2006-12-26 20:03 UTC
rendered paste body
[ 58%] Building CXX object kde3support/CMakeFiles/kde3support.dir/kdeui/qxembed.o
/home/rideout/devel/kde/kdelibs/kde3support/kdeui/qxembed.cpp:55:31: error: private/qwidget_p.h: No such file or directory
/home/rideout/devel/kde/kdelibs/kde3support/kdeui/qxembed.cpp:59:30: error: private/qt_x11_p.h: No such file or directory
/home/rideout/devel/kde/kdelibs/kde3support/kdeui/qxembed.cpp:374:18: warning: #warning port me - need to refer to QWidget::focusNextPrevChild for the code to copy
/home/rideout/devel/kde/kdelibs/kde3support/kdeui/qxembed.cpp:184: error: ISO C++ forbids declaration of ‘QTLWExtra’ with no type
/home/rideout/devel/kde/kdelibs/kde3support/kdeui/qxembed.cpp:184: error: expected ‘;’ before ‘*’ token
/home/rideout/devel/kde/kdelibs/kde3support/kdeui/qxembed.cpp:185: error: expected `;' before ‘QWExtra’
/home/rideout/devel/kde/kdelibs/kde3support/kdeui/qxembed.cpp:185: error: ISO C++ forbids declaration of ‘QWExtra’ with no type
/home/rideout/devel/kde/kdelibs/kde3support/kdeui/qxembed.cpp:185: error: expected ‘;’ before ‘*’ token
/home/rideout/devel/kde/kdelibs/kde3support/kdeui/qxembed.cpp:186: error: expected `;' before ‘}’ token
/home/rideout/devel/kde/kdelibs/kde3support/kdeui/qxembed.cpp: In member function ‘virtual bool<unnamed>::QXEmbedAppFilter::eventFilter(QObject*, QEvent*)’:
/home/rideout/devel/kde/kdelibs/kde3support/kdeui/qxembed.cpp:316: error: ‘class QPublicWidget’ has no member named ‘topData’
/home/rideout/devel/kde/kdelibs/kde3support/kdeui/qxembed.cpp:324: error: ‘class QPublicWidget’ has no member named ‘topData’
/home/rideout/devel/kde/kdelibs/kde3support/kdeui/qxembed.cpp:346: error: ‘class QPublicWidget’ has no member named ‘topData’
/home/rideout/devel/kde/kdelibs/kde3support/kdeui/qxembed.cpp: In function ‘bool qxembed_x11_event_filter(void*, long int*)’:
/home/rideout/devel/kde/kdelibs/kde3support/kdeui/qxembed.cpp:408: error: ‘XKeyPress’ was not declared in this scope
/home/rideout/devel/kde/kdelibs/kde3support/kdeui/qxembed.cpp:409: error: ‘XKeyRelease’ was not declared in this scope
/home/rideout/devel/kde/kdelibs/kde3support/kdeui/qxembed.cpp:430: error: ‘QTLWExtra’ was not declared in this scope
/home/rideout/devel/kde/kdelibs/kde3support/kdeui/qxembed.cpp:430: error: ‘extra’ was not declared in this scope
/home/rideout/devel/kde/kdelibs/kde3support/kdeui/qxembed.cpp:430: error: ‘class QPublicWidget’ has no member named ‘topData’
/home/rideout/devel/kde/kdelibs/kde3support/kdeui/qxembed.cpp:445: error: ‘XFocusIn’ was not declared in this scope
/home/rideout/devel/kde/kdelibs/kde3support/kdeui/qxembed.cpp:459: error: ‘XFocusOut’ was not declared in this scope
/home/rideout/devel/kde/kdelibs/kde3support/kdeui/qxembed.cpp: In constructor ‘QXEmbed::QXEmbed(QWidget*, const char*, Qt::WFlags)’:
/home/rideout/devel/kde/kdelibs/kde3support/kdeui/qxembed.cpp:628: error: ‘class QPublicWidget’ has no member named ‘topData’
/home/rideout/devel/kde/kdelibs/kde3support/kdeui/qxembed.cpp:655: error: ‘class QPublicWidget’ has no member named ‘topData’
/home/rideout/devel/kde/kdelibs/kde3support/kdeui/qxembed.cpp:657: error: ‘XRevertToParent’ was not declared in this scope
/home/rideout/devel/kde/kdelibs/kde3support/kdeui/qxembed.cpp: In destructor ‘virtual QXEmbed::~QXEmbed()’:
/home/rideout/devel/kde/kdelibs/kde3support/kdeui/qxembed.cpp:709: error: ‘XRevertToParent’ was not declared in this scope
/home/rideout/devel/kde/kdelibs/kde3support/kdeui/qxembed.cpp: In member function ‘virtual bool QXEmbed::eventFilter(QObject*, QEvent*)’:
/home/rideout/devel/kde/kdelibs/kde3support/kdeui/qxembed.cpp:776: error: ‘class QPublicWidget’ has no member named ‘topData’
/home/rideout/devel/kde/kdelibs/kde3support/kdeui/qxembed.cpp:779: error: ‘XRevertToParent’ was not declared in this scope
/home/rideout/devel/kde/kdelibs/kde3support/kdeui/qxembed.cpp: In member function ‘virtual void QXEmbed::focusInEvent(QFocusEvent*)’:
/home/rideout/devel/kde/kdelibs/kde3support/kdeui/qxembed.cpp:857: error: ‘class QPublicWidget’ has no member named ‘topData’
/home/rideout/devel/kde/kdelibs/kde3support/kdeui/qxembed.cpp:863: error: ‘XRevertToParent’ was not declared in this scope
/home/rideout/devel/kde/kdelibs/kde3support/kdeui/qxembed.cpp:870: error: ‘XFocusIn’ was not declared in this scope
/home/rideout/devel/kde/kdelibs/kde3support/kdeui/qxembed.cpp: In member function ‘virtual void QXEmbed::focusOutEvent(QFocusEvent*)’:
/home/rideout/devel/kde/kdelibs/kde3support/kdeui/qxembed.cpp:894: error: ‘XFocusOut’ was not declared in this scope
/home/rideout/devel/kde/kdelibs/kde3support/kdeui/qxembed.cpp:906: error: ‘class QPublicWidget’ has no member named ‘topData’
/home/rideout/devel/kde/kdelibs/kde3support/kdeui/qxembed.cpp:913: error: ‘XRevertToParent’ was not declared in this scope
/home/rideout/devel/kde/kdelibs/kde3support/kdeui/qxembed.cpp: In member function ‘virtual bool QXEmbed::x11Event(XEvent*)’:
/home/rideout/devel/kde/kdelibs/kde3support/kdeui/qxembed.cpp:1070: error: ‘class QPublicWidget’ has no member named ‘extraData’
/home/rideout/devel/kde/kdelibs/kde3support/kdeui/qxembed.cpp:1083: error: ‘XFocusIn’ was not declared in this scope
/home/rideout/devel/kde/kdelibs/kde3support/kdeui/qxembed.cpp:1136: error: ‘class QPublicWidget’ has no member named ‘topData’
/home/rideout/devel/kde/kdelibs/kde3support/kdeui/qxembed.cpp:1137: error: ‘class QPublicWidget’ has no member named ‘topData’
/home/rideout/devel/kde/kdelibs/kde3support/kdeui/qxembed.cpp: In static member function ‘static void QXEmbed::embedClientIntoWindow(QWidget*, WId)’:
/home/rideout/devel/kde/kdelibs/kde3support/kdeui/qxembed.cpp:1231: error: ‘class QPublicWidget’ has no member named ‘topData’
/home/rideout/devel/kde/kdelibs/kde3support/kdeui/qxembed.cpp:1232: error: ‘class QPublicWidget’ has no member named ‘topData’
/home/rideout/devel/kde/kdelibs/kde3support/kdeui/qxembed.cpp: In member function ‘void QXEmbed::checkGrab()’:
/home/rideout/devel/kde/kdelibs/kde3support/kdeui/qxembed.cpp:1302: error: ‘XNone’ was not declared in this scope
/home/rideout/devel/kde/kdelibs/kde3support/kdeui/qxembed.cpp: In member function ‘void QXEmbed::sendSyntheticConfigureNotifyEvent()’:
/home/rideout/devel/kde/kdelibs/kde3support/kdeui/qxembed.cpp:1332: error: ‘XNone’ was not declared in this scope
make[2]: *** [kde3support/CMakeFiles/kde3support.dir/kdeui/qxembed.o] Error 1
make[1]: *** [kde3support/CMakeFiles/kde3support.dir/all] Error 2
make: *** [all] Error 2