rendered paste bodymake[4]: Nothing to be done for `install-data-am'.
make[4]: Leaving directory `/home/neoclust/rpm/BUILD/gambas-1.0.17/src/lib/sdl'
make[3]: Leaving directory `/home/neoclust/rpm/BUILD/gambas-1.0.17/src/lib/sdl'
Making install in vb
make[3]: Entering directory `/home/neoclust/rpm/BUILD/gambas-1.0.17/src/lib/vb'
make[4]: Entering directory `/home/neoclust/rpm/BUILD/gambas-1.0.17/src/lib/vb'
test -z "/home/neoclust/rpm/temp/gambas-buildroot/usr/lib/gambas" || mkdir -p -- "/home/neoclust/rpm/temp/gambas-buildroot/usr/lib/gambas"
/bin/sh ../../../libtool --mode=install /usr/bin/install -c 'lib.gb.vb.la' '/home/neoclust/rpm/temp/gambas-buildroot/usr/lib/gambas/lib.gb.vb.la'
/usr/bin/install -c .libs/lib.gb.vb.so.0.0.0 /home/neoclust/rpm/temp/gambas-buildroot/usr/lib/gambas/lib.gb.vb.so.0.0.0
(cd /home/neoclust/rpm/temp/gambas-buildroot/usr/lib/gambas && { ln -s -f lib.gb.vb.so.0.0.0 lib.gb.vb.so.0 || { rm -f lib.gb.vb.so.0 && ln -s lib.gb.vb.so.0.0.0 lib.gb.vb.so.0; }; })
(cd /home/neoclust/rpm/temp/gambas-buildroot/usr/lib/gambas && { ln -s -f lib.gb.vb.so.0.0.0 lib.gb.vb.so || { rm -f lib.gb.vb.so && ln -s lib.gb.vb.so.0.0.0 lib.gb.vb.so; }; })
/usr/bin/install -c .libs/lib.gb.vb.lai /home/neoclust/rpm/temp/gambas-buildroot/usr/lib/gambas/lib.gb.vb.la
libtool: install: warning: remember to run `libtool --finish /usr/lib/gambas'
make[4]: Nothing to be done for `install-data-am'.
make[4]: Leaving directory `/home/neoclust/rpm/BUILD/gambas-1.0.17/src/lib/vb'
make[3]: Leaving directory `/home/neoclust/rpm/BUILD/gambas-1.0.17/src/lib/vb'
make[3]: Entering directory `/home/neoclust/rpm/BUILD/gambas-1.0.17/src/lib'
make[4]: Entering directory `/home/neoclust/rpm/BUILD/gambas-1.0.17/src/lib'
make[4]: Nothing to be done for `install-data-am'.
make[4]: Leaving directory `/home/neoclust/rpm/BUILD/gambas-1.0.17/src/lib'
make[3]: Leaving directory `/home/neoclust/rpm/BUILD/gambas-1.0.17/src/lib'
make[2]: Leaving directory `/home/neoclust/rpm/BUILD/gambas-1.0.17/src/lib'
make[2]: Entering directory `/home/neoclust/rpm/BUILD/gambas-1.0.17/src'
make[3]: Entering directory `/home/neoclust/rpm/BUILD/gambas-1.0.17/src'
make[3]: Nothing to be done for `install-exec-am'.
make[3]: Nothing to be done for `install-data-am'.
make[3]: Leaving directory `/home/neoclust/rpm/BUILD/gambas-1.0.17/src'
make[2]: Leaving directory `/home/neoclust/rpm/BUILD/gambas-1.0.17/src'
make[1]: Leaving directory `/home/neoclust/rpm/BUILD/gambas-1.0.17/src'
make[1]: Entering directory `/home/neoclust/rpm/BUILD/gambas-1.0.17'
make[2]: Entering directory `/home/neoclust/rpm/BUILD/gambas-1.0.17'
Installing with ROOT=/home/neoclust/rpm/temp/gambas-buildroot
Creating the library info files...
/home/neoclust/rpm/temp/gambas-buildroot/usr/share/gambas/info/gb.debug.info
/home/neoclust/rpm/temp/gambas-buildroot/usr/share/gambas/info/gb.eval.info
/home/neoclust/rpm/temp/gambas-buildroot/usr/share/gambas/info/gb.db.info
/home/neoclust/rpm/temp/gambas-buildroot/usr/share/gambas/info/gb.compress.info
/home/neoclust/rpm/temp/gambas-buildroot/usr/share/gambas/info/gb.xml.libxml.xslt.info
/home/neoclust/rpm/temp/gambas-buildroot/usr/share/gambas/info/gb.xml.libxml.rpc.info
/home/neoclust/rpm/temp/gambas-buildroot/usr/share/gambas/info/gb.xml.libxml.info
/home/neoclust/rpm/temp/gambas-buildroot/usr/share/gambas/info/gb.qt.editor.info
/home/neoclust/rpm/temp/gambas-buildroot/usr/share/gambas/info/gb.qt.ext.info
/home/neoclust/rpm/temp/gambas-buildroot/usr/share/gambas/info/gb.qt.kde.html.info
/home/neoclust/rpm/temp/gambas-buildroot/usr/share/gambas/info/gb.qt.kde.info
/home/neoclust/rpm/temp/gambas-buildroot/usr/share/gambas/info/gb.qt.info
/home/neoclust/rpm/temp/gambas-buildroot/usr/share/gambas/info/gb.net.curl.info
/home/neoclust/rpm/temp/gambas-buildroot/usr/share/gambas/info/gb.net.info
/home/neoclust/rpm/temp/gambas-buildroot/usr/share/gambas/info/gb.sdl.info
/home/neoclust/rpm/temp/gambas-buildroot/usr/share/gambas/info/gb.vb.info
/home/neoclust/rpm/temp/gambas-buildroot/usr/share/gambas/info/gb.info
Installing the development environment...
Compiling gambas...
*** buffer overflow detected ***: /home/neoclust/rpm/temp/gambas-buildroot/usr/bin/gbc terminated
======= Backtrace: =========
/lib/i686/libc.so.6(__chk_fail+0x41)[0x4011dba1]
/lib/i686/libc.so.6[0x4011e264]
/home/neoclust/rpm/temp/gambas-buildroot/usr/bin/gbc[0x8053f82]
/lib/i686/libc.so.6(__libc_start_main+0xdc)[0x4005575c]
/home/neoclust/rpm/temp/gambas-buildroot/usr/bin/gbc[0x8049201]
======= Memory map: ========
08048000-08059000 r-xp 00000000 09:02 5354498 /home/neoclust/rpm/temp/gambas-buildroot/usr/bin/gbc
08059000-0805b000 rwxp 00011000 09:02 5354498 /home/neoclust/rpm/temp/gambas-buildroot/usr/bin/gbc
0805b000-0807c000 rwxp 0805b000 00:00 0 [heap]
40000000-40018000 r-xp 00000000 09:00 908325 /lib/ld-2.4.so
40018000-40019000 r-xp 00017000 09:00 908325 /lib/ld-2.4.so
40019000-4001a000 rwxp 00018000 09:00 908325 /lib/ld-2.4.so
4001a000-4001b000 rwxp 4001a000 00:00 0
40040000-40167000 r-xp 00000000 09:00 916481 /lib/i686/libc-2.4.so
40167000-40168000 r-xp 00126000 09:00 916481 /lib/i686/libc-2.4.so
40168000-4016a000 rwxp 00127000 09:00 916481 /lib/i686/libc-2.4.so
4016a000-4016e000 rwxp 4016a000 00:00 0
4016e000-40178000 r-xp 00000000 09:00 1536683 /lib/libgcc_s-4.1.2.so.1
40178000-40179000 rwxp 0000a000 09:00 1536683 /lib/libgcc_s-4.1.2.so.1
bfe07000-bfe1d000 rw-p bfe07000 00:00 0 [stack]
bfffe000-bffff000 r-xp bfffe000 00:00 0
/bin/sh: line 1: 7040 Aborted /home/neoclust/rpm/temp/gambas-buildroot/usr/bin/gbc -ag
*** buffer overflow detected ***: /home/neoclust/rpm/temp/gambas-buildroot/usr/bin/gba terminated
======= Backtrace: =========
/lib/i686/libc.so.6(__chk_fail+0x41)[0x4011dba1]
/lib/i686/libc.so.6[0x4011e264]
/home/neoclust/rpm/temp/gambas-buildroot/usr/bin/gba[0x804a25a]
/lib/i686/libc.so.6(__libc_start_main+0xdc)[0x4005575c]
/home/neoclust/rpm/temp/gambas-buildroot/usr/bin/gba[0x8048ea1]
======= Memory map: ========
08048000-0804d000 r-xp 00000000 09:02 5368836 /home/neoclust/rpm/temp/gambas-buildroot/usr/bin/gba
0804d000-0804e000 rwxp 00004000 09:02 5368836 /home/neoclust/rpm/temp/gambas-buildroot/usr/bin/gba
0804e000-08070000 rwxp 0804e000 00:00 0 [heap]
40000000-40018000 r-xp 00000000 09:00 908325 /lib/ld-2.4.so
40018000-40019000 r-xp 00017000 09:00 908325 /lib/ld-2.4.so
40019000-4001a000 rwxp 00018000 09:00 908325 /lib/ld-2.4.so
4001a000-4001b000 rwxp 4001a000 00:00 0
40040000-40167000 r-xp 00000000 09:00 916481 /lib/i686/libc-2.4.so
40167000-40168000 r-xp 00126000 09:00 916481 /lib/i686/libc-2.4.so
40168000-4016a000 rwxp 00127000 09:00 916481 /lib/i686/libc-2.4.so
4016a000-4016e000 rwxp 4016a000 00:00 0
4016e000-40178000 r-xp 00000000 09:00 1536683 /lib/libgcc_s-4.1.2.so.1
40178000-40179000 rwxp 0000a000 09:00 1536683 /lib/libgcc_s-4.1.2.so.1
bfab0000-bfac6000 rw-p bfab0000 00:00 0 [stack]
bfffe000-bffff000 r-xp bfffe000 00:00 0
/bin/sh: line 1: 7041 Aborted /home/neoclust/rpm/temp/gambas-buildroot/usr/bin/gba
/usr/bin/install: cannot stat `gambas': No such file or directory
Compiling gambas-database-manager...
*** buffer overflow detected ***: /home/neoclust/rpm/temp/gambas-buildroot/usr/bin/gbc terminated
======= Backtrace: =========
/lib/i686/libc.so.6(__chk_fail+0x41)[0x4011dba1]
/lib/i686/libc.so.6[0x4011e264]
/home/neoclust/rpm/temp/gambas-buildroot/usr/bin/gbc[0x8053f82]
/lib/i686/libc.so.6(__libc_start_main+0xdc)[0x4005575c]
/home/neoclust/rpm/temp/gambas-buildroot/usr/bin/gbc[0x8049201]
======= Memory map: ========
08048000-08059000 r-xp 00000000 09:02 5354498 /home/neoclust/rpm/temp/gambas-buildroot/usr/bin/gbc
08059000-0805b000 rwxp 00011000 09:02 5354498 /home/neoclust/rpm/temp/gambas-buildroot/usr/bin/gbc
0805b000-0807c000 rwxp 0805b000 00:00 0 [heap]
40000000-40018000 r-xp 00000000 09:00 908325 /lib/ld-2.4.so
40018000-40019000 r-xp 00017000 09:00 908325 /lib/ld-2.4.so
40019000-4001a000 rwxp 00018000 09:00 908325 /lib/ld-2.4.so
4001a000-4001b000 rwxp 4001a000 00:00 0
40040000-40167000 r-xp 00000000 09:00 916481 /lib/i686/libc-2.4.so
40167000-40168000 r-xp 00126000 09:00 916481 /lib/i686/libc-2.4.so
40168000-4016a000 rwxp 00127000 09:00 916481 /lib/i686/libc-2.4.so
4016a000-4016e000 rwxp 4016a000 00:00 0
4016e000-40178000 r-xp 00000000 09:00 1536683 /lib/libgcc_s-4.1.2.so.1
40178000-40179000 rwxp 0000a000 09:00 1536683 /lib/libgcc_s-4.1.2.so.1
bfbec000-bfc01000 rw-p bfbec000 00:00 0 [stack]
bfffe000-bffff000 r-xp bfffe000 00:00 0
/bin/sh: line 1: 7044 Aborted /home/neoclust/rpm/temp/gambas-buildroot/usr/bin/gbc -ag
*** buffer overflow detected ***: /home/neoclust/rpm/temp/gambas-buildroot/usr/bin/gba terminated
======= Backtrace: =========
/lib/i686/libc.so.6(__chk_fail+0x41)[0x4011dba1]
/lib/i686/libc.so.6[0x4011e264]
/home/neoclust/rpm/temp/gambas-buildroot/usr/bin/gba[0x804a25a]
/lib/i686/libc.so.6(__libc_start_main+0xdc)[0x4005575c]
/home/neoclust/rpm/temp/gambas-buildroot/usr/bin/gba[0x8048ea1]
======= Memory map: ========
08048000-0804d000 r-xp 00000000 09:02 5368836 /home/neoclust/rpm/temp/gambas-buildroot/usr/bin/gba
0804d000-0804e000 rwxp 00004000 09:02 5368836 /home/neoclust/rpm/temp/gambas-buildroot/usr/bin/gba
0804e000-08070000 rwxp 0804e000 00:00 0 [heap]
40000000-40018000 r-xp 00000000 09:00 908325 /lib/ld-2.4.so
40018000-40019000 r-xp 00017000 09:00 908325 /lib/ld-2.4.so
40019000-4001a000 rwxp 00018000 09:00 908325 /lib/ld-2.4.so
4001a000-4001b000 rwxp 4001a000 00:00 0
40040000-40167000 r-xp 00000000 09:00 916481 /lib/i686/libc-2.4.so
40167000-40168000 r-xp 00126000 09:00 916481 /lib/i686/libc-2.4.so
40168000-4016a000 rwxp 00127000 09:00 916481 /lib/i686/libc-2.4.so
4016a000-4016e000 rwxp 4016a000 00:00 0
4016e000-40178000 r-xp 00000000 09:00 1536683 /lib/libgcc_s-4.1.2.so.1
40178000-40179000 rwxp 0000a000 09:00 1536683 /lib/libgcc_s-4.1.2.so.1
bfcfa000-bfd10000 rw-p bfcfa000 00:00 0 [stack]
bfffe000-bffff000 r-xp bfffe000 00:00 0
/bin/sh: line 1: 7045 Aborted /home/neoclust/rpm/temp/gambas-buildroot/usr/bin/gba
/usr/bin/install: cannot stat `gambas-database-manager': No such file or directory
make[2]: *** [install-exec-local] Error 1
make[2]: Leaving directory `/home/neoclust/rpm/BUILD/gambas-1.0.17'
make[1]: *** [install-am] Error 2
make[1]: Leaving directory `/home/neoclust/rpm/BUILD/gambas-1.0.17'
make: *** [install-recursive] Error 1
error: Bad exit status from /home/neoclust/rpm/temp/rpm-tmp.77413 (%install)
RPM build errors:
Bad exit status from /home/neoclust/rpm/temp/rpm-tmp.77413 (%install)