rendered paste bodyThis file contains any messages produced by compilers while
running configure, to aid debugging if configure makes a mistake.
It was created by configure, which was
generated by GNU Autoconf 2.59. Invocation command line was
$ ./configure
## --------- ##
## Platform. ##
## --------- ##
hostname = Geoffrey-Sneddons-Computer.local
uname -m = Power Macintosh
uname -r = 8.3.0
uname -s = Darwin
uname -v = Darwin Kernel Version 8.3.0: Mon Oct 3 20:04:04 PDT 2005; root:xnu-792.6.22.obj~2/RELEASE_PPC
/usr/bin/uname -p = powerpc
/bin/uname -X = unknown
/bin/arch = unknown
/usr/bin/arch -k = unknown
/usr/convex/getsysinfo = unknown
hostinfo = Mach kernel version:
Darwin Kernel Version 8.3.0: Mon Oct 3 20:04:04 PDT 2005; root:xnu-792.6.22.obj~2/RELEASE_PPC
Kernel configured for up to 2 processors.
2 processors are physically available.
Processor type: ppc970 (PowerPC 970)
Processors active: 0 1
Primary memory available: 4.50 gigabytes
Default processor set: 78 tasks, 219 threads, 2 processors
Load average: 0.61, Mach factor: 1.38
/bin/machine = unknown
/usr/bin/oslevel = unknown
/bin/universe = unknown
PATH: /usr/local/bin
PATH: /usr/local/sbin
PATH: ~/bin
PATH: /bin
PATH: /sbin
PATH: /usr/bin
PATH: /usr/sbin
## ----------- ##
## Core tests. ##
## ----------- ##
configure:1564: checking build system type
configure:1582: result: powerpc-apple-darwin8.3.0
configure:1590: checking host system type
configure:1604: result: powerpc-apple-darwin8.3.0
configure:1612: checking target system type
configure:1626: result: powerpc-apple-darwin8.3.0
configure:1654: checking for a BSD-compatible install
configure:1709: result: /usr/bin/install -c
configure:1720: checking whether build environment is sane
configure:1763: result: yes
configure:1796: checking for gawk
configure:1825: result: no
configure:1796: checking for mawk
configure:1825: result: no
configure:1796: checking for nawk
configure:1825: result: no
configure:1796: checking for awk
configure:1812: found /usr/bin/awk
configure:1822: result: awk
configure:1832: checking whether make sets $(MAKE)
configure:1852: result: yes
configure:2017: checking for whoami
configure:2033: found /usr/bin/whoami
configure:2044: result: yes
configure:2118: checking whether make sets $(MAKE)
configure:2138: result: yes
configure:2193: checking for gcc
configure:2209: found /usr/bin/gcc
configure:2219: result: gcc
configure:2463: checking for C compiler version
configure:2466: gcc --version </dev/null >&5
powerpc-apple-darwin8-gcc-4.0.0 (GCC) 4.0.0 (Apple Computer, Inc. build 5026)
Copyright (C) 2005 Free Software Foundation, Inc.
This is free software; see the source for copying conditions. There is NO
warranty; not even for MERCHANTABILITY or FITNESS FOR A PARTICULAR PURPOSE.
configure:2469: $? = 0
configure:2471: gcc -v </dev/null >&5
Using built-in specs.
Target: powerpc-apple-darwin8
Configured with: /private/var/tmp/gcc/gcc-5026.obj~19/src/configure --disable-checking --prefix=/usr --mandir=/share/man --enable-languages=c,objc,c++,obj-c++ --program-transform-name=/^[cg][^+.-]*$/s/$/-4.0/ --with-gxx-include-dir=/include/gcc/darwin/4.0/c++ --build=powerpc-apple-darwin8 --host=powerpc-apple-darwin8 --target=powerpc-apple-darwin8
Thread model: posix
gcc version 4.0.0 (Apple Computer, Inc. build 5026)
configure:2474: $? = 0
configure:2476: gcc -V </dev/null >&5
gcc: argument to `-V' is missing
configure:2479: $? = 1
configure:2502: checking for C compiler default output file name
configure:2505: gcc conftest.c >&5
configure:2508: $? = 0
configure:2554: result: a.out
configure:2559: checking whether the C compiler works
configure:2565: ./a.out
configure:2568: $? = 0
configure:2585: result: yes
configure:2592: checking whether we are cross compiling
configure:2594: result: no
configure:2597: checking for suffix of executables
configure:2599: gcc -o conftest conftest.c >&5
configure:2602: $? = 0
configure:2627: result:
configure:2633: checking for suffix of object files
configure:2654: gcc -c conftest.c >&5
configure:2657: $? = 0
configure:2679: result: o
configure:2683: checking whether we are using the GNU C compiler
configure:2707: gcc -c conftest.c >&5
configure:2713: $? = 0
configure:2717: test -z
|| test ! -s conftest.err
configure:2720: $? = 0
configure:2723: test -s conftest.o
configure:2726: $? = 0
configure:2739: result: yes
configure:2745: checking whether gcc accepts -g
configure:2766: gcc -c -g conftest.c >&5
configure:2772: $? = 0
configure:2776: test -z
|| test ! -s conftest.err
configure:2779: $? = 0
configure:2782: test -s conftest.o
configure:2785: $? = 0
configure:2796: result: yes
configure:2813: checking for gcc option to accept ANSI C
configure:2883: gcc -c -g -O2 conftest.c >&5
configure:2889: $? = 0
configure:2893: test -z
|| test ! -s conftest.err
configure:2896: $? = 0
configure:2899: test -s conftest.o
configure:2902: $? = 0
configure:2920: result: none needed
configure:2938: gcc -c -g -O2 conftest.c >&5
conftest.c:2: error: parse error before 'me'
configure:2944: $? = 1
configure: failed program was:
| #ifndef __cplusplus
| choke me
| #endif
configure:3096: checking for style of include used by make
configure:3124: result: GNU
configure:3152: checking dependency style of gcc
configure:3214: result: gcc3
configure:3271: checking for g++
configure:3287: found /usr/bin/g++
configure:3297: result: g++
configure:3313: checking for C++ compiler version
configure:3316: g++ --version </dev/null >&5
powerpc-apple-darwin8-g++-4.0.0 (GCC) 4.0.0 (Apple Computer, Inc. build 5026)
Copyright (C) 2005 Free Software Foundation, Inc.
This is free software; see the source for copying conditions. There is NO
warranty; not even for MERCHANTABILITY or FITNESS FOR A PARTICULAR PURPOSE.
configure:3319: $? = 0
configure:3321: g++ -v </dev/null >&5
Using built-in specs.
Target: powerpc-apple-darwin8
Configured with: /private/var/tmp/gcc/gcc-5026.obj~19/src/configure --disable-checking --prefix=/usr --mandir=/share/man --enable-languages=c,objc,c++,obj-c++ --program-transform-name=/^[cg][^+.-]*$/s/$/-4.0/ --with-gxx-include-dir=/include/gcc/darwin/4.0/c++ --build=powerpc-apple-darwin8 --host=powerpc-apple-darwin8 --target=powerpc-apple-darwin8
Thread model: posix
gcc version 4.0.0 (Apple Computer, Inc. build 5026)
configure:3324: $? = 0
configure:3326: g++ -V </dev/null >&5
g++: argument to `-V' is missing
configure:3329: $? = 1
configure:3332: checking whether we are using the GNU C++ compiler
configure:3356: g++ -c conftest.cc >&5
configure:3362: $? = 0
configure:3366: test -z
|| test ! -s conftest.err
configure:3369: $? = 0
configure:3372: test -s conftest.o
configure:3375: $? = 0
configure:3388: result: yes
configure:3394: checking whether g++ accepts -g
configure:3415: g++ -c -g conftest.cc >&5
configure:3421: $? = 0
configure:3425: test -z
|| test ! -s conftest.err
configure:3428: $? = 0
configure:3431: test -s conftest.o
configure:3434: $? = 0
configure:3445: result: yes
configure:3487: g++ -c -g -O2 conftest.cc >&5
configure:3493: $? = 0
configure:3497: test -z
|| test ! -s conftest.err
configure:3500: $? = 0
configure:3503: test -s conftest.o
configure:3506: $? = 0
configure:3532: g++ -c -g -O2 conftest.cc >&5
conftest.cc: In function 'int main()':
conftest.cc:18: error: 'exit' was not declared in this scope
configure:3538: $? = 1
configure: failed program was:
| /* confdefs.h. */
|
| #define PACKAGE_NAME ""
| #define PACKAGE_TARNAME ""
| #define PACKAGE_VERSION ""
| #define PACKAGE_STRING ""
| #define PACKAGE_BUGREPORT ""
| #define PACKAGE "bzflag"
| #define VERSION "2.0.5"
| #define BZ_BUILD_OS "darwin8.3.0"
| #define BZ_BUILD_USER "geoffrey"
| #define BUILD_REGEX 1
| /* end confdefs.h. */
|
| int
| main ()
| {
| exit (42);
| ;
| return 0;
| }
configure:3487: g++ -c -g -O2 conftest.cc >&5
/usr/include/stdlib.h:158: error: declaration of 'void std::exit(int)' throws different exceptions
conftest.cc:14: error: than previous declaration 'void std::exit(int) throw ()'
configure:3493: $? = 1
configure: failed program was:
| /* confdefs.h. */
|
| #define PACKAGE_NAME ""
| #define PACKAGE_TARNAME ""
| #define PACKAGE_VERSION ""
| #define PACKAGE_STRING ""
| #define PACKAGE_BUGREPORT ""
| #define PACKAGE "bzflag"
| #define VERSION "2.0.5"
| #define BZ_BUILD_OS "darwin8.3.0"
| #define BZ_BUILD_USER "geoffrey"
| #define BUILD_REGEX 1
| /* end confdefs.h. */
| extern "C" void std::exit (int) throw (); using std::exit;
| #include <stdlib.h>
| int
| main ()
| {
| exit (42);
| ;
| return 0;
| }
configure:3487: g++ -c -g -O2 conftest.cc >&5
configure:3493: $? = 0
configure:3497: test -z
|| test ! -s conftest.err
configure:3500: $? = 0
configure:3503: test -s conftest.o
configure:3506: $? = 0
configure:3532: g++ -c -g -O2 conftest.cc >&5
configure:3538: $? = 0
configure:3542: test -z
|| test ! -s conftest.err
configure:3545: $? = 0
configure:3548: test -s conftest.o
configure:3551: $? = 0
configure:3576: checking dependency style of g++
configure:3638: result: gcc3
configure:3646: checking for ccache
configure:3679: result: no
configure:3730: checking for windres
configure:3757: result: :
configure:3828: checking whether ln -s works
configure:3832: result: yes
configure:3880: checking for ranlib
configure:3896: found /usr/bin/ranlib
configure:3907: result: ranlib
configure:4020: checking for a sed that does not truncate output
configure:4074: result: /usr/bin/sed
configure:4077: checking for egrep
configure:4087: result: grep -E
configure:4103: checking for ld used by gcc
configure:4170: result: /usr/bin/ld
configure:4179: checking if the linker (/usr/bin/ld) is GNU ld
configure:4194: result: no
configure:4199: checking for /usr/bin/ld option to reload object files
configure:4206: result: -r
configure:4215: checking for BSD-compatible nm
configure:4257: result: /usr/bin/nm -p
configure:4261: checking how to recognise dependent libraries
configure:4461: result: pass_all
configure:4674: checking how to run the C preprocessor
configure:4709: gcc -E conftest.c
configure:4715: $? = 0
configure:4747: gcc -E conftest.c
conftest.c:17:28: error: ac_nonexistent.h: No such file or directory
configure:4753: $? = 1
configure: failed program was:
| /* confdefs.h. */
|
| #define PACKAGE_NAME ""
| #define PACKAGE_TARNAME ""
| #define PACKAGE_VERSION ""
| #define PACKAGE_STRING ""
| #define PACKAGE_BUGREPORT ""
| #define PACKAGE "bzflag"
| #define VERSION "2.0.5"
| #define BZ_BUILD_OS "darwin8.3.0"
| #define BZ_BUILD_USER "geoffrey"
| #define BUILD_REGEX 1
| #ifdef __cplusplus
| extern "C" void std::exit (int); using std::exit;
| #endif
| /* end confdefs.h. */
| #include <ac_nonexistent.h>
configure:4792: result: gcc -E
configure:4816: gcc -E conftest.c
configure:4822: $? = 0
configure:4854: gcc -E conftest.c
conftest.c:17:28: error: ac_nonexistent.h: No such file or directory
configure:4860: $? = 1
configure: failed program was:
| /* confdefs.h. */
|
| #define PACKAGE_NAME ""
| #define PACKAGE_TARNAME ""
| #define PACKAGE_VERSION ""
| #define PACKAGE_STRING ""
| #define PACKAGE_BUGREPORT ""
| #define PACKAGE "bzflag"
| #define VERSION "2.0.5"
| #define BZ_BUILD_OS "darwin8.3.0"
| #define BZ_BUILD_USER "geoffrey"
| #define BUILD_REGEX 1
| #ifdef __cplusplus
| extern "C" void std::exit (int); using std::exit;
| #endif
| /* end confdefs.h. */
| #include <ac_nonexistent.h>
configure:4904: checking for ANSI C header files
configure:4929: gcc -c -g -O2 conftest.c >&5
configure:4935: $? = 0
configure:4939: test -z
|| test ! -s conftest.err
configure:4942: $? = 0
configure:4945: test -s conftest.o
configure:4948: $? = 0
configure:5034: gcc -o conftest -g -O2 conftest.c >&5
conftest.c: In function 'main':
conftest.c:34: warning: incompatible implicit declaration of built-in function 'exit'
configure:5037: $? = 0
configure:5039: ./conftest
configure:5042: $? = 0
configure:5057: result: yes
configure:5081: checking for sys/types.h
configure:5097: gcc -c -g -O2 conftest.c >&5
configure:5103: $? = 0
configure:5107: test -z
|| test ! -s conftest.err
configure:5110: $? = 0
configure:5113: test -s conftest.o
configure:5116: $? = 0
configure:5127: result: yes
configure:5081: checking for sys/stat.h
configure:5097: gcc -c -g -O2 conftest.c >&5
configure:5103: $? = 0
configure:5107: test -z
|| test ! -s conftest.err
configure:5110: $? = 0
configure:5113: test -s conftest.o
configure:5116: $? = 0
configure:5127: result: yes
configure:5081: checking for stdlib.h
configure:5097: gcc -c -g -O2 conftest.c >&5
configure:5103: $? = 0
configure:5107: test -z
|| test ! -s conftest.err
configure:5110: $? = 0
configure:5113: test -s conftest.o
configure:5116: $? = 0
configure:5127: result: yes
configure:5081: checking for string.h
configure:5097: gcc -c -g -O2 conftest.c >&5
configure:5103: $? = 0
configure:5107: test -z
|| test ! -s conftest.err
configure:5110: $? = 0
configure:5113: test -s conftest.o
configure:5116: $? = 0
configure:5127: result: yes
configure:5081: checking for memory.h
configure:5097: gcc -c -g -O2 conftest.c >&5
configure:5103: $? = 0
configure:5107: test -z
|| test ! -s conftest.err
configure:5110: $? = 0
configure:5113: test -s conftest.o
configure:5116: $? = 0
configure:5127: result: yes
configure:5081: checking for strings.h
configure:5097: gcc -c -g -O2 conftest.c >&5
configure:5103: $? = 0
configure:5107: test -z
|| test ! -s conftest.err
configure:5110: $? = 0
configure:5113: test -s conftest.o
configure:5116: $? = 0
configure:5127: result: yes
configure:5081: checking for inttypes.h
configure:5097: gcc -c -g -O2 conftest.c >&5
configure:5103: $? = 0
configure:5107: test -z
|| test ! -s conftest.err
configure:5110: $? = 0
configure:5113: test -s conftest.o
configure:5116: $? = 0
configure:5127: result: yes
configure:5081: checking for stdint.h
configure:5097: gcc -c -g -O2 conftest.c >&5
configure:5103: $? = 0
configure:5107: test -z
|| test ! -s conftest.err
configure:5110: $? = 0
configure:5113: test -s conftest.o
configure:5116: $? = 0
configure:5127: result: yes
configure:5081: checking for unistd.h
configure:5097: gcc -c -g -O2 conftest.c >&5
configure:5103: $? = 0
configure:5107: test -z
|| test ! -s conftest.err
configure:5110: $? = 0
configure:5113: test -s conftest.o
configure:5116: $? = 0
configure:5127: result: yes
configure:5153: checking dlfcn.h usability
configure:5165: gcc -c -g -O2 conftest.c >&5
configure:5171: $? = 0
configure:5175: test -z
|| test ! -s conftest.err
configure:5178: $? = 0
configure:5181: test -s conftest.o
configure:5184: $? = 0
configure:5194: result: yes
configure:5198: checking dlfcn.h presence
configure:5208: gcc -E conftest.c
configure:5214: $? = 0
configure:5234: result: yes
configure:5269: checking for dlfcn.h
configure:5276: result: yes
configure:5294: checking how to run the C++ preprocessor
configure:5325: g++ -E conftest.cc
configure:5331: $? = 0
configure:5363: g++ -E conftest.cc
conftest.cc:28:28: error: ac_nonexistent.h: No such file or directory
configure:5369: $? = 1
configure: failed program was:
| /* confdefs.h. */
|
| #define PACKAGE_NAME ""
| #define PACKAGE_TARNAME ""
| #define PACKAGE_VERSION ""
| #define PACKAGE_STRING ""
| #define PACKAGE_BUGREPORT ""
| #define PACKAGE "bzflag"
| #define VERSION "2.0.5"
| #define BZ_BUILD_OS "darwin8.3.0"
| #define BZ_BUILD_USER "geoffrey"
| #define BUILD_REGEX 1
| #ifdef __cplusplus
| extern "C" void std::exit (int); using std::exit;
| #endif
| #define STDC_HEADERS 1
| #define HAVE_SYS_TYPES_H 1
| #define HAVE_SYS_STAT_H 1
| #define HAVE_STDLIB_H 1
| #define HAVE_STRING_H 1
| #define HAVE_MEMORY_H 1
| #define HAVE_STRINGS_H 1
| #define HAVE_INTTYPES_H 1
| #define HAVE_STDINT_H 1
| #define HAVE_UNISTD_H 1
| #define HAVE_DLFCN_H 1
| /* end confdefs.h. */
| #include <ac_nonexistent.h>
configure:5408: result: g++ -E
configure:5432: g++ -E conftest.cc
configure:5438: $? = 0
configure:5470: g++ -E conftest.cc
conftest.cc:28:28: error: ac_nonexistent.h: No such file or directory
configure:5476: $? = 1
configure: failed program was:
| /* confdefs.h. */
|
| #define PACKAGE_NAME ""
| #define PACKAGE_TARNAME ""
| #define PACKAGE_VERSION ""
| #define PACKAGE_STRING ""
| #define PACKAGE_BUGREPORT ""
| #define PACKAGE "bzflag"
| #define VERSION "2.0.5"
| #define BZ_BUILD_OS "darwin8.3.0"
| #define BZ_BUILD_USER "geoffrey"
| #define BUILD_REGEX 1
| #ifdef __cplusplus
| extern "C" void std::exit (int); using std::exit;
| #endif
| #define STDC_HEADERS 1
| #define HAVE_SYS_TYPES_H 1
| #define HAVE_SYS_STAT_H 1
| #define HAVE_STDLIB_H 1
| #define HAVE_STRING_H 1
| #define HAVE_MEMORY_H 1
| #define HAVE_STRINGS_H 1
| #define HAVE_INTTYPES_H 1
| #define HAVE_STDINT_H 1
| #define HAVE_UNISTD_H 1
| #define HAVE_DLFCN_H 1
| /* end confdefs.h. */
| #include <ac_nonexistent.h>
configure:5571: checking for g77
configure:5600: result: no
configure:5571: checking for f77
configure:5600: result: no
configure:5571: checking for xlf
configure:5600: result: no
configure:5571: checking for frt
configure:5600: result: no
configure:5571: checking for pgf77
configure:5600: result: no
configure:5571: checking for fort77
configure:5600: result: no
configure:5571: checking for fl32
configure:5600: result: no
configure:5571: checking for af77
configure:5600: result: no
configure:5571: checking for f90
configure:5600: result: no
configure:5571: checking for xlf90
configure:5600: result: no
configure:5571: checking for pgf90
configure:5600: result: no
configure:5571: checking for epcf90
configure:5600: result: no
configure:5571: checking for f95
configure:5600: result: no
configure:5571: checking for fort
configure:5600: result: no
configure:5571: checking for xlf95
configure:5600: result: no
configure:5571: checking for ifc
configure:5600: result: no
configure:5571: checking for efc
configure:5600: result: no
configure:5571: checking for pgf95
configure:5600: result: no
configure:5571: checking for lf95
configure:5600: result: no
configure:5571: checking for gfortran
configure:5600: result: no
configure:5615: checking for Fortran 77 compiler version
configure:5615: --version </dev/null >&5
./configure: line 1: --version: command not found
configure:5618: $? = 127
configure:5620: -v </dev/null >&5
./configure: line 1: -v: command not found
configure:5623: $? = 127
configure:5625: -V </dev/null >&5
./configure: line 1: -V: command not found
configure:5628: $? = 127
configure:5636: checking whether we are using the GNU Fortran 77 compiler
configure:5650: -c conftest.F >&5
./configure: line 1: -c: command not found
configure:5656: $? = 127
configure: failed program was:
| program main
| #ifndef __GNUC__
| choke me
| #endif
|
| end
configure:5682: result: no
configure:5688: checking whether accepts -g
configure:5700: -c -g conftest.f >&5
./configure: line 1: -c: command not found
configure:5706: $? = 127
configure: failed program was:
| program main
|
| end
configure:5731: result: no
configure:5761: checking the maximum length of command line arguments
configure:5820: result: 65536
configure:5831: checking command to parse /usr/bin/nm -p output from gcc object
configure:5920: gcc -c -g -O2 conftest.c >&5
configure:5923: $? = 0
configure:5927: /usr/bin/nm -p conftest.o \| sed -n -e 's/^.*[ ]\([BCDEGRST][BCDEGRST]*\)[ ][ ]*\(\)\([_A-Za-z][_A-Za-z0-9]*\)$/\1 \2\3 \3/p' \> conftest.nm
configure:5930: $? = 0
cannot find nm_test_var in conftest.nm
configure:5920: gcc -c -g -O2 conftest.c >&5
configure:5923: $? = 0
configure:5927: /usr/bin/nm -p conftest.o \| sed -n -e 's/^.*[ ]\([BCDEGRST][BCDEGRST]*\)[ ][ ]*\(_\)\([_A-Za-z][_A-Za-z0-9]*\)$/\1 \2\3 \3/p' \> conftest.nm
configure:5930: $? = 0
configure:5982: gcc -o conftest -g -O2 conftest.c conftstm.o >&5
configure:5985: $? = 0
configure:6023: result: ok
configure:6027: checking for objdir
configure:6042: result: .libs
configure:6135: checking for ar
configure:6151: found /usr/bin/ar
configure:6162: result: ar
configure:6215: checking for ranlib
configure:6242: result: ranlib
configure:6295: checking for strip
configure:6311: found /usr/bin/strip
configure:6322: result: strip
configure:6584: checking if gcc static flag works
configure:6607: result: yes
configure:6624: checking if gcc supports -fno-rtti -fno-exceptions
configure:6645: gcc -c -g -O2 -fno-rtti -fno-exceptions conftest.c >&5
cc1: warning: command line option "-fno-rtti" is valid for C++/ObjC++ but not for C
configure:6649: $? = 0
configure:6657: result: no
configure:6672: checking for gcc option to produce PIC
configure:6849: result: -fno-common
configure:6856: checking if gcc PIC flag -fno-common works
configure:6877: gcc -c -g -O2 -fno-common -DPIC conftest.c >&5
configure:6881: $? = 0
configure:6889: result: yes
configure:6913: checking if gcc supports -c -o file.o
configure:6944: gcc -c -g -O2 -o out/conftest2.o conftest.c >&5
configure:6948: $? = 0
configure:6962: result: yes
configure:6988: checking whether the gcc linker (/usr/bin/ld) supports shared libraries
configure:7816: result: yes
configure:7887: checking how to hardcode library paths into programs
configure:7912: result: immediate
configure:7926: checking whether stripping libraries is possible
configure:7947: result: no
configure:7953: checking dynamic linker characteristics
configure:8464: result: darwin8.3.0 dyld
configure:8495: checking for dlopen in -ldl
configure:8525: gcc -o conftest -g -O2 conftest.c -ldl >&5
configure:8531: $? = 0
configure:8535: test -z
|| test ! -s conftest.err
configure:8538: $? = 0
configure:8541: test -s conftest
configure:8544: $? = 0
configure:8557: result: yes
configure:9062: checking whether a program can dlopen itself
configure:9134: gcc -o conftest -g -O2 -DHAVE_DLFCN_H conftest.c -ldl >&5
configure: In function 'main':
configure:9133: warning: incompatible implicit declaration of built-in function 'exit'
configure:9137: $? = 0
configure:9155: result: yes
configure:9160: checking whether a statically linked program can dlopen itself
configure:9232: gcc -o conftest -g -O2 -DHAVE_DLFCN_H conftest.c -ldl >&5
configure: In function 'main':
configure:9231: warning: incompatible implicit declaration of built-in function 'exit'
configure:9235: $? = 0
configure:9253: result: yes
configure:9276: checking if libtool supports shared libraries
configure:9278: result: yes
configure:9281: checking whether to build shared libraries
configure:9344: result: no
configure:9347: checking whether to build static libraries
configure:9351: result: yes
configure:9442: creating libtool
configure:9989: checking for ld used by g++
configure:10056: result: /usr/bin/ld
configure:10065: checking if the linker (/usr/bin/ld) is GNU ld
configure:10080: result: no
configure:10131: checking whether the g++ linker (/usr/bin/ld) supports shared libraries
configure:10960: result: yes
configure:10978: g++ -c -g -O2 conftest.cc >&5
configure:10981: $? = 0
configure:11077: checking for g++ option to produce PIC
configure:11329: result: -fno-common
configure:11336: checking if g++ PIC flag -fno-common works
configure:11357: g++ -c -g -O2 -fno-common -DPIC conftest.cc >&5
configure:11361: $? = 0
configure:11369: result: yes
configure:11393: checking if g++ supports -c -o file.o
configure:11424: g++ -c -g -O2 -o out/conftest2.o conftest.cc >&5
configure:11428: $? = 0
configure:11442: result: yes
configure:11468: checking whether the g++ linker (/usr/bin/ld) supports shared libraries
configure:11493: result: yes
configure:11564: checking how to hardcode library paths into programs
configure:11589: result: immediate
configure:11603: checking whether stripping libraries is possible
configure:11624: result: no
configure:11630: checking dynamic linker characteristics
configure:12141: result: darwin8.3.0 dyld
configure:12172: checking for dlopen in -ldl
configure:12234: result: yes
configure:12739: checking whether a program can dlopen itself
configure:12832: result: yes
configure:12837: checking whether a statically linked program can dlopen itself
configure:12930: result: yes
configure:19265: checking for pod2man
configure:19281: found /usr/bin/pod2man
configure:19292: result: yes
configure:19316: checking for ar
configure:19342: result: ar
configure:19351: checking for compress in -lz
configure:19381: gcc -o conftest -g -O2 conftest.c -lz >&5
configure:19387: $? = 0
configure:19391: test -z
|| test ! -s conftest.err
configure:19394: $? = 0
configure:19397: test -s conftest
configure:19400: $? = 0
configure:19413: result: yes
configure:19442: checking for curl >= 7.10.0
configure:19452: result: 7.15.0
configure:19546: checking for artificial intelligence for bz's robots
configure:19548: result: not found
configure:19552: checking for ANSI C header files
configure:19705: result: yes
configure:19742: checking cstdlib usability
configure:19754: g++ -c -g -O2 conftest.cc >&5
configure:19760: $? = 0
configure:19764: test -z
|| test ! -s conftest.err
configure:19767: $? = 0
configure:19770: test -s conftest.o
configure:19773: $? = 0
configure:19783: result: yes
configure:19787: checking cstdlib presence
configure:19797: g++ -E conftest.cc
configure:19803: $? = 0
configure:19823: result: yes
configure:19858: checking for cstdlib
configure:19865: result: yes
configure:19742: checking cstdio usability
configure:19754: g++ -c -g -O2 conftest.cc >&5
configure:19760: $? = 0
configure:19764: test -z
|| test ! -s conftest.err
configure:19767: $? = 0
configure:19770: test -s conftest.o
configure:19773: $? = 0
configure:19783: result: yes
configure:19787: checking cstdio presence
configure:19797: g++ -E conftest.cc
configure:19803: $? = 0
configure:19823: result: yes
configure:19858: checking for cstdio
configure:19865: result: yes
configure:19742: checking cstring usability
configure:19754: g++ -c -g -O2 conftest.cc >&5
configure:19760: $? = 0
configure:19764: test -z
|| test ! -s conftest.err
configure:19767: $? = 0
configure:19770: test -s conftest.o
configure:19773: $? = 0
configure:19783: result: yes
configure:19787: checking cstring presence
configure:19797: g++ -E conftest.cc
configure:19803: $? = 0
configure:19823: result: yes
configure:19858: checking for cstring
configure:19865: result: yes
configure:20074: checking GL/glx.h usability
configure:20086: gcc -c -g -O2 conftest.c >&5
conftest.c:66:20: error: GL/glx.h: No such file or directory
configure:20092: $? = 1
configure: failed program was:
| /* confdefs.h. */
|
| #define PACKAGE_NAME ""
| #define PACKAGE_TARNAME ""
| #define PACKAGE_VERSION ""
| #define PACKAGE_STRING ""
| #define PACKAGE_BUGREPORT ""
| #define PACKAGE "bzflag"
| #define VERSION "2.0.5"
| #define BZ_BUILD_OS "darwin8.3.0"
| #define BZ_BUILD_USER "geoffrey"
| #define BUILD_REGEX 1
| #ifdef __cplusplus
| extern "C" void std::exit (int); using std::exit;
| #endif
| #define STDC_HEADERS 1
| #define HAVE_SYS_TYPES_H 1
| #define HAVE_SYS_STAT_H 1
| #define HAVE_STDLIB_H 1
| #define HAVE_STRING_H 1
| #define HAVE_MEMORY_H 1
| #define HAVE_STRINGS_H 1
| #define HAVE_INTTYPES_H 1
| #define HAVE_STDINT_H 1
| #define HAVE_UNISTD_H 1
| #define HAVE_DLFCN_H 1
| #define STDC_HEADERS 1
| #define HAVE_CSTDLIB 1
| #define HAVE_CSTDIO 1
| #define HAVE_CSTRING 1
| /* end confdefs.h. */
| #include <stdio.h>
| #if HAVE_SYS_TYPES_H
| # include <sys/types.h>
| #endif
| #if HAVE_SYS_STAT_H
| # include <sys/stat.h>
| #endif
| #if STDC_HEADERS
| # include <stdlib.h>
| # include <stddef.h>
| #else
| # if HAVE_STDLIB_H
| # include <stdlib.h>
| # endif
| #endif
| #if HAVE_STRING_H
| # if !STDC_HEADERS && HAVE_MEMORY_H
| # include <memory.h>
| # endif
| # include <string.h>
| #endif
| #if HAVE_STRINGS_H
| # include <strings.h>
| #endif
| #if HAVE_INTTYPES_H
| # include <inttypes.h>
| #else
| # if HAVE_STDINT_H
| # include <stdint.h>
| # endif
| #endif
| #if HAVE_UNISTD_H
| # include <unistd.h>
| #endif
| #include <GL/glx.h>
configure:20115: result: no
configure:20119: checking GL/glx.h presence
configure:20129: gcc -E conftest.c
conftest.c:32:20: error: GL/glx.h: No such file or directory
configure:20135: $? = 1
configure: failed program was:
| /* confdefs.h. */
|
| #define PACKAGE_NAME ""
| #define PACKAGE_TARNAME ""
| #define PACKAGE_VERSION ""
| #define PACKAGE_STRING ""
| #define PACKAGE_BUGREPORT ""
| #define PACKAGE "bzflag"
| #define VERSION "2.0.5"
| #define BZ_BUILD_OS "darwin8.3.0"
| #define BZ_BUILD_USER "geoffrey"
| #define BUILD_REGEX 1
| #ifdef __cplusplus
| extern "C" void std::exit (int); using std::exit;
| #endif
| #define STDC_HEADERS 1
| #define HAVE_SYS_TYPES_H 1
| #define HAVE_SYS_STAT_H 1
| #define HAVE_STDLIB_H 1
| #define HAVE_STRING_H 1
| #define HAVE_MEMORY_H 1
| #define HAVE_STRINGS_H 1
| #define HAVE_INTTYPES_H 1
| #define HAVE_STDINT_H 1
| #define HAVE_UNISTD_H 1
| #define HAVE_DLFCN_H 1
| #define STDC_HEADERS 1
| #define HAVE_CSTDLIB 1
| #define HAVE_CSTDIO 1
| #define HAVE_CSTRING 1
| /* end confdefs.h. */
| #include <GL/glx.h>
configure:20155: result: no
configure:20190: checking for GL/glx.h
configure:20197: result: no
configure:20074: checking SDL/SDL.h usability
configure:20086: gcc -c -g -O2 conftest.c >&5
configure:20092: $? = 0
configure:20096: test -z
|| test ! -s conftest.err
configure:20099: $? = 0
configure:20102: test -s conftest.o
configure:20105: $? = 0
configure:20115: result: yes
configure:20119: checking SDL/SDL.h presence
configure:20129: gcc -E conftest.c
configure:20135: $? = 0
configure:20155: result: yes
configure:20190: checking for SDL/SDL.h
configure:20197: result: yes
configure:20074: checking X11/Xlib.h usability
configure:20086: gcc -c -g -O2 conftest.c >&5
configure:20092: $? = 0
configure:20096: test -z
|| test ! -s conftest.err
configure:20099: $? = 0
configure:20102: test -s conftest.o
configure:20105: $? = 0
configure:20115: result: yes
configure:20119: checking X11/Xlib.h presence
configure:20129: gcc -E conftest.c
configure:20135: $? = 0
configure:20155: result: yes
configure:20190: checking for X11/Xlib.h
configure:20197: result: yes
configure:20074: checking bstring.h usability
configure:20086: gcc -c -g -O2 conftest.c >&5
conftest.c:68:21: error: bstring.h: No such file or directory
configure:20092: $? = 1
configure: failed program was:
| /* confdefs.h. */
|
| #define PACKAGE_NAME ""
| #define PACKAGE_TARNAME ""
| #define PACKAGE_VERSION ""
| #define PACKAGE_STRING ""
| #define PACKAGE_BUGREPORT ""
| #define PACKAGE "bzflag"
| #define VERSION "2.0.5"
| #define BZ_BUILD_OS "darwin8.3.0"
| #define BZ_BUILD_USER "geoffrey"
| #define BUILD_REGEX 1
| #ifdef __cplusplus
| extern "C" void std::exit (int); using std::exit;
| #endif
| #define STDC_HEADERS 1
| #define HAVE_SYS_TYPES_H 1
| #define HAVE_SYS_STAT_H 1
| #define HAVE_STDLIB_H 1
| #define HAVE_STRING_H 1
| #define HAVE_MEMORY_H 1
| #define HAVE_STRINGS_H 1
| #define HAVE_INTTYPES_H 1
| #define HAVE_STDINT_H 1
| #define HAVE_UNISTD_H 1
| #define HAVE_DLFCN_H 1
| #define STDC_HEADERS 1
| #define HAVE_CSTDLIB 1
| #define HAVE_CSTDIO 1
| #define HAVE_CSTRING 1
| #define HAVE_SDL_SDL_H 1
| #define HAVE_X11_XLIB_H 1
| /* end confdefs.h. */
| #include <stdio.h>
| #if HAVE_SYS_TYPES_H
| # include <sys/types.h>
| #endif
| #if HAVE_SYS_STAT_H
| # include <sys/stat.h>
| #endif
| #if STDC_HEADERS
| # include <stdlib.h>
| # include <stddef.h>
| #else
| # if HAVE_STDLIB_H
| # include <stdlib.h>
| # endif
| #endif
| #if HAVE_STRING_H
| # if !STDC_HEADERS && HAVE_MEMORY_H
| # include <memory.h>
| # endif
| # include <string.h>
| #endif
| #if HAVE_STRINGS_H
| # include <strings.h>
| #endif
| #if HAVE_INTTYPES_H
| # include <inttypes.h>
| #else
| # if HAVE_STDINT_H
| # include <stdint.h>
| # endif
| #endif
| #if HAVE_UNISTD_H
| # include <unistd.h>
| #endif
| #include <bstring.h>
configure:20115: result: no
configure:20119: checking bstring.h presence
configure:20129: gcc -E conftest.c
conftest.c:34:21: error: bstring.h: No such file or directory
configure:20135: $? = 1
configure: failed program was:
| /* confdefs.h. */
|
| #define PACKAGE_NAME ""
| #define PACKAGE_TARNAME ""
| #define PACKAGE_VERSION ""
| #define PACKAGE_STRING ""
| #define PACKAGE_BUGREPORT ""
| #define PACKAGE "bzflag"
| #define VERSION "2.0.5"
| #define BZ_BUILD_OS "darwin8.3.0"
| #define BZ_BUILD_USER "geoffrey"
| #define BUILD_REGEX 1
| #ifdef __cplusplus
| extern "C" void std::exit (int); using std::exit;
| #endif
| #define STDC_HEADERS 1
| #define HAVE_SYS_TYPES_H 1
| #define HAVE_SYS_STAT_H 1
| #define HAVE_STDLIB_H 1
| #define HAVE_STRING_H 1
| #define HAVE_MEMORY_H 1
| #define HAVE_STRINGS_H 1
| #define HAVE_INTTYPES_H 1
| #define HAVE_STDINT_H 1
| #define HAVE_UNISTD_H 1
| #define HAVE_DLFCN_H 1
| #define STDC_HEADERS 1
| #define HAVE_CSTDLIB 1
| #define HAVE_CSTDIO 1
| #define HAVE_CSTRING 1
| #define HAVE_SDL_SDL_H 1
| #define HAVE_X11_XLIB_H 1
| /* end confdefs.h. */
| #include <bstring.h>
configure:20155: result: no
configure:20190: checking for bstring.h
configure:20197: result: no
configure:20074: checking linux/input.h usability
configure:20086: gcc -c -g -O2 conftest.c >&5
conftest.c:68:25: error: linux/input.h: No such file or directory
configure:20092: $? = 1
configure: failed program was:
| /* confdefs.h. */
|
| #define PACKAGE_NAME ""
| #define PACKAGE_TARNAME ""
| #define PACKAGE_VERSION ""
| #define PACKAGE_STRING ""
| #define PACKAGE_BUGREPORT ""
| #define PACKAGE "bzflag"
| #define VERSION "2.0.5"
| #define BZ_BUILD_OS "darwin8.3.0"
| #define BZ_BUILD_USER "geoffrey"
| #define BUILD_REGEX 1
| #ifdef __cplusplus
| extern "C" void std::exit (int); using std::exit;
| #endif
| #define STDC_HEADERS 1
| #define HAVE_SYS_TYPES_H 1
| #define HAVE_SYS_STAT_H 1
| #define HAVE_STDLIB_H 1
| #define HAVE_STRING_H 1
| #define HAVE_MEMORY_H 1
| #define HAVE_STRINGS_H 1
| #define HAVE_INTTYPES_H 1
| #define HAVE_STDINT_H 1
| #define HAVE_UNISTD_H 1
| #define HAVE_DLFCN_H 1
| #define STDC_HEADERS 1
| #define HAVE_CSTDLIB 1
| #define HAVE_CSTDIO 1
| #define HAVE_CSTRING 1
| #define HAVE_SDL_SDL_H 1
| #define HAVE_X11_XLIB_H 1
| /* end confdefs.h. */
| #include <stdio.h>
| #if HAVE_SYS_TYPES_H
| # include <sys/types.h>
| #endif
| #if HAVE_SYS_STAT_H
| # include <sys/stat.h>
| #endif
| #if STDC_HEADERS
| # include <stdlib.h>
| # include <stddef.h>
| #else
| # if HAVE_STDLIB_H
| # include <stdlib.h>
| # endif
| #endif
| #if HAVE_STRING_H
| # if !STDC_HEADERS && HAVE_MEMORY_H
| # include <memory.h>
| # endif
| # include <string.h>
| #endif
| #if HAVE_STRINGS_H
| # include <strings.h>
| #endif
| #if HAVE_INTTYPES_H
| # include <inttypes.h>
| #else
| # if HAVE_STDINT_H
| # include <stdint.h>
| # endif
| #endif
| #if HAVE_UNISTD_H
| # include <unistd.h>
| #endif
| #include <linux/input.h>
configure:20115: result: no
configure:20119: checking linux/input.h presence
configure:20129: gcc -E conftest.c
conftest.c:34:25: error: linux/input.h: No such file or directory
configure:20135: $? = 1
configure: failed program was:
| /* confdefs.h. */
|
| #define PACKAGE_NAME ""
| #define PACKAGE_TARNAME ""
| #define PACKAGE_VERSION ""
| #define PACKAGE_STRING ""
| #define PACKAGE_BUGREPORT ""
| #define PACKAGE "bzflag"
| #define VERSION "2.0.5"
| #define BZ_BUILD_OS "darwin8.3.0"
| #define BZ_BUILD_USER "geoffrey"
| #define BUILD_REGEX 1
| #ifdef __cplusplus
| extern "C" void std::exit (int); using std::exit;
| #endif
| #define STDC_HEADERS 1
| #define HAVE_SYS_TYPES_H 1
| #define HAVE_SYS_STAT_H 1
| #define HAVE_STDLIB_H 1
| #define HAVE_STRING_H 1
| #define HAVE_MEMORY_H 1
| #define HAVE_STRINGS_H 1
| #define HAVE_INTTYPES_H 1
| #define HAVE_STDINT_H 1
| #define HAVE_UNISTD_H 1
| #define HAVE_DLFCN_H 1
| #define STDC_HEADERS 1
| #define HAVE_CSTDLIB 1
| #define HAVE_CSTDIO 1
| #define HAVE_CSTRING 1
| #define HAVE_SDL_SDL_H 1
| #define HAVE_X11_XLIB_H 1
| /* end confdefs.h. */
| #include <linux/input.h>
configure:20155: result: no
configure:20190: checking for linux/input.h
configure:20197: result: no
configure:20065: checking for stdint.h
configure:20070: result: yes
configure:20074: checking sys/param.h usability
configure:20086: gcc -c -g -O2 conftest.c >&5
configure:20092: $? = 0
configure:20096: test -z
|| test ! -s conftest.err
configure:20099: $? = 0
configure:20102: test -s conftest.o
configure:20105: $? = 0
configure:20115: result: yes
configure:20119: checking sys/param.h presence
configure:20129: gcc -E conftest.c
configure:20135: $? = 0
configure:20155: result: yes
configure:20190: checking for sys/param.h
configure:20197: result: yes
configure:20065: checking for unistd.h
configure:20070: result: yes
configure:20074: checking values.h usability
configure:20086: gcc -c -g -O2 conftest.c >&5
conftest.c:71:20: error: values.h: No such file or directory
configure:20092: $? = 1
configure: failed program was:
| /* confdefs.h. */
|
| #define PACKAGE_NAME ""
| #define PACKAGE_TARNAME ""
| #define PACKAGE_VERSION ""
| #define PACKAGE_STRING ""
| #define PACKAGE_BUGREPORT ""
| #define PACKAGE "bzflag"
| #define VERSION "2.0.5"
| #define BZ_BUILD_OS "darwin8.3.0"
| #define BZ_BUILD_USER "geoffrey"
| #define BUILD_REGEX 1
| #ifdef __cplusplus
| extern "C" void std::exit (int); using std::exit;
| #endif
| #define STDC_HEADERS 1
| #define HAVE_SYS_TYPES_H 1
| #define HAVE_SYS_STAT_H 1
| #define HAVE_STDLIB_H 1
| #define HAVE_STRING_H 1
| #define HAVE_MEMORY_H 1
| #define HAVE_STRINGS_H 1
| #define HAVE_INTTYPES_H 1
| #define HAVE_STDINT_H 1
| #define HAVE_UNISTD_H 1
| #define HAVE_DLFCN_H 1
| #define STDC_HEADERS 1
| #define HAVE_CSTDLIB 1
| #define HAVE_CSTDIO 1
| #define HAVE_CSTRING 1
| #define HAVE_SDL_SDL_H 1
| #define HAVE_X11_XLIB_H 1
| #define HAVE_STDINT_H 1
| #define HAVE_SYS_PARAM_H 1
| #define HAVE_UNISTD_H 1
| /* end confdefs.h. */
| #include <stdio.h>
| #if HAVE_SYS_TYPES_H
| # include <sys/types.h>
| #endif
| #if HAVE_SYS_STAT_H
| # include <sys/stat.h>
| #endif
| #if STDC_HEADERS
| # include <stdlib.h>
| # include <stddef.h>
| #else
| # if HAVE_STDLIB_H
| # include <stdlib.h>
| # endif
| #endif
| #if HAVE_STRING_H
| # if !STDC_HEADERS && HAVE_MEMORY_H
| # include <memory.h>
| # endif
| # include <string.h>
| #endif
| #if HAVE_STRINGS_H
| # include <strings.h>
| #endif
| #if HAVE_INTTYPES_H
| # include <inttypes.h>
| #else
| # if HAVE_STDINT_H
| # include <stdint.h>
| # endif
| #endif
| #if HAVE_UNISTD_H
| # include <unistd.h>
| #endif
| #include <values.h>
configure:20115: result: no
configure:20119: checking values.h presence
configure:20129: gcc -E conftest.c
conftest.c:37:20: error: values.h: No such file or directory
configure:20135: $? = 1
configure: failed program was:
| /* confdefs.h. */
|
| #define PACKAGE_NAME ""
| #define PACKAGE_TARNAME ""
| #define PACKAGE_VERSION ""
| #define PACKAGE_STRING ""
| #define PACKAGE_BUGREPORT ""
| #define PACKAGE "bzflag"
| #define VERSION "2.0.5"
| #define BZ_BUILD_OS "darwin8.3.0"
| #define BZ_BUILD_USER "geoffrey"
| #define BUILD_REGEX 1
| #ifdef __cplusplus
| extern "C" void std::exit (int); using std::exit;
| #endif
| #define STDC_HEADERS 1
| #define HAVE_SYS_TYPES_H 1
| #define HAVE_SYS_STAT_H 1
| #define HAVE_STDLIB_H 1
| #define HAVE_STRING_H 1
| #define HAVE_MEMORY_H 1
| #define HAVE_STRINGS_H 1
| #define HAVE_INTTYPES_H 1
| #define HAVE_STDINT_H 1
| #define HAVE_UNISTD_H 1
| #define HAVE_DLFCN_H 1
| #define STDC_HEADERS 1
| #define HAVE_CSTDLIB 1
| #define HAVE_CSTDIO 1
| #define HAVE_CSTRING 1
| #define HAVE_SDL_SDL_H 1
| #define HAVE_X11_XLIB_H 1
| #define HAVE_STDINT_H 1
| #define HAVE_SYS_PARAM_H 1
| #define HAVE_UNISTD_H 1
| /* end confdefs.h. */
| #include <values.h>
configure:20155: result: no
configure:20190: checking for values.h
configure:20197: result: no
configure:20074: checking dsound.h usability
configure:20086: gcc -c -g -O2 conftest.c >&5
conftest.c:71:20: error: dsound.h: No such file or directory
configure:20092: $? = 1
configure: failed program was:
| /* confdefs.h. */
|
| #define PACKAGE_NAME ""
| #define PACKAGE_TARNAME ""
| #define PACKAGE_VERSION ""
| #define PACKAGE_STRING ""
| #define PACKAGE_BUGREPORT ""
| #define PACKAGE "bzflag"
| #define VERSION "2.0.5"
| #define BZ_BUILD_OS "darwin8.3.0"
| #define BZ_BUILD_USER "geoffrey"
| #define BUILD_REGEX 1
| #ifdef __cplusplus
| extern "C" void std::exit (int); using std::exit;
| #endif
| #define STDC_HEADERS 1
| #define HAVE_SYS_TYPES_H 1
| #define HAVE_SYS_STAT_H 1
| #define HAVE_STDLIB_H 1
| #define HAVE_STRING_H 1
| #define HAVE_MEMORY_H 1
| #define HAVE_STRINGS_H 1
| #define HAVE_INTTYPES_H 1
| #define HAVE_STDINT_H 1
| #define HAVE_UNISTD_H 1
| #define HAVE_DLFCN_H 1
| #define STDC_HEADERS 1
| #define HAVE_CSTDLIB 1
| #define HAVE_CSTDIO 1
| #define HAVE_CSTRING 1
| #define HAVE_SDL_SDL_H 1
| #define HAVE_X11_XLIB_H 1
| #define HAVE_STDINT_H 1
| #define HAVE_SYS_PARAM_H 1
| #define HAVE_UNISTD_H 1
| /* end confdefs.h. */
| #include <stdio.h>
| #if HAVE_SYS_TYPES_H
| # include <sys/types.h>
| #endif
| #if HAVE_SYS_STAT_H
| # include <sys/stat.h>
| #endif
| #if STDC_HEADERS
| # include <stdlib.h>
| # include <stddef.h>
| #else
| # if HAVE_STDLIB_H
| # include <stdlib.h>
| # endif
| #endif
| #if HAVE_STRING_H
| # if !STDC_HEADERS && HAVE_MEMORY_H
| # include <memory.h>
| # endif
| # include <string.h>
| #endif
| #if HAVE_STRINGS_H
| # include <strings.h>
| #endif
| #if HAVE_INTTYPES_H
| # include <inttypes.h>
| #else
| # if HAVE_STDINT_H
| # include <stdint.h>
| # endif
| #endif
| #if HAVE_UNISTD_H
| # include <unistd.h>
| #endif
| #include <dsound.h>
configure:20115: result: no
configure:20119: checking dsound.h presence
configure:20129: gcc -E conftest.c
conftest.c:37:20: error: dsound.h: No such file or directory
configure:20135: $? = 1
configure: failed program was:
| /* confdefs.h. */
|
| #define PACKAGE_NAME ""
| #define PACKAGE_TARNAME ""
| #define PACKAGE_VERSION ""
| #define PACKAGE_STRING ""
| #define PACKAGE_BUGREPORT ""
| #define PACKAGE "bzflag"
| #define VERSION "2.0.5"
| #define BZ_BUILD_OS "darwin8.3.0"
| #define BZ_BUILD_USER "geoffrey"
| #define BUILD_REGEX 1
| #ifdef __cplusplus
| extern "C" void std::exit (int); using std::exit;
| #endif
| #define STDC_HEADERS 1
| #define HAVE_SYS_TYPES_H 1
| #define HAVE_SYS_STAT_H 1
| #define HAVE_STDLIB_H 1
| #define HAVE_STRING_H 1
| #define HAVE_MEMORY_H 1
| #define HAVE_STRINGS_H 1
| #define HAVE_INTTYPES_H 1
| #define HAVE_STDINT_H 1
| #define HAVE_UNISTD_H 1
| #define HAVE_DLFCN_H 1
| #define STDC_HEADERS 1
| #define HAVE_CSTDLIB 1
| #define HAVE_CSTDIO 1
| #define HAVE_CSTRING 1
| #define HAVE_SDL_SDL_H 1
| #define HAVE_X11_XLIB_H 1
| #define HAVE_STDINT_H 1
| #define HAVE_SYS_PARAM_H 1
| #define HAVE_UNISTD_H 1
| /* end confdefs.h. */
| #include <dsound.h>
configure:20155: result: no
configure:20190: checking for dsound.h
configure:20197: result: no
configure:20214: checking for an ANSI C-conforming const
configure:20281: gcc -c -g -O2 conftest.c >&5
configure:20287: $? = 0
configure:20291: test -z
|| test ! -s conftest.err
configure:20294: $? = 0
configure:20297: test -s conftest.o
configure:20300: $? = 0
configure:20311: result: yes
configure:20322: checking for socklen_t type
configure:20341: gcc -c -g -O2 conftest.c >&5
configure:20347: $? = 0
configure:20351: test -z
|| test ! -s conftest.err
configure:20354: $? = 0
configure:20357: test -s conftest.o
configure:20360: $? = 0
configure:20383: result: yes
configure:20387: checking for linux rumble joystick support
configure:20405: gcc -c -g -O2 conftest.c >&5
conftest.c:38:25: error: linux/input.h: No such file or directory
conftest.c: In function 'main':
conftest.c:42: error: storage size of 'x' isn't known
configure:20411: $? = 1
configure: failed program was:
| /* confdefs.h. */
|
| #define PACKAGE_NAME ""
| #define PACKAGE_TARNAME ""
| #define PACKAGE_VERSION ""
| #define PACKAGE_STRING ""
| #define PACKAGE_BUGREPORT ""
| #define PACKAGE "bzflag"
| #define VERSION "2.0.5"
| #define BZ_BUILD_OS "darwin8.3.0"
| #define BZ_BUILD_USER "geoffrey"
| #define BUILD_REGEX 1
| #ifdef __cplusplus
| extern "C" void std::exit (int); using std::exit;
| #endif
| #define STDC_HEADERS 1
| #define HAVE_SYS_TYPES_H 1
| #define HAVE_SYS_STAT_H 1
| #define HAVE_STDLIB_H 1
| #define HAVE_STRING_H 1
| #define HAVE_MEMORY_H 1
| #define HAVE_STRINGS_H 1
| #define HAVE_INTTYPES_H 1
| #define HAVE_STDINT_H 1
| #define HAVE_UNISTD_H 1
| #define HAVE_DLFCN_H 1
| #define STDC_HEADERS 1
| #define HAVE_CSTDLIB 1
| #define HAVE_CSTDIO 1
| #define HAVE_CSTRING 1
| #define HAVE_SDL_SDL_H 1
| #define HAVE_X11_XLIB_H 1
| #define HAVE_STDINT_H 1
| #define HAVE_SYS_PARAM_H 1
| #define HAVE_UNISTD_H 1
| #define HAVE_SOCKLEN_T 1
| /* end confdefs.h. */
| #include <linux/input.h>
| int
| main ()
| {
| struct ff_effect x; x.u.rumble.weak_magnitude = 42; return 0;
| ;
| return 0;
| }
configure:20441: result: no
configure:20445: checking for linux force feedback joystick support
configure:20463: gcc -c -g -O2 conftest.c >&5
conftest.c:38:25: error: linux/input.h: No such file or directory
conftest.c: In function 'main':
conftest.c:42: error: storage size of 'x' isn't known
configure:20469: $? = 1
configure: failed program was:
| /* confdefs.h. */
|
| #define PACKAGE_NAME ""
| #define PACKAGE_TARNAME ""
| #define PACKAGE_VERSION ""
| #define PACKAGE_STRING ""
| #define PACKAGE_BUGREPORT ""
| #define PACKAGE "bzflag"
| #define VERSION "2.0.5"
| #define BZ_BUILD_OS "darwin8.3.0"
| #define BZ_BUILD_USER "geoffrey"
| #define BUILD_REGEX 1
| #ifdef __cplusplus
| extern "C" void std::exit (int); using std::exit;
| #endif
| #define STDC_HEADERS 1
| #define HAVE_SYS_TYPES_H 1
| #define HAVE_SYS_STAT_H 1
| #define HAVE_STDLIB_H 1
| #define HAVE_STRING_H 1
| #define HAVE_MEMORY_H 1
| #define HAVE_STRINGS_H 1
| #define HAVE_INTTYPES_H 1
| #define HAVE_STDINT_H 1
| #define HAVE_UNISTD_H 1
| #define HAVE_DLFCN_H 1
| #define STDC_HEADERS 1
| #define HAVE_CSTDLIB 1
| #define HAVE_CSTDIO 1
| #define HAVE_CSTRING 1
| #define HAVE_SDL_SDL_H 1
| #define HAVE_X11_XLIB_H 1
| #define HAVE_STDINT_H 1
| #define HAVE_SYS_PARAM_H 1
| #define HAVE_UNISTD_H 1
| #define HAVE_SOCKLEN_T 1
| /* end confdefs.h. */
| #include <linux/input.h>
| int
| main ()
| {
| struct ff_effect x; x.direction = 0x4000; return 0;
| ;
| return 0;
| }
configure:20499: result: no
configure:20630: checking for X
configure:20735: gcc -E conftest.c
configure:20741: $? = 0
configure:20791: gcc -o conftest -g -O2 conftest.c -lXt /usr/bin/libcurl.a >&5
/usr/bin/ld: can't locate file for: -lXt
collect2: ld returned 1 exit status
configure:20797: $? = 1
configure: failed program was:
| /* confdefs.h. */
|
| #define PACKAGE_NAME ""
| #define PACKAGE_TARNAME ""
| #define PACKAGE_VERSION ""
| #define PACKAGE_STRING ""
| #define PACKAGE_BUGREPORT ""
| #define PACKAGE "bzflag"
| #define VERSION "2.0.5"
| #define BZ_BUILD_OS "darwin8.3.0"
| #define BZ_BUILD_USER "geoffrey"
| #define BUILD_REGEX 1
| #ifdef __cplusplus
| extern "C" void std::exit (int); using std::exit;
| #endif
| #define STDC_HEADERS 1
| #define HAVE_SYS_TYPES_H 1
| #define HAVE_SYS_STAT_H 1
| #define HAVE_STDLIB_H 1
| #define HAVE_STRING_H 1
| #define HAVE_MEMORY_H 1
| #define HAVE_STRINGS_H 1
| #define HAVE_INTTYPES_H 1
| #define HAVE_STDINT_H 1
| #define HAVE_UNISTD_H 1
| #define HAVE_DLFCN_H 1
| #define STDC_HEADERS 1
| #define HAVE_CSTDLIB 1
| #define HAVE_CSTDIO 1
| #define HAVE_CSTRING 1
| #define HAVE_SDL_SDL_H 1
| #define HAVE_X11_XLIB_H 1
| #define HAVE_STDINT_H 1
| #define HAVE_SYS_PARAM_H 1
| #define HAVE_UNISTD_H 1
| #define HAVE_SOCKLEN_T 1
| /* end confdefs.h. */
| #include <X11/Intrinsic.h>
| int
| main ()
| {
| XtMalloc (0)
| ;
| return 0;
| }
configure:20860: result: libraries /usr/X11R6/lib, headers
configure:21032: gcc -o conftest -g -O2 conftest.c /usr/bin/libcurl.a -L/usr/X11R6/lib -lX11 >&5
configure:21038: $? = 0
configure:21042: test -z
|| test ! -s conftest.err
configure:21045: $? = 0
configure:21048: test -s conftest
configure:21051: $? = 0
configure:21209: checking for gethostbyname
configure:21266: gcc -o conftest -g -O2 conftest.c /usr/bin/libcurl.a >&5
configure:21272: $? = 0
configure:21276: test -z
|| test ! -s conftest.err
configure:21279: $? = 0
configure:21282: test -s conftest
configure:21285: $? = 0
configure:21297: result: yes
configure:21448: checking for connect
configure:21505: gcc -o conftest -g -O2 conftest.c /usr/bin/libcurl.a >&5
configure:21511: $? = 0
configure:21515: test -z
|| test ! -s conftest.err
configure:21518: $? = 0
configure:21521: test -s conftest
configure:21524: $? = 0
configure:21536: result: yes
configure:21611: checking for remove
configure:21668: gcc -o conftest -g -O2 conftest.c /usr/bin/libcurl.a >&5
configure:21674: $? = 0
configure:21678: test -z
|| test ! -s conftest.err
configure:21681: $? = 0
configure:21684: test -s conftest
configure:21687: $? = 0
configure:21699: result: yes
configure:21774: checking for shmat
configure:21831: gcc -o conftest -g -O2 conftest.c /usr/bin/libcurl.a >&5
configure:21837: $? = 0
configure:21841: test -z
|| test ! -s conftest.err
configure:21844: $? = 0
configure:21847: test -s conftest
configure:21850: $? = 0
configure:21862: result: yes
configure:21946: checking for IceConnectionNumber in -lICE
configure:21976: gcc -o conftest -g -O2 -L/usr/X11R6/lib conftest.c -lICE /usr/bin/libcurl.a >&5
configure:21982: $? = 0
configure:21986: test -z
|| test ! -s conftest.err
configure:21989: $? = 0
configure:21992: test -s conftest
configure:21995: $? = 0
configure:22008: result: yes
configure:22042: checking for sqrtf in -lm
configure:22072: gcc -o conftest -g -O2 -L/usr/X11R6/lib conftest.c -lm /usr/bin/libcurl.a >&5
conftest.c:45: warning: conflicting types for built-in function 'sqrtf'
configure:22078: $? = 0
configure:22082: test -z
|| test ! -s conftest.err
configure:22085: $? = 0
configure:22088: test -s conftest
configure:22091: $? = 0
configure:22104: result: yes
configure:22118: checking for socket in -lsocket
configure:22148: gcc -o conftest -g -O2 -L/usr/X11R6/lib conftest.c -lsocket -lm /usr/bin/libcurl.a >&5
/usr/bin/ld: can't locate file for: -lsocket
collect2: ld returned 1 exit status
configure:22154: $? = 1
configure: failed program was:
| /* confdefs.h. */
|
| #define PACKAGE_NAME ""
| #define PACKAGE_TARNAME ""
| #define PACKAGE_VERSION ""
| #define PACKAGE_STRING ""
| #define PACKAGE_BUGREPORT ""
| #define PACKAGE "bzflag"
| #define VERSION "2.0.5"
| #define BZ_BUILD_OS "darwin8.3.0"
| #define BZ_BUILD_USER "geoffrey"
| #define BUILD_REGEX 1
| #ifdef __cplusplus
| extern "C" void std::exit (int); using std::exit;
| #endif
| #define STDC_HEADERS 1
| #define HAVE_SYS_TYPES_H 1
| #define HAVE_SYS_STAT_H 1
| #define HAVE_STDLIB_H 1
| #define HAVE_STRING_H 1
| #define HAVE_MEMORY_H 1
| #define HAVE_STRINGS_H 1
| #define HAVE_INTTYPES_H 1
| #define HAVE_STDINT_H 1
| #define HAVE_UNISTD_H 1
| #define HAVE_DLFCN_H 1
| #define STDC_HEADERS 1
| #define HAVE_CSTDLIB 1
| #define HAVE_CSTDIO 1
| #define HAVE_CSTRING 1
| #define HAVE_SDL_SDL_H 1
| #define HAVE_X11_XLIB_H 1
| #define HAVE_STDINT_H 1
| #define HAVE_SYS_PARAM_H 1
| #define HAVE_UNISTD_H 1
| #define HAVE_SOCKLEN_T 1
| #define HAVE_LIBM 1
| /* end confdefs.h. */
|
| /* Override any gcc2 internal prototype to avoid an error. */
| #ifdef __cplusplus
| extern "C"
| #endif
| /* We use char because int might match the return type of a gcc2
| builtin and then its argument prototype would still apply. */
| char socket ();
| int
| main ()
| {
| socket ();
| ;
| return 0;
| }
configure:22180: result: no
configure:22192: checking for gethostent in -lsocket
configure:22222: gcc -o conftest -g -O2 -L/usr/X11R6/lib conftest.c -lsocket -lm /usr/bin/libcurl.a >&5
/usr/bin/ld: can't locate file for: -lsocket
collect2: ld returned 1 exit status
configure:22228: $? = 1
configure: failed program was:
| /* confdefs.h. */
|
| #define PACKAGE_NAME ""
| #define PACKAGE_TARNAME ""
| #define PACKAGE_VERSION ""
| #define PACKAGE_STRING ""
| #define PACKAGE_BUGREPORT ""
| #define PACKAGE "bzflag"
| #define VERSION "2.0.5"
| #define BZ_BUILD_OS "darwin8.3.0"
| #define BZ_BUILD_USER "geoffrey"
| #define BUILD_REGEX 1
| #ifdef __cplusplus
| extern "C" void std::exit (int); using std::exit;
| #endif
| #define STDC_HEADERS 1
| #define HAVE_SYS_TYPES_H 1
| #define HAVE_SYS_STAT_H 1
| #define HAVE_STDLIB_H 1
| #define HAVE_STRING_H 1
| #define HAVE_MEMORY_H 1
| #define HAVE_STRINGS_H 1
| #define HAVE_INTTYPES_H 1
| #define HAVE_STDINT_H 1
| #define HAVE_UNISTD_H 1
| #define HAVE_DLFCN_H 1
| #define STDC_HEADERS 1
| #define HAVE_CSTDLIB 1
| #define HAVE_CSTDIO 1
| #define HAVE_CSTRING 1
| #define HAVE_SDL_SDL_H 1
| #define HAVE_X11_XLIB_H 1
| #define HAVE_STDINT_H 1
| #define HAVE_SYS_PARAM_H 1
| #define HAVE_UNISTD_H 1
| #define HAVE_SOCKLEN_T 1
| #define HAVE_LIBM 1
| /* end confdefs.h. */
|
| /* Override any gcc2 internal prototype to avoid an error. */
| #ifdef __cplusplus
| extern "C"
| #endif
| /* We use char because int might match the return type of a gcc2
| builtin and then its argument prototype would still apply. */
| char gethostent ();
| int
| main ()
| {
| gethostent ();
| ;
| return 0;
| }
configure:22254: result: no
configure:22265: checking for gethostent in -lbind
configure:22295: gcc -o conftest -g -O2 -L/usr/X11R6/lib conftest.c -lbind -lm /usr/bin/libcurl.a >&5
/usr/bin/ld: can't locate file for: -lbind
collect2: ld returned 1 exit status
configure:22301: $? = 1
configure: failed program was:
| /* confdefs.h. */
|
| #define PACKAGE_NAME ""
| #define PACKAGE_TARNAME ""
| #define PACKAGE_VERSION ""
| #define PACKAGE_STRING ""
| #define PACKAGE_BUGREPORT ""
| #define PACKAGE "bzflag"
| #define VERSION "2.0.5"
| #define BZ_BUILD_OS "darwin8.3.0"
| #define BZ_BUILD_USER "geoffrey"
| #define BUILD_REGEX 1
| #ifdef __cplusplus
| extern "C" void std::exit (int); using std::exit;
| #endif
| #define STDC_HEADERS 1
| #define HAVE_SYS_TYPES_H 1
| #define HAVE_SYS_STAT_H 1
| #define HAVE_STDLIB_H 1
| #define HAVE_STRING_H 1
| #define HAVE_MEMORY_H 1
| #define HAVE_STRINGS_H 1
| #define HAVE_INTTYPES_H 1
| #define HAVE_STDINT_H 1
| #define HAVE_UNISTD_H 1
| #define HAVE_DLFCN_H 1
| #define STDC_HEADERS 1
| #define HAVE_CSTDLIB 1
| #define HAVE_CSTDIO 1
| #define HAVE_CSTRING 1
| #define HAVE_SDL_SDL_H 1
| #define HAVE_X11_XLIB_H 1
| #define HAVE_STDINT_H 1
| #define HAVE_SYS_PARAM_H 1
| #define HAVE_UNISTD_H 1
| #define HAVE_SOCKLEN_T 1
| #define HAVE_LIBM 1
| /* end confdefs.h. */
|
| /* Override any gcc2 internal prototype to avoid an error. */
| #ifdef __cplusplus
| extern "C"
| #endif
| /* We use char because int might match the return type of a gcc2
| builtin and then its argument prototype would still apply. */
| char gethostent ();
| int
| main ()
| {
| gethostent ();
| ;
| return 0;
| }
configure:22327: result: no
configure:22342: checking for acosf in -lm
configure:22372: gcc -o conftest -g -O2 -L/usr/X11R6/lib conftest.c -lm -lm /usr/bin/libcurl.a >&5
conftest.c:46: warning: conflicting types for built-in function 'acosf'
configure:22378: $? = 0
configure:22382: test -z
|| test ! -s conftest.err
configure:22385: $? = 0
configure:22388: test -s conftest
configure:22391: $? = 0
configure:22404: result: yes
configure:22414: checking for asinf in -lm
configure:22444: gcc -o conftest -g -O2 -L/usr/X11R6/lib conftest.c -lm -lm /usr/bin/libcurl.a >&5
conftest.c:47: warning: conflicting types for built-in function 'asinf'
configure:22450: $? = 0
configure:22454: test -z
|| test ! -s conftest.err
configure:22457: $? = 0
configure:22460: test -s conftest
configure:22463: $? = 0
configure:22476: result: yes
configure:22486: checking for atan2f in -lm
configure:22516: gcc -o conftest -g -O2 -L/usr/X11R6/lib conftest.c -lm -lm /usr/bin/libcurl.a >&5
conftest.c:48: warning: conflicting types for built-in function 'atan2f'
configure:22522: $? = 0
configure:22526: test -z
|| test ! -s conftest.err
configure:22529: $? = 0
configure:22532: test -s conftest
configure:22535: $? = 0
configure:22548: result: yes
configure:22558: checking for atanf in -lm
configure:22588: gcc -o conftest -g -O2 -L/usr/X11R6/lib conftest.c -lm -lm /usr/bin/libcurl.a >&5
conftest.c:49: warning: conflicting types for built-in function 'atanf'
configure:22594: $? = 0
configure:22598: test -z
|| test ! -s conftest.err
configure:22601: $? = 0
configure:22604: test -s conftest
configure:22607: $? = 0
configure:22620: result: yes
configure:22630: checking for cosf in -lm
configure:22660: gcc -o conftest -g -O2 -L/usr/X11R6/lib conftest.c -lm -lm /usr/bin/libcurl.a >&5
conftest.c:50: warning: conflicting types for built-in function 'cosf'
configure:22666: $? = 0
configure:22670: test -z
|| test ! -s conftest.err
configure:22673: $? = 0
configure:22676: test -s conftest
configure:22679: $? = 0
configure:22692: result: yes
configure:22702: checking for expf in -lm
configure:22732: gcc -o conftest -g -O2 -L/usr/X11R6/lib conftest.c -lm -lm /usr/bin/libcurl.a >&5
conftest.c:51: warning: conflicting types for built-in function 'expf'
configure:22738: $? = 0
configure:22742: test -z
|| test ! -s conftest.err
configure:22745: $? = 0
configure:22748: test -s conftest
configure:22751: $? = 0
configure:22764: result: yes
configure:22774: checking for fabsf in -lm
configure:22804: gcc -o conftest -g -O2 -L/usr/X11R6/lib conftest.c -lm -lm /usr/bin/libcurl.a >&5
conftest.c:52: warning: conflicting types for built-in function 'fabsf'
configure:22810: $? = 0
configure:22814: test -z
|| test ! -s conftest.err
configure:22817: $? = 0
configure:22820: test -s conftest
configure:22823: $? = 0
configure:22836: result: yes
configure:22846: checking for floorf in -lm
configure:22876: gcc -o conftest -g -O2 -L/usr/X11R6/lib conftest.c -lm -lm /usr/bin/libcurl.a >&5
conftest.c:53: warning: conflicting types for built-in function 'floorf'
configure:22882: $? = 0
configure:22886: test -z
|| test ! -s conftest.err
configure:22889: $? = 0
configure:22892: test -s conftest
configure:22895: $? = 0
configure:22908: result: yes
configure:22918: checking for fmodf in -lm
configure:22948: gcc -o conftest -g -O2 -L/usr/X11R6/lib conftest.c -lm -lm /usr/bin/libcurl.a >&5
conftest.c:54: warning: conflicting types for built-in function 'fmodf'
configure:22954: $? = 0
configure:22958: test -z
|| test ! -s conftest.err
configure:22961: $? = 0
configure:22964: test -s conftest
configure:22967: $? = 0
configure:22980: result: yes
configure:22990: checking for hypotf in -lm
configure:23020: gcc -o conftest -g -O2 -L/usr/X11R6/lib conftest.c -lm -lm /usr/bin/libcurl.a >&5
conftest.c:55: warning: conflicting types for built-in function 'hypotf'
configure:23026: $? = 0
configure:23030: test -z
|| test ! -s conftest.err
configure:23033: $? = 0
configure:23036: test -s conftest
configure:23039: $? = 0
configure:23052: result: yes
configure:23062: checking for logf in -lm
configure:23092: gcc -o conftest -g -O2 -L/usr/X11R6/lib conftest.c -lm -lm /usr/bin/libcurl.a >&5
conftest.c:56: warning: conflicting types for built-in function 'logf'
configure:23098: $? = 0
configure:23102: test -z
|| test ! -s conftest.err
configure:23105: $? = 0
configure:23108: test -s conftest
configure:23111: $? = 0
configure:23124: result: yes
configure:23134: checking for log10f in -lm
configure:23164: gcc -o conftest -g -O2 -L/usr/X11R6/lib conftest.c -lm -lm /usr/bin/libcurl.a >&5
conftest.c:57: warning: conflicting types for built-in function 'log10f'
configure:23170: $? = 0
configure:23174: test -z
|| test ! -s conftest.err
configure:23177: $? = 0
configure:23180: test -s conftest
configure:23183: $? = 0
configure:23196: result: yes
configure:23206: checking for powf in -lm
configure:23236: gcc -o conftest -g -O2 -L/usr/X11R6/lib conftest.c -lm -lm /usr/bin/libcurl.a >&5
conftest.c:58: warning: conflicting types for built-in function 'powf'
configure:23242: $? = 0
configure:23246: test -z
|| test ! -s conftest.err
configure:23249: $? = 0
configure:23252: test -s conftest
configure:23255: $? = 0
configure:23268: result: yes
configure:23278: checking for sinf in -lm
configure:23308: gcc -o conftest -g -O2 -L/usr/X11R6/lib conftest.c -lm -lm /usr/bin/libcurl.a >&5
conftest.c:59: warning: conflicting types for built-in function 'sinf'
configure:23314: $? = 0
configure:23318: test -z
|| test ! -s conftest.err
configure:23321: $? = 0
configure:23324: test -s conftest
configure:23327: $? = 0
configure:23340: result: yes
configure:23350: checking for sqrtf in -lm
configure:23412: result: yes
configure:23422: checking for tanf in -lm
configure:23452: gcc -o conftest -g -O2 -L/usr/X11R6/lib conftest.c -lm -lm /usr/bin/libcurl.a >&5
conftest.c:61: warning: conflicting types for built-in function 'tanf'
configure:23458: $? = 0
configure:23462: test -z
|| test ! -s conftest.err
configure:23465: $? = 0
configure:23468: test -s conftest
configure:23471: $? = 0
configure:23484: result: yes
configure:23745: g++ -o conftest -g -O2 -L/usr/X11R6/lib conftest.cc -lm /usr/bin/libcurl.a >&5
configure:23751: $? = 0
configure:23755: test -z
|| test ! -s conftest.err
configure:23758: $? = 0
configure:23761: test -s conftest
configure:23764: $? = 0
configure:23800: g++ -o conftest -g -O2 -L/usr/X11R6/lib conftest.cc -framework OpenGL -lm /usr/bin/libcurl.a >&5
configure:23806: $? = 0
configure:23810: test -z
|| test ! -s conftest.err
configure:23813: $? = 0
configure:23816: test -s conftest
configure:23819: $? = 0
configure:23847: g++ -o conftest -g -O2 -L/usr/X11R6/lib conftest.cc -lopengl32 -lm /usr/bin/libcurl.a >&5
conftest.cc:56:19: error: GL/gl.h: No such file or directory
conftest.cc: In function 'int main()':
conftest.cc:60: error: 'GL_POINTS' was not declared in this scope
conftest.cc:60: error: 'glBegin' was not declared in this scope
configure:23853: $? = 1
configure: failed program was:
| /* confdefs.h. */
|
| #define PACKAGE_NAME ""
| #define PACKAGE_TARNAME ""
| #define PACKAGE_VERSION ""
| #define PACKAGE_STRING ""
| #define PACKAGE_BUGREPORT ""
| #define PACKAGE "bzflag"
| #define VERSION "2.0.5"
| #define BZ_BUILD_OS "darwin8.3.0"
| #define BZ_BUILD_USER "geoffrey"
| #define BUILD_REGEX 1
| #ifdef __cplusplus
| extern "C" void std::exit (int); using std::exit;
| #endif
| #define STDC_HEADERS 1
| #define HAVE_SYS_TYPES_H 1
| #define HAVE_SYS_STAT_H 1
| #define HAVE_STDLIB_H 1
| #define HAVE_STRING_H 1
| #define HAVE_MEMORY_H 1
| #define HAVE_STRINGS_H 1
| #define HAVE_INTTYPES_H 1
| #define HAVE_STDINT_H 1
| #define HAVE_UNISTD_H 1
| #define HAVE_DLFCN_H 1
| #define STDC_HEADERS 1
| #define HAVE_CSTDLIB 1
| #define HAVE_CSTDIO 1
| #define HAVE_CSTRING 1
| #define HAVE_SDL_SDL_H 1
| #define HAVE_X11_XLIB_H 1
| #define HAVE_STDINT_H 1
| #define HAVE_SYS_PARAM_H 1
| #define HAVE_UNISTD_H 1
| #define HAVE_SOCKLEN_T 1
| #define HAVE_LIBM 1
| #define HAVE_ACOSF 1
| #define HAVE_ASINF 1
| #define HAVE_ATAN2F 1
| #define HAVE_ATANF 1
| #define HAVE_COSF 1
| #define HAVE_EXPF 1
| #define HAVE_FABSF 1
| #define HAVE_FLOORF 1
| #define HAVE_FMODF 1
| #define HAVE_HYPOTF 1
| #define HAVE_LOGF 1
| #define HAVE_LOG10F 1
| #define HAVE_POWF 1
| #define HAVE_SINF 1
| #define HAVE_SQRTF 1
| #define HAVE_TANF 1
| #define HAVE_REGEX_H 1
| /* end confdefs.h. */
| #include <GL/gl.h>
| int
| main ()
| {
| glBegin(GL_POINTS)
| ;
| return 0;
| }
configure:23847: g++ -o conftest -g -O2 -L/usr/X11R6/lib conftest.cc -lGL -lm /usr/bin/libcurl.a >&5
conftest.cc:56:19: error: GL/gl.h: No such file or directory
conftest.cc: In function 'int main()':
conftest.cc:60: error: 'GL_POINTS' was not declared in this scope
conftest.cc:60: error: 'glBegin' was not declared in this scope
configure:23853: $? = 1
configure: failed program was:
| /* confdefs.h. */
|
| #define PACKAGE_NAME ""
| #define PACKAGE_TARNAME ""
| #define PACKAGE_VERSION ""
| #define PACKAGE_STRING ""
| #define PACKAGE_BUGREPORT ""
| #define PACKAGE "bzflag"
| #define VERSION "2.0.5"
| #define BZ_BUILD_OS "darwin8.3.0"
| #define BZ_BUILD_USER "geoffrey"
| #define BUILD_REGEX 1
| #ifdef __cplusplus
| extern "C" void std::exit (int); using std::exit;
| #endif
| #define STDC_HEADERS 1
| #define HAVE_SYS_TYPES_H 1
| #define HAVE_SYS_STAT_H 1
| #define HAVE_STDLIB_H 1
| #define HAVE_STRING_H 1
| #define HAVE_MEMORY_H 1
| #define HAVE_STRINGS_H 1
| #define HAVE_INTTYPES_H 1
| #define HAVE_STDINT_H 1
| #define HAVE_UNISTD_H 1
| #define HAVE_DLFCN_H 1
| #define STDC_HEADERS 1
| #define HAVE_CSTDLIB 1
| #define HAVE_CSTDIO 1
| #define HAVE_CSTRING 1
| #define HAVE_SDL_SDL_H 1
| #define HAVE_X11_XLIB_H 1
| #define HAVE_STDINT_H 1
| #define HAVE_SYS_PARAM_H 1
| #define HAVE_UNISTD_H 1
| #define HAVE_SOCKLEN_T 1
| #define HAVE_LIBM 1
| #define HAVE_ACOSF 1
| #define HAVE_ASINF 1
| #define HAVE_ATAN2F 1
| #define HAVE_ATANF 1
| #define HAVE_COSF 1
| #define HAVE_EXPF 1
| #define HAVE_FABSF 1
| #define HAVE_FLOORF 1
| #define HAVE_FMODF 1
| #define HAVE_HYPOTF 1
| #define HAVE_LOGF 1
| #define HAVE_LOG10F 1
| #define HAVE_POWF 1
| #define HAVE_SINF 1
| #define HAVE_SQRTF 1
| #define HAVE_TANF 1
| #define HAVE_REGEX_H 1
| /* end confdefs.h. */
| #include <GL/gl.h>
| int
| main ()
| {
| glBegin(GL_POINTS)
| ;
| return 0;
| }
configure:23847: g++ -o conftest -g -O2 -L/usr/X11R6/lib conftest.cc -lGL2 -lm /usr/bin/libcurl.a >&5
conftest.cc:56:19: error: GL/gl.h: No such file or directory
conftest.cc: In function 'int main()':
conftest.cc:60: error: 'GL_POINTS' was not declared in this scope
conftest.cc:60: error: 'glBegin' was not declared in this scope
configure:23853: $? = 1
configure: failed program was:
| /* confdefs.h. */
|
| #define PACKAGE_NAME ""
| #define PACKAGE_TARNAME ""
| #define PACKAGE_VERSION ""
| #define PACKAGE_STRING ""
| #define PACKAGE_BUGREPORT ""
| #define PACKAGE "bzflag"
| #define VERSION "2.0.5"
| #define BZ_BUILD_OS "darwin8.3.0"
| #define BZ_BUILD_USER "geoffrey"
| #define BUILD_REGEX 1
| #ifdef __cplusplus
| extern "C" void std::exit (int); using std::exit;
| #endif
| #define STDC_HEADERS 1
| #define HAVE_SYS_TYPES_H 1
| #define HAVE_SYS_STAT_H 1
| #define HAVE_STDLIB_H 1
| #define HAVE_STRING_H 1
| #define HAVE_MEMORY_H 1
| #define HAVE_STRINGS_H 1
| #define HAVE_INTTYPES_H 1
| #define HAVE_STDINT_H 1
| #define HAVE_UNISTD_H 1
| #define HAVE_DLFCN_H 1
| #define STDC_HEADERS 1
| #define HAVE_CSTDLIB 1
| #define HAVE_CSTDIO 1
| #define HAVE_CSTRING 1
| #define HAVE_SDL_SDL_H 1
| #define HAVE_X11_XLIB_H 1
| #define HAVE_STDINT_H 1
| #define HAVE_SYS_PARAM_H 1
| #define HAVE_UNISTD_H 1
| #define HAVE_SOCKLEN_T 1
| #define HAVE_LIBM 1
| #define HAVE_ACOSF 1
| #define HAVE_ASINF 1
| #define HAVE_ATAN2F 1
| #define HAVE_ATANF 1
| #define HAVE_COSF 1
| #define HAVE_EXPF 1
| #define HAVE_FABSF 1
| #define HAVE_FLOORF 1
| #define HAVE_FMODF 1
| #define HAVE_HYPOTF 1
| #define HAVE_LOGF 1
| #define HAVE_LOG10F 1
| #define HAVE_POWF 1
| #define HAVE_SINF 1
| #define HAVE_SQRTF 1
| #define HAVE_TANF 1
| #define HAVE_REGEX_H 1
| /* end confdefs.h. */
| #include <GL/gl.h>
| int
| main ()
| {
| glBegin(GL_POINTS)
| ;
| return 0;
| }
configure:23905: g++ -o conftest -g -O2 -L/usr/X11R6/lib conftest.cc -framework OpenGL -lm /usr/bin/libcurl.a >&5
configure:23911: $? = 0
configure:23915: test -z
|| test ! -s conftest.err
configure:23918: $? = 0
configure:23921: test -s conftest
configure:23924: $? = 0
configure:23952: g++ -o conftest -g -O2 -L/usr/X11R6/lib conftest.cc -lglu32 -framework OpenGL -lm /usr/bin/libcurl.a >&5
conftest.cc:56:20: error: GL/glu.h: No such file or directory
conftest.cc: In function 'int main()':
conftest.cc:60: error: 'GL_RED' was not declared in this scope
conftest.cc:60: error: 'GL_INT' was not declared in this scope
conftest.cc:60: error: 'gluScaleImage' was not declared in this scope
configure:23958: $? = 1
configure: failed program was:
| /* confdefs.h. */
|
| #define PACKAGE_NAME ""
| #define PACKAGE_TARNAME ""
| #define PACKAGE_VERSION ""
| #define PACKAGE_STRING ""
| #define PACKAGE_BUGREPORT ""
| #define PACKAGE "bzflag"
| #define VERSION "2.0.5"
| #define BZ_BUILD_OS "darwin8.3.0"
| #define BZ_BUILD_USER "geoffrey"
| #define BUILD_REGEX 1
| #ifdef __cplusplus
| extern "C" void std::exit (int); using std::exit;
| #endif
| #define STDC_HEADERS 1
| #define HAVE_SYS_TYPES_H 1
| #define HAVE_SYS_STAT_H 1
| #define HAVE_STDLIB_H 1
| #define HAVE_STRING_H 1
| #define HAVE_MEMORY_H 1
| #define HAVE_STRINGS_H 1
| #define HAVE_INTTYPES_H 1
| #define HAVE_STDINT_H 1
| #define HAVE_UNISTD_H 1
| #define HAVE_DLFCN_H 1
| #define STDC_HEADERS 1
| #define HAVE_CSTDLIB 1
| #define HAVE_CSTDIO 1
| #define HAVE_CSTRING 1
| #define HAVE_SDL_SDL_H 1
| #define HAVE_X11_XLIB_H 1
| #define HAVE_STDINT_H 1
| #define HAVE_SYS_PARAM_H 1
| #define HAVE_UNISTD_H 1
| #define HAVE_SOCKLEN_T 1
| #define HAVE_LIBM 1
| #define HAVE_ACOSF 1
| #define HAVE_ASINF 1
| #define HAVE_ATAN2F 1
| #define HAVE_ATANF 1
| #define HAVE_COSF 1
| #define HAVE_EXPF 1
| #define HAVE_FABSF 1
| #define HAVE_FLOORF 1
| #define HAVE_FMODF 1
| #define HAVE_HYPOTF 1
| #define HAVE_LOGF 1
| #define HAVE_LOG10F 1
| #define HAVE_POWF 1
| #define HAVE_SINF 1
| #define HAVE_SQRTF 1
| #define HAVE_TANF 1
| #define HAVE_REGEX_H 1
| /* end confdefs.h. */
| #include <GL/glu.h>
| int
| main ()
| {
| gluScaleImage(GL_RED,0,0,GL_INT,0,0,0,GL_INT,0)
| ;
| return 0;
| }
configure:23952: g++ -o conftest -g -O2 -L/usr/X11R6/lib conftest.cc -lGL -framework OpenGL -lm /usr/bin/libcurl.a >&5
conftest.cc:56:20: error: GL/glu.h: No such file or directory
conftest.cc: In function 'int main()':
conftest.cc:60: error: 'GL_RED' was not declared in this scope
conftest.cc:60: error: 'GL_INT' was not declared in this scope
conftest.cc:60: error: 'gluScaleImage' was not declared in this scope
configure:23958: $? = 1
configure: failed program was:
| /* confdefs.h. */
|
| #define PACKAGE_NAME ""
| #define PACKAGE_TARNAME ""
| #define PACKAGE_VERSION ""
| #define PACKAGE_STRING ""
| #define PACKAGE_BUGREPORT ""
| #define PACKAGE "bzflag"
| #define VERSION "2.0.5"
| #define BZ_BUILD_OS "darwin8.3.0"
| #define BZ_BUILD_USER "geoffrey"
| #define BUILD_REGEX 1
| #ifdef __cplusplus
| extern "C" void std::exit (int); using std::exit;
| #endif
| #define STDC_HEADERS 1
| #define HAVE_SYS_TYPES_H 1
| #define HAVE_SYS_STAT_H 1
| #define HAVE_STDLIB_H 1
| #define HAVE_STRING_H 1
| #define HAVE_MEMORY_H 1
| #define HAVE_STRINGS_H 1
| #define HAVE_INTTYPES_H 1
| #define HAVE_STDINT_H 1
| #define HAVE_UNISTD_H 1
| #define HAVE_DLFCN_H 1
| #define STDC_HEADERS 1
| #define HAVE_CSTDLIB 1
| #define HAVE_CSTDIO 1
| #define HAVE_CSTRING 1
| #define HAVE_SDL_SDL_H 1
| #define HAVE_X11_XLIB_H 1
| #define HAVE_STDINT_H 1
| #define HAVE_SYS_PARAM_H 1
| #define HAVE_UNISTD_H 1
| #define HAVE_SOCKLEN_T 1
| #define HAVE_LIBM 1
| #define HAVE_ACOSF 1
| #define HAVE_ASINF 1
| #define HAVE_ATAN2F 1
| #define HAVE_ATANF 1
| #define HAVE_COSF 1
| #define HAVE_EXPF 1
| #define HAVE_FABSF 1
| #define HAVE_FLOORF 1
| #define HAVE_FMODF 1
| #define HAVE_HYPOTF 1
| #define HAVE_LOGF 1
| #define HAVE_LOG10F 1
| #define HAVE_POWF 1
| #define HAVE_SINF 1
| #define HAVE_SQRTF 1
| #define HAVE_TANF 1
| #define HAVE_REGEX_H 1
| /* end confdefs.h. */
| #include <GL/glu.h>
| int
| main ()
| {
| gluScaleImage(GL_RED,0,0,GL_INT,0,0,0,GL_INT,0)
| ;
| return 0;
| }
configure:23952: g++ -o conftest -g -O2 -L/usr/X11R6/lib conftest.cc -lGLU -framework OpenGL -lm /usr/bin/libcurl.a >&5
conftest.cc:56:20: error: GL/glu.h: No such file or directory
conftest.cc: In function 'int main()':
conftest.cc:60: error: 'GL_RED' was not declared in this scope
conftest.cc:60: error: 'GL_INT' was not declared in this scope
conftest.cc:60: error: 'gluScaleImage' was not declared in this scope
configure:23958: $? = 1
configure: failed program was:
| /* confdefs.h. */
|
| #define PACKAGE_NAME ""
| #define PACKAGE_TARNAME ""
| #define PACKAGE_VERSION ""
| #define PACKAGE_STRING ""
| #define PACKAGE_BUGREPORT ""
| #define PACKAGE "bzflag"
| #define VERSION "2.0.5"
| #define BZ_BUILD_OS "darwin8.3.0"
| #define BZ_BUILD_USER "geoffrey"
| #define BUILD_REGEX 1
| #ifdef __cplusplus
| extern "C" void std::exit (int); using std::exit;
| #endif
| #define STDC_HEADERS 1
| #define HAVE_SYS_TYPES_H 1
| #define HAVE_SYS_STAT_H 1
| #define HAVE_STDLIB_H 1
| #define HAVE_STRING_H 1
| #define HAVE_MEMORY_H 1
| #define HAVE_STRINGS_H 1
| #define HAVE_INTTYPES_H 1
| #define HAVE_STDINT_H 1
| #define HAVE_UNISTD_H 1
| #define HAVE_DLFCN_H 1
| #define STDC_HEADERS 1
| #define HAVE_CSTDLIB 1
| #define HAVE_CSTDIO 1
| #define HAVE_CSTRING 1
| #define HAVE_SDL_SDL_H 1
| #define HAVE_X11_XLIB_H 1
| #define HAVE_STDINT_H 1
| #define HAVE_SYS_PARAM_H 1
| #define HAVE_UNISTD_H 1
| #define HAVE_SOCKLEN_T 1
| #define HAVE_LIBM 1
| #define HAVE_ACOSF 1
| #define HAVE_ASINF 1
| #define HAVE_ATAN2F 1
| #define HAVE_ATANF 1
| #define HAVE_COSF 1
| #define HAVE_EXPF 1
| #define HAVE_FABSF 1
| #define HAVE_FLOORF 1
| #define HAVE_FMODF 1
| #define HAVE_HYPOTF 1
| #define HAVE_LOGF 1
| #define HAVE_LOG10F 1
| #define HAVE_POWF 1
| #define HAVE_SINF 1
| #define HAVE_SQRTF 1
| #define HAVE_TANF 1
| #define HAVE_REGEX_H 1
| /* end confdefs.h. */
| #include <GL/glu.h>
| int
| main ()
| {
| gluScaleImage(GL_RED,0,0,GL_INT,0,0,0,GL_INT,0)
| ;
| return 0;
| }
configure:24253: checking for ares_init in -lcares
configure:24283: g++ -o conftest -g -O2 -L/usr/X11R6/lib conftest.cc -lcares -lm /usr/bin/libcurl.a -framework Carbon -framework Cocoa -framework OpenGL >&5
/usr/bin/ld: can't locate file for: -lcares
collect2: ld returned 1 exit status
configure:24289: $? = 1
configure: failed program was:
| /* confdefs.h. */
|
| #define PACKAGE_NAME ""
| #define PACKAGE_TARNAME ""
| #define PACKAGE_VERSION ""
| #define PACKAGE_STRING ""
| #define PACKAGE_BUGREPORT ""
| #define PACKAGE "bzflag"
| #define VERSION "2.0.5"
| #define BZ_BUILD_OS "darwin8.3.0"
| #define BZ_BUILD_USER "geoffrey"
| #define BUILD_REGEX 1
| #ifdef __cplusplus
| extern "C" void std::exit (int); using std::exit;
| #endif
| #define STDC_HEADERS 1
| #define HAVE_SYS_TYPES_H 1
| #define HAVE_SYS_STAT_H 1
| #define HAVE_STDLIB_H 1
| #define HAVE_STRING_H 1
| #define HAVE_MEMORY_H 1
| #define HAVE_STRINGS_H 1
| #define HAVE_INTTYPES_H 1
| #define HAVE_STDINT_H 1
| #define HAVE_UNISTD_H 1
| #define HAVE_DLFCN_H 1
| #define STDC_HEADERS 1
| #define HAVE_CSTDLIB 1
| #define HAVE_CSTDIO 1
| #define HAVE_CSTRING 1
| #define HAVE_SDL_SDL_H 1
| #define HAVE_X11_XLIB_H 1
| #define HAVE_STDINT_H 1
| #define HAVE_SYS_PARAM_H 1
| #define HAVE_UNISTD_H 1
| #define HAVE_SOCKLEN_T 1
| #define HAVE_LIBM 1
| #define HAVE_ACOSF 1
| #define HAVE_ASINF 1
| #define HAVE_ATAN2F 1
| #define HAVE_ATANF 1
| #define HAVE_COSF 1
| #define HAVE_EXPF 1
| #define HAVE_FABSF 1
| #define HAVE_FLOORF 1
| #define HAVE_FMODF 1
| #define HAVE_HYPOTF 1
| #define HAVE_LOGF 1
| #define HAVE_LOG10F 1
| #define HAVE_POWF 1
| #define HAVE_SINF 1
| #define HAVE_SQRTF 1
| #define HAVE_TANF 1
| #define HAVE_REGEX_H 1
| /* end confdefs.h. */
|
| /* Override any gcc2 internal prototype to avoid an error. */
| #ifdef __cplusplus
| extern "C"
| #endif
| /* We use char because int might match the return type of a gcc2
| builtin and then its argument prototype would still apply. */
| char ares_init ();
| int
| main ()
| {
| ares_init ();
| ;
| return 0;
| }
configure:24315: result: no
configure:24334: WARNING: using an internal c-ares lib.
configure:24336: WARNING: Consider installing an updated library at system level
configure:24338: WARNING: link is http://daniel.haxx.se/projects/c-ares/
configure:24359: checking for working ncurses
configure:24384: g++ -o conftest -g -O2 -L/usr/X11R6/lib conftest.cc -lm /usr/bin/libcurl.a -framework Carbon -framework Cocoa -framework OpenGL -lncurses >&5
configure:24390: $? = 0
configure:24394: test -z
|| test ! -s conftest.err
configure:24397: $? = 0
configure:24400: test -s conftest
configure:24403: $? = 0
configure:24415: result: yes
configure:24709: checking for SDL framework
configure:24730: gcc -o conftest -g -O2 -L/usr/X11R6/lib -framework SDL conftest.c -framework OpenGL -framework OpenGL -lm /usr/bin/libcurl.a -framework Carbon -framework Cocoa -framework OpenGL >&5
configure:24736: $? = 0
configure:24740: test -z
|| test ! -s conftest.err
configure:24743: $? = 0
configure:24746: test -s conftest
configure:24749: $? = 0
configure:24760: result: yes
configure:25370: checking if the compiler understands -Wl,-search_paths_first -mdynamic-no-pic
configure:25391: g++ -o conftest -g -O2 -O3 -ffast-math -fomit-frame-pointer -fexpensive-optimizations -fno-exceptions -pipe -pedantic -fno-exceptions -W -Wall -Wundef -Wno-import -L/usr/X11R6/lib -framework SDL -Wl,-search_paths_first -mdynamic-no-pic conftest.cc -lm /usr/bin/libcurl.a -framework Carbon -framework Cocoa -framework OpenGL >&5
configure:25397: $? = 0
configure:25401: test -z
|| test ! -s conftest.err
configure:25404: $? = 0
configure:25407: test -s conftest
configure:25410: $? = 0
configure:25421: result: yes
configure:25461: checking for CGLGetCurrentContext
configure:25518: g++ -o conftest -g -O2 -O3 -ffast-math -fomit-frame-pointer -fexpensive-optimizations -fno-exceptions -pipe -pedantic -fno-exceptions -W -Wall -Wundef -Wno-import -L/usr/X11R6/lib -framework SDL -Wl,-search_paths_first -mdynamic-no-pic conftest.cc -lm /usr/bin/libcurl.a -framework Carbon -framework Cocoa -framework OpenGL >&5
configure:25524: $? = 0
configure:25528: test -z
|| test ! -s conftest.err
configure:25531: $? = 0
configure:25534: test -s conftest
configure:25537: $? = 0
configure:25549: result: yes
configure:25461: checking for Sleep
configure:25518: g++ -o conftest -g -O2 -O3 -ffast-math -fomit-frame-pointer -fexpensive-optimizations -fno-exceptions -pipe -pedantic -fno-exceptions -W -Wall -Wundef -Wno-import -L/usr/X11R6/lib -framework SDL -Wl,-search_paths_first -mdynamic-no-pic conftest.cc -lm /usr/bin/libcurl.a -framework Carbon -framework Cocoa -framework OpenGL >&5
configure:25524: $? = 0
configure:25528: test -z
|| test ! -s conftest.err
configure:25531: $? = 0
configure:25534: test -s conftest
configure:25537: $? = 0
configure:25549: result: yes
configure:25461: checking for WaitForSingleObject
configure:25518: g++ -o conftest -g -O2 -O3 -ffast-math -fomit-frame-pointer -fexpensive-optimizations -fno-exceptions -pipe -pedantic -fno-exceptions -W -Wall -Wundef -Wno-import -L/usr/X11R6/lib -framework SDL -Wl,-search_paths_first -mdynamic-no-pic conftest.cc -lm /usr/bin/libcurl.a -framework Carbon -framework Cocoa -framework OpenGL >&5
/usr/bin/ld: Undefined symbols:
_WaitForSingleObject
collect2: ld returned 1 exit status
configure:25524: $? = 1
configure: failed program was:
| /* confdefs.h. */
|
| #define PACKAGE_NAME ""
| #define PACKAGE_TARNAME ""
| #define PACKAGE_VERSION ""
| #define PACKAGE_STRING ""
| #define PACKAGE_BUGREPORT ""
| #define PACKAGE "bzflag"
| #define VERSION "2.0.5"
| #define BZ_BUILD_OS "darwin8.3.0"
| #define BZ_BUILD_USER "geoffrey"
| #define BUILD_REGEX 1
| #ifdef __cplusplus
| extern "C" void std::exit (int); using std::exit;
| #endif
| #define STDC_HEADERS 1
| #define HAVE_SYS_TYPES_H 1
| #define HAVE_SYS_STAT_H 1
| #define HAVE_STDLIB_H 1
| #define HAVE_STRING_H 1
| #define HAVE_MEMORY_H 1
| #define HAVE_STRINGS_H 1
| #define HAVE_INTTYPES_H 1
| #define HAVE_STDINT_H 1
| #define HAVE_UNISTD_H 1
| #define HAVE_DLFCN_H 1
| #define STDC_HEADERS 1
| #define HAVE_CSTDLIB 1
| #define HAVE_CSTDIO 1
| #define HAVE_CSTRING 1
| #define HAVE_SDL_SDL_H 1
| #define HAVE_X11_XLIB_H 1
| #define HAVE_STDINT_H 1
| #define HAVE_SYS_PARAM_H 1
| #define HAVE_UNISTD_H 1
| #define HAVE_SOCKLEN_T 1
| #define HAVE_LIBM 1
| #define HAVE_ACOSF 1
| #define HAVE_ASINF 1
| #define HAVE_ATAN2F 1
| #define HAVE_ATANF 1
| #define HAVE_COSF 1
| #define HAVE_EXPF 1
| #define HAVE_FABSF 1
| #define HAVE_FLOORF 1
| #define HAVE_FMODF 1
| #define HAVE_HYPOTF 1
| #define HAVE_LOGF 1
| #define HAVE_LOG10F 1
| #define HAVE_POWF 1
| #define HAVE_SINF 1
| #define HAVE_SQRTF 1
| #define HAVE_TANF 1
| #define HAVE_REGEX_H 1
| #define HAVE_NCURSES_H
| #define HAVE_SDL 1
| #define ROBOT 1
| #define SNAPPING 1
| #define INSTALL_DATA_DIR "/usr/local/share/bzflag"
| #define NDEBUG 1
| #define HAVE_CGLGETCURRENTCONTEXT 1
| #define HAVE_SLEEP 1
| /* end confdefs.h. */
| /* Define WaitForSingleObject to an innocuous variant, in case <limits.h> declares WaitForSingleObject.
| For example, HP-UX 11i <limits.h> declares gettimeofday. */
| #define WaitForSingleObject innocuous_WaitForSingleObject
|
| /* System header to define __stub macros and hopefully few prototypes,
| which can conflict with char WaitForSingleObject (); below.
| Prefer <limits.h> to <assert.h> if __STDC__ is defined, since
| <limits.h> exists even on freestanding compilers. */
|
| #ifdef __STDC__
| # include <limits.h>
| #else
| # include <assert.h>
| #endif
|
| #undef WaitForSingleObject
|
| /* Override any gcc2 internal prototype to avoid an error. */
| #ifdef __cplusplus
| extern "C"
| {
| #endif
| /* We use char because int might match the return type of a gcc2
| builtin and then its argument prototype would still apply. */
| char WaitForSingleObject ();
| /* The GNU C library defines this for functions which it implements
| to always fail with ENOSYS. Some functions are actually named
| something starting with __ and the normal name is an alias. */
| #if defined (__stub_WaitForSingleObject) || defined (__stub___WaitForSingleObject)
| choke me
| #else
| char (*f) () = WaitForSingleObject;
| #endif
| #ifdef __cplusplus
| }
| #endif
|
| int
| main ()
| {
| return f != WaitForSingleObject;
| ;
| return 0;
| }
configure:25549: result: no
configure:25461: checking for _stricmp
configure:25518: g++ -o conftest -g -O2 -O3 -ffast-math -fomit-frame-pointer -fexpensive-optimizations -fno-exceptions -pipe -pedantic -fno-exceptions -W -Wall -Wundef -Wno-import -L/usr/X11R6/lib -framework SDL -Wl,-search_paths_first -mdynamic-no-pic conftest.cc -lm /usr/bin/libcurl.a -framework Carbon -framework Cocoa -framework OpenGL >&5
/usr/bin/ld: Undefined symbols:
__stricmp
collect2: ld returned 1 exit status
configure:25524: $? = 1
configure: failed program was:
| /* confdefs.h. */
|
| #define PACKAGE_NAME ""
| #define PACKAGE_TARNAME ""
| #define PACKAGE_VERSION ""
| #define PACKAGE_STRING ""
| #define PACKAGE_BUGREPORT ""
| #define PACKAGE "bzflag"
| #define VERSION "2.0.5"
| #define BZ_BUILD_OS "darwin8.3.0"
| #define BZ_BUILD_USER "geoffrey"
| #define BUILD_REGEX 1
| #ifdef __cplusplus
| extern "C" void std::exit (int); using std::exit;
| #endif
| #define STDC_HEADERS 1
| #define HAVE_SYS_TYPES_H 1
| #define HAVE_SYS_STAT_H 1
| #define HAVE_STDLIB_H 1
| #define HAVE_STRING_H 1
| #define HAVE_MEMORY_H 1
| #define HAVE_STRINGS_H 1
| #define HAVE_INTTYPES_H 1
| #define HAVE_STDINT_H 1
| #define HAVE_UNISTD_H 1
| #define HAVE_DLFCN_H 1
| #define STDC_HEADERS 1
| #define HAVE_CSTDLIB 1
| #define HAVE_CSTDIO 1
| #define HAVE_CSTRING 1
| #define HAVE_SDL_SDL_H 1
| #define HAVE_X11_XLIB_H 1
| #define HAVE_STDINT_H 1
| #define HAVE_SYS_PARAM_H 1
| #define HAVE_UNISTD_H 1
| #define HAVE_SOCKLEN_T 1
| #define HAVE_LIBM 1
| #define HAVE_ACOSF 1
| #define HAVE_ASINF 1
| #define HAVE_ATAN2F 1
| #define HAVE_ATANF 1
| #define HAVE_COSF 1
| #define HAVE_EXPF 1
| #define HAVE_FABSF 1
| #define HAVE_FLOORF 1
| #define HAVE_FMODF 1
| #define HAVE_HYPOTF 1
| #define HAVE_LOGF 1
| #define HAVE_LOG10F 1
| #define HAVE_POWF 1
| #define HAVE_SINF 1
| #define HAVE_SQRTF 1
| #define HAVE_TANF 1
| #define HAVE_REGEX_H 1
| #define HAVE_NCURSES_H
| #define HAVE_SDL 1
| #define ROBOT 1
| #define SNAPPING 1
| #define INSTALL_DATA_DIR "/usr/local/share/bzflag"
| #define NDEBUG 1
| #define HAVE_CGLGETCURRENTCONTEXT 1
| #define HAVE_SLEEP 1
| /* end confdefs.h. */
| /* Define _stricmp to an innocuous variant, in case <limits.h> declares _stricmp.
| For example, HP-UX 11i <limits.h> declares gettimeofday. */
| #define _stricmp innocuous__stricmp
|
| /* System header to define __stub macros and hopefully few prototypes,
| which can conflict with char _stricmp (); below.
| Prefer <limits.h> to <assert.h> if __STDC__ is defined, since
| <limits.h> exists even on freestanding compilers. */
|
| #ifdef __STDC__
| # include <limits.h>
| #else
| # include <assert.h>
| #endif
|
| #undef _stricmp
|
| /* Override any gcc2 internal prototype to avoid an error. */
| #ifdef __cplusplus
| extern "C"
| {
| #endif
| /* We use char because int might match the return type of a gcc2
| builtin and then its argument prototype would still apply. */
| char _stricmp ();
| /* The GNU C library defines this for functions which it implements
| to always fail with ENOSYS. Some functions are actually named
| something starting with __ and the normal name is an alias. */
| #if defined (__stub__stricmp) || defined (__stub____stricmp)
| choke me
| #else
| char (*f) () = _stricmp;
| #endif
| #ifdef __cplusplus
| }
| #endif
|
| int
| main ()
| {
| return f != _stricmp;
| ;
| return 0;
| }
configure:25549: result: no
configure:25461: checking for _strnicmp
configure:25518: g++ -o conftest -g -O2 -O3 -ffast-math -fomit-frame-pointer -fexpensive-optimizations -fno-exceptions -pipe -pedantic -fno-exceptions -W -Wall -Wundef -Wno-import -L/usr/X11R6/lib -framework SDL -Wl,-search_paths_first -mdynamic-no-pic conftest.cc -lm /usr/bin/libcurl.a -framework Carbon -framework Cocoa -framework OpenGL >&5
/usr/bin/ld: Undefined symbols:
__strnicmp
collect2: ld returned 1 exit status
configure:25524: $? = 1
configure: failed program was:
| /* confdefs.h. */
|
| #define PACKAGE_NAME ""
| #define PACKAGE_TARNAME ""
| #define PACKAGE_VERSION ""
| #define PACKAGE_STRING ""
| #define PACKAGE_BUGREPORT ""
| #define PACKAGE "bzflag"
| #define VERSION "2.0.5"
| #define BZ_BUILD_OS "darwin8.3.0"
| #define BZ_BUILD_USER "geoffrey"
| #define BUILD_REGEX 1
| #ifdef __cplusplus
| extern "C" void std::exit (int); using std::exit;
| #endif
| #define STDC_HEADERS 1
| #define HAVE_SYS_TYPES_H 1
| #define HAVE_SYS_STAT_H 1
| #define HAVE_STDLIB_H 1
| #define HAVE_STRING_H 1
| #define HAVE_MEMORY_H 1
| #define HAVE_STRINGS_H 1
| #define HAVE_INTTYPES_H 1
| #define HAVE_STDINT_H 1
| #define HAVE_UNISTD_H 1
| #define HAVE_DLFCN_H 1
| #define STDC_HEADERS 1
| #define HAVE_CSTDLIB 1
| #define HAVE_CSTDIO 1
| #define HAVE_CSTRING 1
| #define HAVE_SDL_SDL_H 1
| #define HAVE_X11_XLIB_H 1
| #define HAVE_STDINT_H 1
| #define HAVE_SYS_PARAM_H 1
| #define HAVE_UNISTD_H 1
| #define HAVE_SOCKLEN_T 1
| #define HAVE_LIBM 1
| #define HAVE_ACOSF 1
| #define HAVE_ASINF 1
| #define HAVE_ATAN2F 1
| #define HAVE_ATANF 1
| #define HAVE_COSF 1
| #define HAVE_EXPF 1
| #define HAVE_FABSF 1
| #define HAVE_FLOORF 1
| #define HAVE_FMODF 1
| #define HAVE_HYPOTF 1
| #define HAVE_LOGF 1
| #define HAVE_LOG10F 1
| #define HAVE_POWF 1
| #define HAVE_SINF 1
| #define HAVE_SQRTF 1
| #define HAVE_TANF 1
| #define HAVE_REGEX_H 1
| #define HAVE_NCURSES_H
| #define HAVE_SDL 1
| #define ROBOT 1
| #define SNAPPING 1
| #define INSTALL_DATA_DIR "/usr/local/share/bzflag"
| #define NDEBUG 1
| #define HAVE_CGLGETCURRENTCONTEXT 1
| #define HAVE_SLEEP 1
| /* end confdefs.h. */
| /* Define _strnicmp to an innocuous variant, in case <limits.h> declares _strnicmp.
| For example, HP-UX 11i <limits.h> declares gettimeofday. */
| #define _strnicmp innocuous__strnicmp
|
| /* System header to define __stub macros and hopefully few prototypes,
| which can conflict with char _strnicmp (); below.
| Prefer <limits.h> to <assert.h> if __STDC__ is defined, since
| <limits.h> exists even on freestanding compilers. */
|
| #ifdef __STDC__
| # include <limits.h>
| #else
| # include <assert.h>
| #endif
|
| #undef _strnicmp
|
| /* Override any gcc2 internal prototype to avoid an error. */
| #ifdef __cplusplus
| extern "C"
| {
| #endif
| /* We use char because int might match the return type of a gcc2
| builtin and then its argument prototype would still apply. */
| char _strnicmp ();
| /* The GNU C library defines this for functions which it implements
| to always fail with ENOSYS. Some functions are actually named
| something starting with __ and the normal name is an alias. */
| #if defined (__stub__strnicmp) || defined (__stub____strnicmp)
| choke me
| #else
| char (*f) () = _strnicmp;
| #endif
| #ifdef __cplusplus
| }
| #endif
|
| int
| main ()
| {
| return f != _strnicmp;
| ;
| return 0;
| }
configure:25549: result: no
configure:25461: checking for _vsnprintf
configure:25518: g++ -o conftest -g -O2 -O3 -ffast-math -fomit-frame-pointer -fexpensive-optimizations -fno-exceptions -pipe -pedantic -fno-exceptions -W -Wall -Wundef -Wno-import -L/usr/X11R6/lib -framework SDL -Wl,-search_paths_first -mdynamic-no-pic conftest.cc -lm /usr/bin/libcurl.a -framework Carbon -framework Cocoa -framework OpenGL >&5
/usr/bin/ld: Undefined symbols:
__vsnprintf
collect2: ld returned 1 exit status
configure:25524: $? = 1
configure: failed program was:
| /* confdefs.h. */
|
| #define PACKAGE_NAME ""
| #define PACKAGE_TARNAME ""
| #define PACKAGE_VERSION ""
| #define PACKAGE_STRING ""
| #define PACKAGE_BUGREPORT ""
| #define PACKAGE "bzflag"
| #define VERSION "2.0.5"
| #define BZ_BUILD_OS "darwin8.3.0"
| #define BZ_BUILD_USER "geoffrey"
| #define BUILD_REGEX 1
| #ifdef __cplusplus
| extern "C" void std::exit (int); using std::exit;
| #endif
| #define STDC_HEADERS 1
| #define HAVE_SYS_TYPES_H 1
| #define HAVE_SYS_STAT_H 1
| #define HAVE_STDLIB_H 1
| #define HAVE_STRING_H 1
| #define HAVE_MEMORY_H 1
| #define HAVE_STRINGS_H 1
| #define HAVE_INTTYPES_H 1
| #define HAVE_STDINT_H 1
| #define HAVE_UNISTD_H 1
| #define HAVE_DLFCN_H 1
| #define STDC_HEADERS 1
| #define HAVE_CSTDLIB 1
| #define HAVE_CSTDIO 1
| #define HAVE_CSTRING 1
| #define HAVE_SDL_SDL_H 1
| #define HAVE_X11_XLIB_H 1
| #define HAVE_STDINT_H 1
| #define HAVE_SYS_PARAM_H 1
| #define HAVE_UNISTD_H 1
| #define HAVE_SOCKLEN_T 1
| #define HAVE_LIBM 1
| #define HAVE_ACOSF 1
| #define HAVE_ASINF 1
| #define HAVE_ATAN2F 1
| #define HAVE_ATANF 1
| #define HAVE_COSF 1
| #define HAVE_EXPF 1
| #define HAVE_FABSF 1
| #define HAVE_FLOORF 1
| #define HAVE_FMODF 1
| #define HAVE_HYPOTF 1
| #define HAVE_LOGF 1
| #define HAVE_LOG10F 1
| #define HAVE_POWF 1
| #define HAVE_SINF 1
| #define HAVE_SQRTF 1
| #define HAVE_TANF 1
| #define HAVE_REGEX_H 1
| #define HAVE_NCURSES_H
| #define HAVE_SDL 1
| #define ROBOT 1
| #define SNAPPING 1
| #define INSTALL_DATA_DIR "/usr/local/share/bzflag"
| #define NDEBUG 1
| #define HAVE_CGLGETCURRENTCONTEXT 1
| #define HAVE_SLEEP 1
| /* end confdefs.h. */
| /* Define _vsnprintf to an innocuous variant, in case <limits.h> declares _vsnprintf.
| For example, HP-UX 11i <limits.h> declares gettimeofday. */
| #define _vsnprintf innocuous__vsnprintf
|
| /* System header to define __stub macros and hopefully few prototypes,
| which can conflict with char _vsnprintf (); below.
| Prefer <limits.h> to <assert.h> if __STDC__ is defined, since
| <limits.h> exists even on freestanding compilers. */
|
| #ifdef __STDC__
| # include <limits.h>
| #else
| # include <assert.h>
| #endif
|
| #undef _vsnprintf
|
| /* Override any gcc2 internal prototype to avoid an error. */
| #ifdef __cplusplus
| extern "C"
| {
| #endif
| /* We use char because int might match the return type of a gcc2
| builtin and then its argument prototype would still apply. */
| char _vsnprintf ();
| /* The GNU C library defines this for functions which it implements
| to always fail with ENOSYS. Some functions are actually named
| something starting with __ and the normal name is an alias. */
| #if defined (__stub__vsnprintf) || defined (__stub____vsnprintf)
| choke me
| #else
| char (*f) () = _vsnprintf;
| #endif
| #ifdef __cplusplus
| }
| #endif
|
| int
| main ()
| {
| return f != _vsnprintf;
| ;
| return 0;
| }
configure:25549: result: no
configure:25461: checking for atexit
configure:25518: g++ -o conftest -g -O2 -O3 -ffast-math -fomit-frame-pointer -fexpensive-optimizations -fno-exceptions -pipe -pedantic -fno-exceptions -W -Wall -Wundef -Wno-import -L/usr/X11R6/lib -framework SDL -Wl,-search_paths_first -mdynamic-no-pic conftest.cc -lm /usr/bin/libcurl.a -framework Carbon -framework Cocoa -framework OpenGL >&5
configure:25524: $? = 0
configure:25528: test -z
|| test ! -s conftest.err
configure:25531: $? = 0
configure:25534: test -s conftest
configure:25537: $? = 0
configure:25549: result: yes
configure:25461: checking for getrlimit
configure:25518: g++ -o conftest -g -O2 -O3 -ffast-math -fomit-frame-pointer -fexpensive-optimizations -fno-exceptions -pipe -pedantic -fno-exceptions -W -Wall -Wundef -Wno-import -L/usr/X11R6/lib -framework SDL -Wl,-search_paths_first -mdynamic-no-pic conftest.cc -lm /usr/bin/libcurl.a -framework Carbon -framework Cocoa -framework OpenGL >&5
configure:25524: $? = 0
configure:25528: test -z
|| test ! -s conftest.err
configure:25531: $? = 0
configure:25534: test -s conftest
configure:25537: $? = 0
configure:25549: result: yes
configure:25461: checking for glXGetCurrentContext
configure:25518: g++ -o conftest -g -O2 -O3 -ffast-math -fomit-frame-pointer -fexpensive-optimizations -fno-exceptions -pipe -pedantic -fno-exceptions -W -Wall -Wundef -Wno-import -L/usr/X11R6/lib -framework SDL -Wl,-search_paths_first -mdynamic-no-pic conftest.cc -lm /usr/bin/libcurl.a -framework Carbon -framework Cocoa -framework OpenGL >&5
/usr/bin/ld: Undefined symbols:
_glXGetCurrentContext
collect2: ld returned 1 exit status
configure:25524: $? = 1
configure: failed program was:
| /* confdefs.h. */
|
| #define PACKAGE_NAME ""
| #define PACKAGE_TARNAME ""
| #define PACKAGE_VERSION ""
| #define PACKAGE_STRING ""
| #define PACKAGE_BUGREPORT ""
| #define PACKAGE "bzflag"
| #define VERSION "2.0.5"
| #define BZ_BUILD_OS "darwin8.3.0"
| #define BZ_BUILD_USER "geoffrey"
| #define BUILD_REGEX 1
| #ifdef __cplusplus
| extern "C" void std::exit (int); using std::exit;
| #endif
| #define STDC_HEADERS 1
| #define HAVE_SYS_TYPES_H 1
| #define HAVE_SYS_STAT_H 1
| #define HAVE_STDLIB_H 1
| #define HAVE_STRING_H 1
| #define HAVE_MEMORY_H 1
| #define HAVE_STRINGS_H 1
| #define HAVE_INTTYPES_H 1
| #define HAVE_STDINT_H 1
| #define HAVE_UNISTD_H 1
| #define HAVE_DLFCN_H 1
| #define STDC_HEADERS 1
| #define HAVE_CSTDLIB 1
| #define HAVE_CSTDIO 1
| #define HAVE_CSTRING 1
| #define HAVE_SDL_SDL_H 1
| #define HAVE_X11_XLIB_H 1
| #define HAVE_STDINT_H 1
| #define HAVE_SYS_PARAM_H 1
| #define HAVE_UNISTD_H 1
| #define HAVE_SOCKLEN_T 1
| #define HAVE_LIBM 1
| #define HAVE_ACOSF 1
| #define HAVE_ASINF 1
| #define HAVE_ATAN2F 1
| #define HAVE_ATANF 1
| #define HAVE_COSF 1
| #define HAVE_EXPF 1
| #define HAVE_FABSF 1
| #define HAVE_FLOORF 1
| #define HAVE_FMODF 1
| #define HAVE_HYPOTF 1
| #define HAVE_LOGF 1
| #define HAVE_LOG10F 1
| #define HAVE_POWF 1
| #define HAVE_SINF 1
| #define HAVE_SQRTF 1
| #define HAVE_TANF 1
| #define HAVE_REGEX_H 1
| #define HAVE_NCURSES_H
| #define HAVE_SDL 1
| #define ROBOT 1
| #define SNAPPING 1
| #define INSTALL_DATA_DIR "/usr/local/share/bzflag"
| #define NDEBUG 1
| #define HAVE_CGLGETCURRENTCONTEXT 1
| #define HAVE_SLEEP 1
| #define HAVE_ATEXIT 1
| #define HAVE_GETRLIMIT 1
| /* end confdefs.h. */
| /* Define glXGetCurrentContext to an innocuous variant, in case <limits.h> declares glXGetCurrentContext.
| For example, HP-UX 11i <limits.h> declares gettimeofday. */
| #define glXGetCurrentContext innocuous_glXGetCurrentContext
|
| /* System header to define __stub macros and hopefully few prototypes,
| which can conflict with char glXGetCurrentContext (); below.
| Prefer <limits.h> to <assert.h> if __STDC__ is defined, since
| <limits.h> exists even on freestanding compilers. */
|
| #ifdef __STDC__
| # include <limits.h>
| #else
| # include <assert.h>
| #endif
|
| #undef glXGetCurrentContext
|
| /* Override any gcc2 internal prototype to avoid an error. */
| #ifdef __cplusplus
| extern "C"
| {
| #endif
| /* We use char because int might match the return type of a gcc2
| builtin and then its argument prototype would still apply. */
| char glXGetCurrentContext ();
| /* The GNU C library defines this for functions which it implements
| to always fail with ENOSYS. Some functions are actually named
| something starting with __ and the normal name is an alias. */
| #if defined (__stub_glXGetCurrentContext) || defined (__stub___glXGetCurrentContext)
| choke me
| #else
| char (*f) () = glXGetCurrentContext;
| #endif
| #ifdef __cplusplus
| }
| #endif
|
| int
| main ()
| {
| return f != glXGetCurrentContext;
| ;
| return 0;
| }
configure:25549: result: no
configure:25461: checking for select
configure:25518: g++ -o conftest -g -O2 -O3 -ffast-math -fomit-frame-pointer -fexpensive-optimizations -fno-exceptions -pipe -pedantic -fno-exceptions -W -Wall -Wundef -Wno-import -L/usr/X11R6/lib -framework SDL -Wl,-search_paths_first -mdynamic-no-pic conftest.cc -lm /usr/bin/libcurl.a -framework Carbon -framework Cocoa -framework OpenGL >&5
configure:25524: $? = 0
configure:25528: test -z
|| test ! -s conftest.err
configure:25531: $? = 0
configure:25534: test -s conftest
configure:25537: $? = 0
configure:25549: result: yes
configure:25461: checking for snooze
configure:25518: g++ -o conftest -g -O2 -O3 -ffast-math -fomit-frame-pointer -fexpensive-optimizations -fno-exceptions -pipe -pedantic -fno-exceptions -W -Wall -Wundef -Wno-import -L/usr/X11R6/lib -framework SDL -Wl,-search_paths_first -mdynamic-no-pic conftest.cc -lm /usr/bin/libcurl.a -framework Carbon -framework Cocoa -framework OpenGL >&5
/usr/bin/ld: Undefined symbols:
_snooze
collect2: ld returned 1 exit status
configure:25524: $? = 1
configure: failed program was:
| /* confdefs.h. */
|
| #define PACKAGE_NAME ""
| #define PACKAGE_TARNAME ""
| #define PACKAGE_VERSION ""
| #define PACKAGE_STRING ""
| #define PACKAGE_BUGREPORT ""
| #define PACKAGE "bzflag"
| #define VERSION "2.0.5"
| #define BZ_BUILD_OS "darwin8.3.0"
| #define BZ_BUILD_USER "geoffrey"
| #define BUILD_REGEX 1
| #ifdef __cplusplus
| extern "C" void std::exit (int); using std::exit;
| #endif
| #define STDC_HEADERS 1
| #define HAVE_SYS_TYPES_H 1
| #define HAVE_SYS_STAT_H 1
| #define HAVE_STDLIB_H 1
| #define HAVE_STRING_H 1
| #define HAVE_MEMORY_H 1
| #define HAVE_STRINGS_H 1
| #define HAVE_INTTYPES_H 1
| #define HAVE_STDINT_H 1
| #define HAVE_UNISTD_H 1
| #define HAVE_DLFCN_H 1
| #define STDC_HEADERS 1
| #define HAVE_CSTDLIB 1
| #define HAVE_CSTDIO 1
| #define HAVE_CSTRING 1
| #define HAVE_SDL_SDL_H 1
| #define HAVE_X11_XLIB_H 1
| #define HAVE_STDINT_H 1
| #define HAVE_SYS_PARAM_H 1
| #define HAVE_UNISTD_H 1
| #define HAVE_SOCKLEN_T 1
| #define HAVE_LIBM 1
| #define HAVE_ACOSF 1
| #define HAVE_ASINF 1
| #define HAVE_ATAN2F 1
| #define HAVE_ATANF 1
| #define HAVE_COSF 1
| #define HAVE_EXPF 1
| #define HAVE_FABSF 1
| #define HAVE_FLOORF 1
| #define HAVE_FMODF 1
| #define HAVE_HYPOTF 1
| #define HAVE_LOGF 1
| #define HAVE_LOG10F 1
| #define HAVE_POWF 1
| #define HAVE_SINF 1
| #define HAVE_SQRTF 1
| #define HAVE_TANF 1
| #define HAVE_REGEX_H 1
| #define HAVE_NCURSES_H
| #define HAVE_SDL 1
| #define ROBOT 1
| #define SNAPPING 1
| #define INSTALL_DATA_DIR "/usr/local/share/bzflag"
| #define NDEBUG 1
| #define HAVE_CGLGETCURRENTCONTEXT 1
| #define HAVE_SLEEP 1
| #define HAVE_ATEXIT 1
| #define HAVE_GETRLIMIT 1
| #define HAVE_SELECT 1
| /* end confdefs.h. */
| /* Define snooze to an innocuous variant, in case <limits.h> declares snooze.
| For example, HP-UX 11i <limits.h> declares gettimeofday. */
| #define snooze innocuous_snooze
|
| /* System header to define __stub macros and hopefully few prototypes,
| which can conflict with char snooze (); below.
| Prefer <limits.h> to <assert.h> if __STDC__ is defined, since
| <limits.h> exists even on freestanding compilers. */
|
| #ifdef __STDC__
| # include <limits.h>
| #else
| # include <assert.h>
| #endif
|
| #undef snooze
|
| /* Override any gcc2 internal prototype to avoid an error. */
| #ifdef __cplusplus
| extern "C"
| {
| #endif
| /* We use char because int might match the return type of a gcc2
| builtin and then its argument prototype would still apply. */
| char snooze ();
| /* The GNU C library defines this for functions which it implements
| to always fail with ENOSYS. Some functions are actually named
| something starting with __ and the normal name is an alias. */
| #if defined (__stub_snooze) || defined (__stub___snooze)
| choke me
| #else
| char (*f) () = snooze;
| #endif
| #ifdef __cplusplus
| }
| #endif
|
| int
| main ()
| {
| return f != snooze;
| ;
| return 0;
| }
configure:25549: result: no
configure:25461: checking for usleep
configure:25518: g++ -o conftest -g -O2 -O3 -ffast-math -fomit-frame-pointer -fexpensive-optimizations -fno-exceptions -pipe -pedantic -fno-exceptions -W -Wall -Wundef -Wno-import -L/usr/X11R6/lib -framework SDL -Wl,-search_paths_first -mdynamic-no-pic conftest.cc -lm /usr/bin/libcurl.a -framework Carbon -framework Cocoa -framework OpenGL >&5
configure:25524: $? = 0
configure:25528: test -z
|| test ! -s conftest.err
configure:25531: $? = 0
configure:25534: test -s conftest
configure:25537: $? = 0
configure:25549: result: yes
configure:25461: checking for vsnprintf
configure:25518: g++ -o conftest -g -O2 -O3 -ffast-math -fomit-frame-pointer -fexpensive-optimizations -fno-exceptions -pipe -pedantic -fno-exceptions -W -Wall -Wundef -Wno-import -L/usr/X11R6/lib -framework SDL -Wl,-search_paths_first -mdynamic-no-pic conftest.cc -lm /usr/bin/libcurl.a -framework Carbon -framework Cocoa -framework OpenGL >&5
configure:25524: $? = 0
configure:25528: test -z
|| test ! -s conftest.err
configure:25531: $? = 0
configure:25534: test -s conftest
configure:25537: $? = 0
configure:25549: result: yes
configure:25461: checking for wglGetCurrentContext
configure:25518: g++ -o conftest -g -O2 -O3 -ffast-math -fomit-frame-pointer -fexpensive-optimizations -fno-exceptions -pipe -pedantic -fno-exceptions -W -Wall -Wundef -Wno-import -L/usr/X11R6/lib -framework SDL -Wl,-search_paths_first -mdynamic-no-pic conftest.cc -lm /usr/bin/libcurl.a -framework Carbon -framework Cocoa -framework OpenGL >&5
/usr/bin/ld: Undefined symbols:
_wglGetCurrentContext
collect2: ld returned 1 exit status
configure:25524: $? = 1
configure: failed program was:
| /* confdefs.h. */
|
| #define PACKAGE_NAME ""
| #define PACKAGE_TARNAME ""
| #define PACKAGE_VERSION ""
| #define PACKAGE_STRING ""
| #define PACKAGE_BUGREPORT ""
| #define PACKAGE "bzflag"
| #define VERSION "2.0.5"
| #define BZ_BUILD_OS "darwin8.3.0"
| #define BZ_BUILD_USER "geoffrey"
| #define BUILD_REGEX 1
| #ifdef __cplusplus
| extern "C" void std::exit (int); using std::exit;
| #endif
| #define STDC_HEADERS 1
| #define HAVE_SYS_TYPES_H 1
| #define HAVE_SYS_STAT_H 1
| #define HAVE_STDLIB_H 1
| #define HAVE_STRING_H 1
| #define HAVE_MEMORY_H 1
| #define HAVE_STRINGS_H 1
| #define HAVE_INTTYPES_H 1
| #define HAVE_STDINT_H 1
| #define HAVE_UNISTD_H 1
| #define HAVE_DLFCN_H 1
| #define STDC_HEADERS 1
| #define HAVE_CSTDLIB 1
| #define HAVE_CSTDIO 1
| #define HAVE_CSTRING 1
| #define HAVE_SDL_SDL_H 1
| #define HAVE_X11_XLIB_H 1
| #define HAVE_STDINT_H 1
| #define HAVE_SYS_PARAM_H 1
| #define HAVE_UNISTD_H 1
| #define HAVE_SOCKLEN_T 1
| #define HAVE_LIBM 1
| #define HAVE_ACOSF 1
| #define HAVE_ASINF 1
| #define HAVE_ATAN2F 1
| #define HAVE_ATANF 1
| #define HAVE_COSF 1
| #define HAVE_EXPF 1
| #define HAVE_FABSF 1
| #define HAVE_FLOORF 1
| #define HAVE_FMODF 1
| #define HAVE_HYPOTF 1
| #define HAVE_LOGF 1
| #define HAVE_LOG10F 1
| #define HAVE_POWF 1
| #define HAVE_SINF 1
| #define HAVE_SQRTF 1
| #define HAVE_TANF 1
| #define HAVE_REGEX_H 1
| #define HAVE_NCURSES_H
| #define HAVE_SDL 1
| #define ROBOT 1
| #define SNAPPING 1
| #define INSTALL_DATA_DIR "/usr/local/share/bzflag"
| #define NDEBUG 1
| #define HAVE_CGLGETCURRENTCONTEXT 1
| #define HAVE_SLEEP 1
| #define HAVE_ATEXIT 1
| #define HAVE_GETRLIMIT 1
| #define HAVE_SELECT 1
| #define HAVE_USLEEP 1
| #define HAVE_VSNPRINTF 1
| /* end confdefs.h. */
| /* Define wglGetCurrentContext to an innocuous variant, in case <limits.h> declares wglGetCurrentContext.
| For example, HP-UX 11i <limits.h> declares gettimeofday. */
| #define wglGetCurrentContext innocuous_wglGetCurrentContext
|
| /* System header to define __stub macros and hopefully few prototypes,
| which can conflict with char wglGetCurrentContext (); below.
| Prefer <limits.h> to <assert.h> if __STDC__ is defined, since
| <limits.h> exists even on freestanding compilers. */
|
| #ifdef __STDC__
| # include <limits.h>
| #else
| # include <assert.h>
| #endif
|
| #undef wglGetCurrentContext
|
| /* Override any gcc2 internal prototype to avoid an error. */
| #ifdef __cplusplus
| extern "C"
| {
| #endif
| /* We use char because int might match the return type of a gcc2
| builtin and then its argument prototype would still apply. */
| char wglGetCurrentContext ();
| /* The GNU C library defines this for functions which it implements
| to always fail with ENOSYS. Some functions are actually named
| something starting with __ and the normal name is an alias. */
| #if defined (__stub_wglGetCurrentContext) || defined (__stub___wglGetCurrentContext)
| choke me
| #else
| char (*f) () = wglGetCurrentContext;
| #endif
| #ifdef __cplusplus
| }
| #endif
|
| int
| main ()
| {
| return f != wglGetCurrentContext;
| ;
| return 0;
| }
configure:25549: result: no
configure:25580: g++ -c -g -O2 -O3 -ffast-math -fomit-frame-pointer -fexpensive-optimizations -fno-exceptions -pipe -pedantic -fno-exceptions -W -Wall -Wundef -Wno-import conftest.cc >&5
configure:25586: $? = 0
configure:25590: test -z
|| test ! -s conftest.err
configure:25593: $? = 0
configure:25596: test -s conftest.o
configure:25599: $? = 0
configure:25633: g++ -c -g -O2 -O3 -ffast-math -fomit-frame-pointer -fexpensive-optimizations -fno-exceptions -pipe -pedantic -fno-exceptions -W -Wall -Wundef -Wno-import conftest.cc >&5
configure:25639: $? = 0
configure:25643: test -z
|| test ! -s conftest.err
configure:25646: $? = 0
configure:25649: test -s conftest.o
configure:25652: $? = 0
configure:25687: g++ -c -g -O2 -O3 -ffast-math -fomit-frame-pointer -fexpensive-optimizations -fno-exceptions -pipe -pedantic -fno-exceptions -W -Wall -Wundef -Wno-import conftest.cc >&5
configure:25693: $? = 0
configure:25697: test -z
|| test ! -s conftest.err
configure:25700: $? = 0
configure:25703: test -s conftest.o
configure:25706: $? = 0
configure:26028: creating ./config.status
## ---------------------- ##
## Running config.status. ##
## ---------------------- ##
This file was extended by config.status, which was
generated by GNU Autoconf 2.59. Invocation command line was
CONFIG_FILES =
CONFIG_HEADERS =
CONFIG_LINKS =
CONFIG_COMMANDS =
$ ./config.status
on Geoffrey-Sneddons-Computer.local
config.status:855: creating bzflag.info
config.status:855: creating BZFlag.xcode/Makefile
config.status:855: creating Dev-C++/Makefile
config.status:855: creating Makefile
config.status:855: creating bzflag.lsm
config.status:855: creating bzflag.spec
config.status:855: creating data/Makefile
config.status:855: creating data/fonts/Makefile
config.status:855: creating data/l10n/Makefile
config.status:855: creating debian/Makefile
config.status:855: creating doc/Makefile
config.status:855: creating doc/faq/Makefile
config.status:855: creating doc/guide/Commands/Makefile
config.status:855: creating doc/guide/Flags/Makefile
config.status:855: creating doc/guide/Geometry/Makefile
config.status:855: creating doc/guide/Installation/Makefile
config.status:855: creating doc/guide/Makefile
config.status:855: creating doc/guide/Tactics/Makefile
config.status:855: creating doc/howto/Makefile
config.status:855: creating doc/man/Makefile
config.status:855: creating include/Makefile
config.status:855: creating m4/Makefile
config.status:855: creating man/Makefile
config.status:855: creating man/bzadmin.6
config.status:855: creating man/bzflag.6
config.status:855: creating man/bzfs.6
config.status:855: creating man/bzw.5
config.status:855: creating misc/Makefile
config.status:855: creating package/Makefile
config.status:855: creating package/irix/Makefile
config.status:855: creating package/linux/Makefile
config.status:855: creating package/rpm/Makefile
config.status:855: creating package/win32/Makefile
config.status:855: creating package/win32/nsis/Makefile
config.status:855: creating plugins/Makefile
config.status:855: creating plugins/RogueGenocide/Makefile
config.status:855: creating plugins/SAMPLE_PLUGIN/Makefile
config.status:855: creating plugins/airspawn/Makefile
config.status:855: creating plugins/chathistory/Makefile
config.status:855: creating plugins/hiddenAdmin/Makefile
config.status:855: creating plugins/killall/Makefile
config.status:855: creating plugins/playHistoryTracker/Makefile
config.status:855: creating plugins/python/Makefile
config.status:855: creating plugins/shockwaveDeath/Makefile
config.status:855: creating plugins/vocaliser/Makefile
config.status:855: creating plugins/HoldTheFlag/Makefile
config.status:855: creating plugins/doc/Makefile
config.status:855: creating plugins/vc71/Makefile
config.status:855: creating src/3D/Makefile
config.status:855: creating src/Makefile
config.status:855: creating src/bzadmin/Makefile
config.status:855: creating src/bzflag/Makefile
config.status:855: creating src/bzfs/Makefile
config.status:855: creating src/c-ares/Makefile
config.status:855: creating src/common/Makefile
config.status:855: creating src/date/Makefile
config.status:855: creating src/game/Makefile
config.status:855: creating src/geometry/Makefile
config.status:855: creating src/geometry/models/Makefile
config.status:855: creating src/geometry/models/tank/Makefile
config.status:855: creating src/mediafile/Makefile
config.status:855: creating src/net/Makefile
config.status:855: creating src/obstacle/Makefile
config.status:855: creating src/ogl/Makefile
config.status:855: creating src/platform/MacOSX/BZFlag-Info.plist
config.status:855: creating src/platform/MacOSX/Makefile
config.status:855: creating src/platform/Makefile
config.status:855: creating src/regex/Makefile
config.status:855: creating src/scene/Makefile
config.status:855: creating src/zlib/Makefile
config.status:855: creating tools/Makefile
config.status:855: creating tools/TextTool-W32/Makefile
config.status:855: creating tools/TextTool-W32/res/Makefile
config.status:855: creating tools/bzwtransform/Makefile
config.status:855: creating tools/modeltool/Makefile
config.status:855: creating tools/modeltool/vc71/Makefile
config.status:855: creating win32/Makefile
config.status:855: creating win32/VC71/Makefile
config.status:959: creating include/config.h
config.status:1179: include/config.h is unchanged
config.status:1343: executing depfiles commands
configure:27477: result:
configure:27479: result: BZFlag-2.0.5.20051117 with the following:
configure:27485: result: curses: -lncurses
configure:27492: result: SDL
configure:27499: result: bzadmin
configure:27506: result: bzflag client
## ---------------- ##
## Cache variables. ##
## ---------------- ##
ac_cv_build=powerpc-apple-darwin8.3.0
ac_cv_build_alias=powerpc-apple-darwin8.3.0
ac_cv_c_compiler_gnu=yes
ac_cv_c_const=yes
ac_cv_cxx_compiler_gnu=yes
ac_cv_env_CC_set=
ac_cv_env_CC_value=
ac_cv_env_CFLAGS_set=
ac_cv_env_CFLAGS_value=
ac_cv_env_CPPFLAGS_set=
ac_cv_env_CPPFLAGS_value=
ac_cv_env_CPP_set=
ac_cv_env_CPP_value=
ac_cv_env_CXXCPP_set=
ac_cv_env_CXXCPP_value=
ac_cv_env_CXXFLAGS_set=
ac_cv_env_CXXFLAGS_value=
ac_cv_env_CXX_set=
ac_cv_env_CXX_value=
ac_cv_env_F77_set=
ac_cv_env_F77_value=
ac_cv_env_FFLAGS_set=
ac_cv_env_FFLAGS_value=
ac_cv_env_LDFLAGS_set=
ac_cv_env_LDFLAGS_value=
ac_cv_env_build_alias_set=
ac_cv_env_build_alias_value=
ac_cv_env_host_alias_set=
ac_cv_env_host_alias_value=
ac_cv_env_target_alias_set=
ac_cv_env_target_alias_value=
ac_cv_exeext=
ac_cv_f77_compiler_gnu=no
ac_cv_func_CGLGetCurrentContext=yes
ac_cv_func_Sleep=yes
ac_cv_func_WaitForSingleObject=no
ac_cv_func__stricmp=no
ac_cv_func__strnicmp=no
ac_cv_func__vsnprintf=no
ac_cv_func_atexit=yes
ac_cv_func_connect=yes
ac_cv_func_gethostbyname=yes
ac_cv_func_getrlimit=yes
ac_cv_func_glXGetCurrentContext=no
ac_cv_func_remove=yes
ac_cv_func_select=yes
ac_cv_func_shmat=yes
ac_cv_func_snooze=no
ac_cv_func_usleep=yes
ac_cv_func_vsnprintf=yes
ac_cv_func_wglGetCurrentContext=no
ac_cv_have_x='have_x=yes ac_x_includes= ac_x_libraries=/usr/X11R6/lib'
ac_cv_header_GL_glx_h=no
ac_cv_header_SDL_SDL_h=yes
ac_cv_header_X11_Xlib_h=yes
ac_cv_header_bstring_h=no
ac_cv_header_cstdio=yes
ac_cv_header_cstdlib=yes
ac_cv_header_cstring=yes
ac_cv_header_dlfcn_h=yes
ac_cv_header_dsound_h=no
ac_cv_header_inttypes_h=yes
ac_cv_header_linux_input_h=no
ac_cv_header_memory_h=yes
ac_cv_header_stdc=yes
ac_cv_header_stdint_h=yes
ac_cv_header_stdlib_h=yes
ac_cv_header_string_h=yes
ac_cv_header_strings_h=yes
ac_cv_header_sys_param_h=yes
ac_cv_header_sys_stat_h=yes
ac_cv_header_sys_types_h=yes
ac_cv_header_unistd_h=yes
ac_cv_header_values_h=no
ac_cv_host=powerpc-apple-darwin8.3.0
ac_cv_host_alias=powerpc-apple-darwin8.3.0
ac_cv_lib_ICE_IceConnectionNumber=yes
ac_cv_lib_bind_gethostent=no
ac_cv_lib_cares_ares_init=no
ac_cv_lib_dl_dlopen=yes
ac_cv_lib_m_acosf=yes
ac_cv_lib_m_asinf=yes
ac_cv_lib_m_atan2f=yes
ac_cv_lib_m_atanf=yes
ac_cv_lib_m_cosf=yes
ac_cv_lib_m_expf=yes
ac_cv_lib_m_fabsf=yes
ac_cv_lib_m_floorf=yes
ac_cv_lib_m_fmodf=yes
ac_cv_lib_m_hypotf=yes
ac_cv_lib_m_log10f=yes
ac_cv_lib_m_logf=yes
ac_cv_lib_m_powf=yes
ac_cv_lib_m_sinf=yes
ac_cv_lib_m_sqrtf=yes
ac_cv_lib_m_tanf=yes
ac_cv_lib_socket_gethostent=no
ac_cv_lib_socket_socket=no
ac_cv_lib_z_compress=yes
ac_cv_objext=o
ac_cv_path_install='/usr/bin/install -c'
ac_cv_prog_AR=ar
ac_cv_prog_AWK=awk
ac_cv_prog_CPP='gcc -E'
ac_cv_prog_CXXCPP='g++ -E'
ac_cv_prog_HASPOD2MAN=yes
ac_cv_prog_HASWHOAMI=yes
ac_cv_prog_ac_ct_AR=ar
ac_cv_prog_ac_ct_CC=gcc
ac_cv_prog_ac_ct_CXX=g++
ac_cv_prog_ac_ct_RANLIB=ranlib
ac_cv_prog_ac_ct_STRIP=strip
ac_cv_prog_ac_ct_WINDRES=:
ac_cv_prog_cc_g=yes
ac_cv_prog_cc_stdc=
ac_cv_prog_cxx_g=yes
ac_cv_prog_egrep='grep -E'
ac_cv_prog_f77_g=no
ac_cv_prog_make_make_set=yes
ac_cv_search_glBegin='-framework OpenGL'
ac_cv_search_gluScaleImage='-framework OpenGL'
ac_cv_target=powerpc-apple-darwin8.3.0
ac_cv_target_alias=powerpc-apple-darwin8.3.0
ac_cv_type_socklen_t=yes
am_cv_CC_dependencies_compiler_type=gcc3
am_cv_CXX_dependencies_compiler_type=gcc3
lt_cv_deplibs_check_method=pass_all
lt_cv_dlopen=dlopen
lt_cv_dlopen_libs=-ldl
lt_cv_dlopen_self=yes
lt_cv_dlopen_self_static=yes
lt_cv_file_magic_cmd='/usr/bin/file -L'
lt_cv_file_magic_test_file=/usr/lib/libSystem.dylib
lt_cv_ld_reload_flag=-r
lt_cv_objdir=.libs
lt_cv_path_LD=/usr/bin/ld
lt_cv_path_LDCXX=/usr/bin/ld
lt_cv_path_NM='/usr/bin/nm -p'
lt_cv_path_SED=/usr/bin/sed
lt_cv_prog_compiler_c_o=yes
lt_cv_prog_compiler_c_o_CXX=yes
lt_cv_prog_compiler_rtti_exceptions=no
lt_cv_prog_gnu_ld=no
lt_cv_prog_gnu_ldcxx=no
lt_cv_sys_global_symbol_pipe='sed -n -e '\''s/^.*[ ]\([BCDEGRST][BCDEGRST]*\)[ ][ ]*\(_\)\([_A-Za-z][_A-Za-z0-9]*\)$/\1 \2\3 \3/p'\'''
lt_cv_sys_global_symbol_to_c_name_address='sed -n -e '\''s/^: \([^ ]*\) $/ {\"\1\", (lt_ptr) 0},/p'\'' -e '\''s/^[BCDEGRST] \([^ ]*\) \([^ ]*\)$/ {"\2", (lt_ptr) \&\2},/p'\'''
lt_cv_sys_global_symbol_to_cdecl='sed -n -e '\''s/^. .* \(.*\)$/extern int \1;/p'\'''
lt_cv_sys_max_cmd_len=65536
lt_lt_cv_prog_compiler_c_o='"yes"'
lt_lt_cv_prog_compiler_c_o_CXX='"yes"'
lt_lt_cv_sys_global_symbol_pipe='"sed -n -e '\''s/^.*[ ]\\([BCDEGRST][BCDEGRST]*\\)[ ][ ]*\\(_\\)\\([_A-Za-z][_A-Za-z0-9]*\\)\$/\\1 \\2\\3 \\3/p'\''"'
lt_lt_cv_sys_global_symbol_to_c_name_address='"sed -n -e '\''s/^: \\([^ ]*\\) \$/ {\\\"\\1\\\", (lt_ptr) 0},/p'\'' -e '\''s/^[BCDEGRST] \\([^ ]*\\) \\([^ ]*\\)\$/ {\"\\2\", (lt_ptr) \\&\\2},/p'\''"'
lt_lt_cv_sys_global_symbol_to_cdecl='"sed -n -e '\''s/^. .* \\(.*\\)\$/extern int \\1;/p'\''"'
mp_cv_ncurses=yes
my_cv_curl_vers=7.15.0
## ----------------- ##
## Output variables. ##
## ----------------- ##
ACLOCAL='${SHELL} /Users/geoffrey/Desktop/bzflag/misc/missing --run aclocal-1.6'
AMDEPBACKSLASH='\'
AMDEP_FALSE='#'
AMDEP_TRUE=''
AMTAR='${SHELL} /Users/geoffrey/Desktop/bzflag/misc/missing --run tar'
AR='ar'
AR_FLAGS='cru'
AUTOCONF='${SHELL} /Users/geoffrey/Desktop/bzflag/misc/missing --run autoconf'
AUTOHEADER='${SHELL} /Users/geoffrey/Desktop/bzflag/misc/missing --run autoheader'
AUTOMAKE='${SHELL} /Users/geoffrey/Desktop/bzflag/misc/missing --run automake-1.6'
AWK='awk'
BEOS_FALSE=''
BEOS_TRUE='#'
BUGGY_MIPSPRO_FALSE=''
BUGGY_MIPSPRO_TRUE='#'
BUILDCARES_FALSE='#'
BUILDCARES_TRUE=''
BUILDZLIB_FALSE=''
BUILDZLIB_TRUE='#'
BUILD_PLUGINS_FALSE=''
BUILD_PLUGINS_TRUE='#'
BUILD_REGEX_FALSE='#'
BUILD_REGEX_TRUE=''
BZADMIN_INCLUDED_FALSE='#'
BZADMIN_INCLUDED_TRUE=''
BZFLAG_DATE='2005-11-17'
BZFLAG_VERSION='2.0.5'
CC='gcc'
CCACHE=''
CCDEPMODE='depmode=gcc3'
CFLAGS='-g -O2 -pipe -pedantic -fno-exceptions -W -Wall -Wundef -Wno-import -O3'
CLIENT_INCLUDED_FALSE='#'
CLIENT_INCLUDED_TRUE=''
CONFIG=''
CPP='gcc -E'
CPPFLAGS=' -pipe -pedantic -fno-exceptions -W -Wall -Wundef -Wno-import'
CURL_CFLAGS='-I/usr/local/include'
CURSES_LIB='-lncurses'
CXX='g++'
CXXCPP='g++ -E'
CXXDEPMODE='depmode=gcc3'
CXXFLAGS='-g -O2 -O3 -ffast-math -fomit-frame-pointer -fexpensive-optimizations -fno-exceptions'
DEBUG_FALSE=''
DEBUG_TRUE='#'
DEFS='-DHAVE_CONFIG_H'
DEPDIR='.deps'
ECHO='echo'
ECHO_C=''
ECHO_N='-n'
ECHO_T=''
EGREP='grep -E'
EXEEXT=''
F77=''
FFLAGS=''
GLIBS='-framework OpenGL -framework OpenGL '
HASPOD2MAN='yes'
HASPOD2MAN_FALSE='#'
HASPOD2MAN_TRUE=''
HASWHOAMI='yes'
HAVE_CURSES_FALSE='#'
HAVE_CURSES_TRUE=''
HAVE_KRB5_FALSE=''
HAVE_KRB5_TRUE='#'
HAVE_SDL_FALSE='#'
HAVE_SDL_TRUE=''
INSTALL_DATA='${INSTALL} -m 644'
INSTALL_DATA_DIR='/usr/local/share/bzflag'
INSTALL_PROGRAM='${INSTALL}'
INSTALL_SCRIPT='${INSTALL}'
INSTALL_STRIP_PROGRAM='${SHELL} $(install_sh) -c -s'
IRIX_FALSE=''
IRIX_TRUE='#'
KRB5_CFLAGS=''
KRB5_CONFIG='no'
KRB5_LIBS=''
LDFLAGS=' -L/usr/X11R6/lib -framework SDL -Wl,-search_paths_first -mdynamic-no-pic'
LIBDIR='$(top_srcdir)/lib'
LIBOBJS=''
LIBS='-lm /usr/bin/libcurl.a -framework Carbon -framework Cocoa -framework OpenGL'
LIBTOOL='$(SHELL) $(top_builddir)/libtool'
LIBTOOL_DEPS='misc/ltmain.sh'
LINUX_FALSE=''
LINUX_TRUE='#'
LN_S='ln -s'
LTLIBOBJS=''
MACOS_FALSE='#'
MACOS_TRUE=''
MAJOR_VERSION='2'
MAKEINFO='${SHELL} /Users/geoffrey/Desktop/bzflag/misc/missing --run makeinfo'
MINOR_VERSION='0'
OBJEXT='o'
PACKAGE='bzflag'
PACKAGE_BUGREPORT=''
PACKAGE_NAME=''
PACKAGE_STRING=''
PACKAGE_TARNAME=''
PACKAGE_VERSION=''
PATH_SEPARATOR=':'
PC_FALSE=''
PC_TRUE='#'
PPC_FALSE=''
PPC_TRUE='#'
RANLIB='ranlib'
SDL_CFLAGS=''
SDL_CONFIG=''
SDL_LIBS=''
SET_MAKE=''
SHELL='/bin/sh'
SOLARIS_FALSE=''
SOLARIS_TRUE='#'
STRIP='strip'
VERSION='2.0.5'
WIN32_FALSE=''
WIN32_TRUE='#'
WINDRES=':'
WINPORT=''
X_CFLAGS=''
X_EXTRA_LIBS=''
X_LIBS=' -L/usr/X11R6/lib'
X_PRE_LIBS=' -lSM -lICE'
ac_ct_AR='ar'
ac_ct_CC='gcc'
ac_ct_CXX='g++'
ac_ct_F77=''
ac_ct_RANLIB='ranlib'
ac_ct_STRIP='strip'
ac_ct_WINDRES=':'
am__include='include'
am__quote=''
bindir='${exec_prefix}/bin'
build='powerpc-apple-darwin8.3.0'
build_alias=''
build_cpu='powerpc'
build_os='darwin8.3.0'
build_vendor='apple'
datadir='${prefix}/share'
desktopdir='/usr/local/share/applications'
exec_prefix='${prefix}'
host='powerpc-apple-darwin8.3.0'
host_alias=''
host_cpu='powerpc'
host_os='darwin8.3.0'
host_vendor='apple'
includedir='${prefix}/include'
infodir='${prefix}/info'
install_sh='/Users/geoffrey/Desktop/bzflag/misc/install-sh'
libdir='${exec_prefix}/lib'
libexecdir='${exec_prefix}/libexec'
localstatedir='${prefix}/var'
mandir='${prefix}/man'
oldincludedir='/usr/include'
prefix='/usr/local'
program_transform_name='s,x,x,'
sbindir='${exec_prefix}/sbin'
sharedstatedir='${prefix}/com'
sysconfdir='${prefix}/etc'
target='powerpc-apple-darwin8.3.0'
target_alias=''
target_cpu='powerpc'
target_os='darwin8.3.0'
target_vendor='apple'
## ----------- ##
## confdefs.h. ##
## ----------- ##
#define BUILD_REGEX 1
#define BZ_BUILD_OS "darwin8.3.0"
#define BZ_BUILD_USER "geoffrey"
#define HAVE_ACOSF 1
#define HAVE_ASINF 1
#define HAVE_ATAN2F 1
#define HAVE_ATANF 1
#define HAVE_ATEXIT 1
#define HAVE_CGLGETCURRENTCONTEXT 1
#define HAVE_COSF 1
#define HAVE_CSTDIO 1
#define HAVE_CSTDLIB 1
#define HAVE_CSTRING 1
#define HAVE_DLFCN_H 1
#define HAVE_EXPF 1
#define HAVE_FABSF 1
#define HAVE_FLOORF 1
#define HAVE_FMODF 1
#define HAVE_GETRLIMIT 1
#define HAVE_HYPOTF 1
#define HAVE_INTTYPES_H 1
#define HAVE_LIBM 1
#define HAVE_LOG10F 1
#define HAVE_LOGF 1
#define HAVE_MEMORY_H 1
#define HAVE_NCURSES_H
#define HAVE_POWF 1
#define HAVE_REGEX_H 1
#define HAVE_SDL 1
#define HAVE_SDL_SDL_H 1
#define HAVE_SELECT 1
#define HAVE_SINF 1
#define HAVE_SLEEP 1
#define HAVE_SOCKLEN_T 1
#define HAVE_SQRTF 1
#define HAVE_STDINT_H 1
#define HAVE_STDINT_H 1
#define HAVE_STDLIB_H 1
#define HAVE_STD__COUNT 1
#define HAVE_STD__MAX 1
#define HAVE_STD__MIN 1
#define HAVE_STRINGS_H 1
#define HAVE_STRING_H 1
#define HAVE_SYS_PARAM_H 1
#define HAVE_SYS_STAT_H 1
#define HAVE_SYS_TYPES_H 1
#define HAVE_TANF 1
#define HAVE_UNISTD_H 1
#define HAVE_UNISTD_H 1
#define HAVE_USLEEP 1
#define HAVE_VSNPRINTF 1
#define HAVE_X11_XLIB_H 1
#define INSTALL_DATA_DIR "/usr/local/share/bzflag"
#define NDEBUG 1
#define PACKAGE "bzflag"
#define PACKAGE_BUGREPORT ""
#define PACKAGE_NAME ""
#define PACKAGE_STRING ""
#define PACKAGE_TARNAME ""
#define PACKAGE_VERSION ""
#define ROBOT 1
#define SNAPPING 1
#define STDC_HEADERS 1
#define STDC_HEADERS 1
#define VERSION "2.0.5"
#endif
#ifdef __cplusplus
extern "C" void std::exit (int); using std::exit;
configure: exit 0