In file included from storytext.cpp:7:
storytext.h:12:9: error: too many decimal points in number
storytext.h:8: error: expected unqualified-id before '<<' token
storytext.h:10: error: expected unqualified-id before '==' token
storytext.h:12: error: expected unqualified-id before '>>' token
../../scribus/text/fsize.h:116: error: 'FSize' has not been declared
../../scribus/text/fsize.h: In function 'int FSize()':
../../scribus/text/fsize.h:117: error: 'wd' was not declared in this scope
../../scribus/text/fsize.h:117: error: 'ht' was not declared in this scope
../../scribus/text/fsize.h:117: warning: no return statement in function returning non-void
../../scribus/text/fsize.h: At global scope:
../../scribus/text/fsize.h:119: error: 'FSize' is not a class or namespace
../../scribus/text/fsize.h: In function 'int FSize(double, double)':
../../scribus/text/fsize.h:120: error: 'wd' was not declared in this scope
../../scribus/text/fsize.h:120: error: 'ht' was not declared in this scope
../../scribus/text/fsize.h:120: warning: no return statement in function returning non-void
../../scribus/text/fsize.h: At global scope:
../../scribus/text/fsize.h:122: error: 'FSize' is not a class or namespace
../../scribus/text/fsize.h:122: error: non-member function 'bool isNull()' cannot have cv-qualifier
../../scribus/text/fsize.h: In function 'bool isNull()':
../../scribus/text/fsize.h:123: error: 'wd' was not declared in this scope
../../scribus/text/fsize.h:123: error: 'ht' was not declared in this scope
../../scribus/text/fsize.h: At global scope:
../../scribus/text/fsize.h:125: error: 'FSize' is not a class or namespace
../../scribus/text/fsize.h:125: error: non-member function 'bool isEmpty()' cannot have cv-qualifier
../../scribus/text/fsize.h: In function 'bool isEmpty()':
../../scribus/text/fsize.h:126: error: 'wd' was not declared in this scope
../../scribus/text/fsize.h:126: error: 'ht' was not declared in this scope
../../scribus/text/fsize.h: At global scope:
../../scribus/text/fsize.h:128: error: 'FSize' is not a class or namespace
../../scribus/text/fsize.h:128: error: non-member function 'bool isValid()' cannot have cv-qualifier
../../scribus/text/fsize.h: In function 'bool isValid()':
../../scribus/text/fsize.h:129: error: 'wd' was not declared in this scope
../../scribus/text/fsize.h:129: error: 'ht' was not declared in this scope
../../scribus/text/fsize.h: At global scope:
../../scribus/text/fsize.h:131: error: 'FSize' is not a class or namespace
../../scribus/text/fsize.h:131: error: non-member function 'double width()' cannot have cv-qualifier
../../scribus/text/fsize.h: In function 'double width()':
../../scribus/text/fsize.h:132: error: 'wd' was not declared in this scope
../../scribus/text/fsize.h: At global scope:
../../scribus/text/fsize.h:134: error: 'FSize' is not a class or namespace
../../scribus/text/fsize.h:134: error: non-member function 'double height()' cannot have cv-qualifier
../../scribus/text/fsize.h: In function 'double height()':
../../scribus/text/fsize.h:135: error: 'ht' was not declared in this scope
../../scribus/text/fsize.h: At global scope:
../../scribus/text/fsize.h:137: error: 'FSize' is not a class or namespace
../../scribus/text/fsize.h: In function 'void setWidth(double)':
../../scribus/text/fsize.h:138: error: 'wd' was not declared in this scope
../../scribus/text/fsize.h: At global scope:
../../scribus/text/fsize.h:140: error: 'FSize' is not a class or namespace
../../scribus/text/fsize.h: In function 'void setHeight(double)':
../../scribus/text/fsize.h:141: error: 'ht' was not declared in this scope
../../scribus/text/fsize.h: At global scope:
../../scribus/text/fsize.h:143: error: 'FSize' is not a class or namespace
../../scribus/text/fsize.h: In function 'double& rwidth()':
../../scribus/text/fsize.h:144: error: 'wd' was not declared in this scope
../../scribus/text/fsize.h: At global scope:
../../scribus/text/fsize.h:146: error: 'FSize' is not a class or namespace
../../scribus/text/fsize.h: In function 'double& rheight()':
../../scribus/text/fsize.h:147: error: 'ht' was not declared in this scope
../../scribus/text/fsize.h: At global scope:
../../scribus/text/fsize.h:149: error: expected initializer before '&' token
../../scribus/text/fsize.h:152: error: expected initializer before '&' token
../../scribus/text/fsize.h:155: error: expected initializer before '&' token
../../scribus/text/fsize.h:158: error: expected initializer before '&' token
../../scribus/text/fsize.h:161: error: expected ',' or '...' before '&' token
../../scribus/text/fsize.h:161: error: ISO C++ forbids declaration of 'FSize' with no type
../../scribus/text/fsize.h:161: error: 'bool operator==(int)' must have an argument of class or enumerated type
../../scribus/text/fsize.h:161: error: 'bool operator==(int)' must take exactly two arguments
../../scribus/text/fsize.h: In function 'bool operator==(int)':
../../scribus/text/fsize.h:162: error: 's1' was not declared in this scope
../../scribus/text/fsize.h:162: error: 's2' was not declared in this scope
../../scribus/text/fsize.h: At global scope:
../../scribus/text/fsize.h:161: warning: unused parameter 'FSize'
../../scribus/text/fsize.h:164: error: expected ',' or '...' before '&' token
../../scribus/text/fsize.h:164: error: ISO C++ forbids declaration of 'FSize' with no type
../../scribus/text/fsize.h:164: error: 'bool operator!=(int)' must have an argument of class or enumerated type
../../scribus/text/fsize.h:164: error: 'bool operator!=(int)' must take exactly two arguments
../../scribus/text/fsize.h: In function 'bool operator!=(int)':
../../scribus/text/fsize.h:165: error: 's1' was not declared in this scope
../../scribus/text/fsize.h:165: error: 's2' was not declared in this scope
../../scribus/text/fsize.h: At global scope:
../../scribus/text/fsize.h:164: warning: unused parameter 'FSize'
../../scribus/text/fsize.h:167: error: expected initializer before 'operator'
../../scribus/text/fsize.h:170: error: expected initializer before 'operator'
../../scribus/text/fsize.h:173: error: expected initializer before 'operator'
../../scribus/text/fsize.h:176: error: expected initializer before 'operator'
../../scribus/text/fsize.h:179: error: expected initializer before 'operator'
../../scribus/text/fsize.h:182: error: expected initializer before 'operator'
../../scribus/text/fsize.h:185: error: expected initializer before '&' token
../../scribus/text/fsize.h:195: error: expected initializer before '&' token
../../scribus/text/fsize.h:205: error: expected initializer before 'operator'
../../scribus/text/fsize.h:214: error: expected initializer before 'operator'
../../scribus/text/fsize.h:223: error: 'FSize' does not name a type
../../scribus/text/fsize.h:228: error: 'FSize' does not name a type
../../scribus/text/frect.h:55: error: 'FSize' is not a type
../../scribus/text/frect.h:111: error: 'FSize' does not name a type
../../scribus/text/frect.h:116: error: expected ',' or '...' before '&' token
../../scribus/text/frect.h:116: error: ISO C++ forbids declaration of 'FSize' with no type
../../scribus/text/frect.h:248: error: 'FSize' does not name a type
storytext.cpp: In member function 'QString StoryText::text(int, uint) const':
storytext.cpp:519: warning: comparison of unsigned expression >= 0 is always true
storytext.cpp: In member function 'const CharStyle& StoryText::charStyle(int) const':
storytext.cpp:563: warning: format not a string literal and no format arguments
storytext.cpp: In member function 'const ParagraphStyle& StoryText::paragraphStyle(int) const':
storytext.cpp:595: warning: format not a string literal and no format arguments
storytext.cpp: In member function 'void StoryText::applyStyle(int, const ParagraphStyle&)':
storytext.cpp:698: warning: format not a string literal and no format arguments
storytext.cpp: In member function 'void StoryText::eraseStyle(int, const ParagraphStyle&)':
storytext.cpp:728: warning: format not a string literal and no format arguments
storytext.cpp: At global scope:
storytext.cpp:1015: warning: unused parameter 'pos'
storytext.cpp:1019: warning: unused parameter 'pos'
storytext.cpp:1131: warning: unused parameter 'embedded'
storytext.cpp:1143: warning: unused parameter 'firstitem'
storytext.cpp:1143: warning: unused parameter 'lastitem'
storytext.cpp:1190: warning: unused parameter 'len'
storytext.cpp:1210: warning: unused parameter 'startItem'
make[3]: *** [storytext.lo] Error 1
make[3]: Leaving directory `/home/mrdocs/cvs/13/Scribus/scribus/text'
make[2]: *** [all-recursive] Error 1
make[2]: Leaving directory `/home/mrdocs/cvs/13/Scribus/scribus'
make[1]: *** [all-recursive] Error 1
make[1]: Leaving directory `/home/mrdocs/cvs/13/Scribus'
make: *** [all] Error 2