rendered paste bodymake[7]: Leaving directory `/var/tmp/portage/kde-base/kopete-3.5.5-r2/work/kopete-3.5.5/kopete/protocols/jabber/libiris/cutestuff/util'
make[7]: Entering directory `/var/tmp/portage/kde-base/kopete-3.5.5-r2/work/kopete-3.5.5/kopete/protocols/jabber/libiris/cutestuff'
make[7]: Nothing to be done for `all-am'.
make[7]: Leaving directory `/var/tmp/portage/kde-base/kopete-3.5.5-r2/work/kopete-3.5.5/kopete/protocols/jabber/libiris/cutestuff'
make[6]: Leaving directory `/var/tmp/portage/kde-base/kopete-3.5.5-r2/work/kopete-3.5.5/kopete/protocols/jabber/libiris/cutestuff'
make[6]: Entering directory `/var/tmp/portage/kde-base/kopete-3.5.5-r2/work/kopete-3.5.5/kopete/protocols/jabber/libiris'
make[6]: Nothing to be done for `all-am'.
make[6]: Leaving directory `/var/tmp/portage/kde-base/kopete-3.5.5-r2/work/kopete-3.5.5/kopete/protocols/jabber/libiris'
make[5]: Leaving directory `/var/tmp/portage/kde-base/kopete-3.5.5-r2/work/kopete-3.5.5/kopete/protocols/jabber/libiris'
Making all in jingle
make[5]: Entering directory `/var/tmp/portage/kde-base/kopete-3.5.5-r2/work/kopete-3.5.5/kopete/protocols/jabber/jingle'
Making all in libjingle
make[6]: Entering directory `/var/tmp/portage/kde-base/kopete-3.5.5-r2/work/kopete-3.5.5/kopete/protocols/jabber/jingle/libjingle'
Making all in talk
make[7]: Entering directory `/var/tmp/portage/kde-base/kopete-3.5.5-r2/work/kopete-3.5.5/kopete/protocols/jabber/jingle/libjingle/talk'
Making all in base
make[8]: Entering directory `/var/tmp/portage/kde-base/kopete-3.5.5-r2/work/kopete-3.5.5/kopete/protocols/jabber/jingle/libjingle/talk/base'
/bin/sh ../../../../../../../libtool --silent --tag=CC --mode=compile x86_64-pc-linux-gnu-gcc -DHAVE_CONFIG_H -I./../.. -DPOSIX -I./../.. -I../../../../../../.. -I/usr/kde/3.5/include -I/usr/qt/3/include -I. -DQT_THREAD_SUPPORT -D_REENTRANT -D_LARGE_FILES=1 -std=iso9899:1990 -W -Wall -Wchar-subscripts -Wshadow -Wpointer-arith -Wmissing-prototypes -Wwrite-strings -D_XOPEN_SOURCE=500 -D_BSD_SOURCE -DNDEBUG -O2 -march=athlon64 -O2 -msse3 -pipe -Wformat-security -Wmissing-format-attribute -c -o md5c.lo md5c.c
creating libcricketbase_la.all_cc.cc ...
/bin/sh ../../../../../../../libtool --silent --tag=CXX --mode=compile x86_64-pc-linux-gnu-g++ -DHAVE_CONFIG_H -I./../.. -DPOSIX -I./../.. -I../../../../../../.. -I/usr/kde/3.5/include -I/usr/qt/3/include -I. -DQT_THREAD_SUPPORT -D_REENTRANT -D_LARGE_FILES=1 -Wno-long-long -Wundef -ansi -D_XOPEN_SOURCE=500 -D_BSD_SOURCE -Wcast-align -Wconversion -Wchar-subscripts -Wall -W -Wpointer-arith -DNDEBUG -DNO_DEBUG -O2 -march=athlon64 -O2 -msse3 -pipe -Wformat-security -Wmissing-format-attribute -Wno-non-virtual-dtor -fno-exceptions -fno-check-new -fno-common -DQT_CLEAN_NAMESPACE -DQT_NO_ASCII_CAST -DQT_NO_STL -DQT_NO_COMPAT -DQT_NO_TRANSLATION -c -o libcricketbase_la.all_cc.lo libcricketbase_la.all_cc.cc
In file included from libcricketbase_la.all_cc.cc:2:
socketaddress.cc:256:5: warning: "WIN32" is not defined
In file included from ./../../talk/base/messagequeue.h:32,
from messagequeue.cc:31,
from libcricketbase_la.all_cc.cc:5:
./../../talk/base/criticalsection.h:43:5: warning: "CS_TRACK_OWNER" is not defined
socketaddress.cc:212: warning: unused parameter 'len'
socketaddress.cc:220: warning: unused parameter 'len'
./../../talk/base/asyncsocket.h:81: warning: unused parameter 'socket'
./../../talk/base/asyncsocket.h:82: warning: unused parameter 'socket'
./../../talk/base/asyncsocket.h:83: warning: unused parameter 'socket'
./../../talk/base/asyncsocket.h:84: warning: unused parameter 'socket'
asyncudpsocket.cc:66: warning: unused parameter 'socket'
physicalsocketserver.cc:212: warning: unused parameter 'opt'
physicalsocketserver.cc:430: warning: unused parameter 'ff'
physicalsocketserver.cc:442: warning: unused parameter 'ff'
physicalsocketserver.cc:442: warning: unused parameter 'err'
physicalsocketserver.cc:491: warning: unused parameter 'ff'
physicalsocketserver.cc:536: warning: unused parameter 'ff'
physicalsocketserver.cc:756: warning: unused parameter 'ff'
physicalsocketserver.cc:756: warning: unused parameter 'err'
asynctcpsocket.cc:55: error: conflicting declaration 'const size_t cricket::BUF_SIZE'
asyncudpsocket.cc:51: error: 'cricket::BUF_SIZE' has a previous declaration as 'const int cricket::BUF_SIZE'
asynctcpsocket.cc:160: warning: unused parameter 'socket'
asynctcpsocket.cc:164: warning: unused parameter 'socket'
asynctcpsocket.cc:185: warning: unused parameter 'socket'
asynctcpsocket.cc:193: warning: unused parameter 'socket'
socketadapters.cc: In member function 'virtual void cricket::AsyncSSLSocket::OnConnectEvent(cricket::AsyncSocket*)':
socketadapters.cc:174: warning: unused variable 'res'
socketadapters.cc: At global scope:
socketadapters.cc:170: warning: unused parameter 'socket'
socketadapters.cc: In static member function 'static cricket::AsyncHttpsProxySocket::AuthResult cricket::AsyncHttpsProxySocket::Authenticate(const char*, size_t, const cricket::SocketAddress&, const std::string&, const std::string&, const std::string&, const buzz::XmppPassword&, cricket::AsyncHttpsProxySocket::AuthContext*&, std::string&, std::string&)':
socketadapters.cc:338: warning: format '%d' expects type 'int', but argument 3 has type 'time_t'
socketadapters.cc: At global scope:
socketadapters.cc:284: warning: unused parameter 'server'
socketadapters.cc: In member function 'void cricket::AsyncHttpsProxySocket::ProcessLine(char*, size_t)':
socketadapters.cc:790: warning: use of assignment suppression and length modifier together in scanf format
socketadapters.cc:790: warning: use of assignment suppression and length modifier together in scanf format
socketadapters.cc: At global scope:
socketadapters.cc:886: warning: unused parameter 'socket'
host.cc:52: warning: unused parameter 'err'
make[8]: *** [libcricketbase_la.all_cc.lo] Error 1
make[8]: Leaving directory `/var/tmp/portage/kde-base/kopete-3.5.5-r2/work/kopete-3.5.5/kopete/protocols/jabber/jingle/libjingle/talk/base'
make[7]: *** [all-recursive] Error 1
make[7]: Leaving directory `/var/tmp/portage/kde-base/kopete-3.5.5-r2/work/kopete-3.5.5/kopete/protocols/jabber/jingle/libjingle/talk'
make[6]: *** [all-recursive] Error 1
make[6]: Leaving directory `/var/tmp/portage/kde-base/kopete-3.5.5-r2/work/kopete-3.5.5/kopete/protocols/jabber/jingle/libjingle'
make[5]: *** [all-recursive] Error 1
make[5]: Leaving directory `/var/tmp/portage/kde-base/kopete-3.5.5-r2/work/kopete-3.5.5/kopete/protocols/jabber/jingle'
make[4]: *** [all-recursive] Error 1
make[4]: Leaving directory `/var/tmp/portage/kde-base/kopete-3.5.5-r2/work/kopete-3.5.5/kopete/protocols/jabber'
make[3]: *** [all-recursive] Error 1
make[3]: Leaving directory `/var/tmp/portage/kde-base/kopete-3.5.5-r2/work/kopete-3.5.5/kopete/protocols'
make[2]: *** [all-recursive] Error 1
make[2]: Leaving directory `/var/tmp/portage/kde-base/kopete-3.5.5-r2/work/kopete-3.5.5/kopete'
make[1]: *** [all-recursive] Error 1
make[1]: Leaving directory `/var/tmp/portage/kde-base/kopete-3.5.5-r2/work/kopete-3.5.5'
make: *** [all] Error 2
!!! ERROR: kde-base/kopete-3.5.5-r2 failed.
Call stack:
ebuild.sh, line 1580: Called dyn_compile
ebuild.sh, line 945: Called src_compile
kopete-3.5.5-r2.ebuild, line 119: Called kde_src_compile
kde.eclass, line 169: Called kde_src_compile 'all'
kde.eclass, line 339: Called kde_src_compile 'myconf' 'configure' 'make'
kde.eclass, line 335: Called die
!!! died running emake, kde_src_compile:make
!!! If you need support, post the topmost build error, and the call stack if relevant.