All pastes #288235 Raw Edit

Something

public text v1 · immutable
#288235 ·published 2006-12-22 03:26 UTC
rendered paste body
Darkwaters ~ # emerge amarok
Calculating dependencies... done!

>>> Emerging (1 of 1) media-sound/amarok-1.4.4-r3 to /
 * amarok-1.4.4.tar.bz2 RMD160 ;-) ...                                    [ ok ]
 * amarok-1.4.4.tar.bz2 SHA1 ;-) ...                                      [ ok ]
 * amarok-1.4.4.tar.bz2 MD5 ;-) ...                                       [ ok ]
 * amarok-1.4.4.tar.bz2 SHA256 ;-) ...                                    [ ok ]
 * amarok-1.4.4.tar.bz2 size ;-) ...                                      [ ok ]
 * checking ebuild checksums ;-) ...                                      [ ok ]
 * checking auxfile checksums ;-) ...                                     [ ok ]
 * checking miscfile checksums ;-) ...                                    [ ok ]
 * checking amarok-1.4.4.tar.bz2 ;-) ...                                  [ ok ]
>>> Unpacking source...
>>> Unpacking amarok-1.4.4.tar.bz2 to /var/tmp/portage/media-sound/amarok-1.4.4-r3/work
 * Applying amarok-1.4.4-podcast-fix.patch ...                            [ ok ]
 * Applying amarok-1.4.4-sparc.patch ...                                  [ ok ]
 * Enabling translations for: az bg br ca cs cy da de el en_GB es et fi fr ga gl he hi hu is it ja km ko lt ms nb nl nn pa pl pt pt_BR ro ru rw sl sr sr@Latn sv ta tg tr uk uz zh_CN zh_TW
 * Enabling documentation for: da de es et fr it nl pl pt pt_BR ru sv
>>> Source unpacked.
>>> Compiling source in /var/tmp/portage/media-sound/amarok-1.4.4-r3/work/amarok-1.4.4 ...
This Makefile is only for the CVS repository
This will be deleted before making the distribution

*** automake (GNU automake) 1.9.6 found.
*** Creating acinclude.m4
*** Creating list of subdirectories
*** Creating Makefile.am
*** Creating configure.files
*** Creating configure.in
*** Creating aclocal.m4
/usr/share/aclocal/soundtouch.m4:29: warning: underquoted definition of AM_PATH_SOUNDTOUCH
  run info '(automake)Extending aclocal'
  or see http://sources.redhat.com/automake/automake.html#Extending-aclocal
/usr/share/aclocal/oaf.m4:4: warning: underquoted definition of AM_PATH_OAF
/usr/share/aclocal/gtkgl.m4:4: warning: underquoted definition of AM_PATH_GTKGL
/usr/share/aclocal/gpgme3.m4:9: warning: underquoted definition of AM_PATH_GPGME
*** Creating configure
*** Creating config.h template
*** Creating Makefile templates
*** Postprocessing Makefile templates
*** Creating date/time stamp
*** Finished
    Don't forget to run ./configure
    If you haven't done so in a while, run ./configure --help
 * Running elibtoolize in: amarok-1.4.4/admin
 *   Applying portage-1.5.10.patch ...
 *   Applying max_cmd_len-1.5.20.patch ...
 *   Applying sed-1.5.6.patch ...
 * econf: updating amarok-1.4.4/admin/config.guess with /usr/share/gnuconfig/config.guess
 * econf: updating amarok-1.4.4/admin/config.sub with /usr/share/gnuconfig/config.sub
./configure --prefix=/usr --host=x86_64-pc-linux-gnu --mandir=/usr/share/man --infodir=/usr/share/info --datadir=/usr/share --sysconfdir=/etc --localstatedir=/var/lib --enable-mysql --enable-postgresql --with-opengl --without-xmms --with-libvisual --enable-amazon --with-libgpod --with-mp4v2 --with-ifp --without-helix --with-libnjb --with-libmtp --with-musicbrainz --with-xine --without-mas --without-nmm --with-x --enable-mitshm --with-xinerama --with-qt-dir=/usr/qt/3 --enable-mt --with-qt-libraries=/usr/qt/3/lib64 --disable-dependency-tracking --disable-debug --without-debug --with-arts --enable-libsuffix=64 --with-extra-includes=/usr/kde/3.5/include --with-extra-libs=/usr/kde/3.5/lib64 --libdir=/usr/lib64 --build=x86_64-pc-linux-gnu
checking build system type... x86_64-pc-linux-gnu
checking host system type... x86_64-pc-linux-gnu
checking target system type... x86_64-pc-linux-gnu
checking for a BSD-compatible install... /bin/install -c
checking for -p flag to install... yes
checking whether build environment is sane... yes
checking for gawk... gawk
checking whether make sets $(MAKE)... yes
checking for kde-config... /usr/kde/3.5/bin/kde-config
checking where to install... /usr (as requested)
checking for style of include used by make... GNU
checking for x86_64-pc-linux-gnu-gcc... x86_64-pc-linux-gnu-gcc
checking for C compiler default output file name... a.out
checking whether the C compiler works... yes
checking whether we are cross compiling... no
checking for suffix of executables...
checking for suffix of object files... o
checking whether we are using the GNU C compiler... yes
checking whether x86_64-pc-linux-gnu-gcc accepts -g... yes
checking for x86_64-pc-linux-gnu-gcc option to accept ISO C89... none needed
checking dependency style of x86_64-pc-linux-gnu-gcc... none
checking how to run the C preprocessor... x86_64-pc-linux-gnu-gcc -E
checking for x86_64-pc-linux-gnu-g++... x86_64-pc-linux-gnu-g++
checking whether we are using the GNU C++ compiler... yes
checking whether x86_64-pc-linux-gnu-g++ accepts -g... yes
checking dependency style of x86_64-pc-linux-gnu-g++... none
checking whether x86_64-pc-linux-gnu-gcc is blacklisted... no
checking whether x86_64-pc-linux-gnu-g++ supports -Wmissing-format-attribute... yes
checking whether x86_64-pc-linux-gnu-gcc supports -Wmissing-format-attribute... yes
checking whether x86_64-pc-linux-gnu-g++ supports -Wundef... yes
checking whether x86_64-pc-linux-gnu-g++ supports -Wno-long-long... yes
checking whether x86_64-pc-linux-gnu-g++ supports -Wno-non-virtual-dtor... yes
checking whether x86_64-pc-linux-gnu-g++ supports -fno-reorder-blocks... yes
checking whether x86_64-pc-linux-gnu-g++ supports -fno-exceptions... yes
checking whether x86_64-pc-linux-gnu-g++ supports -fno-check-new... yes
checking whether x86_64-pc-linux-gnu-g++ supports -fno-common... yes
checking whether x86_64-pc-linux-gnu-g++ supports -fexceptions... yes
checking whether system headers can cope with -O2 -fno-inline... yes
checking how to run the C++ preprocessor... x86_64-pc-linux-gnu-g++ -E
checking whether x86_64-pc-linux-gnu-g++ supports -O0... yes
checking whether x86_64-pc-linux-gnu-g++ supports -Wl,--no-undefined... yes
checking whether x86_64-pc-linux-gnu-g++ supports -Wl,--allow-shlib-undefined... yes
using lib directory suffix 64
checking for a sed that does not truncate output... /bin/sed
checking for grep that handles long lines and -e... /bin/grep
checking for egrep... /bin/grep -E
checking for ld used by x86_64-pc-linux-gnu-gcc... /usr/x86_64-pc-linux-gnu/bin/ld
checking if the linker (/usr/x86_64-pc-linux-gnu/bin/ld) is GNU ld... yes
checking for /usr/x86_64-pc-linux-gnu/bin/ld option to reload object files... -r
checking for BSD-compatible nm... /usr/bin/x86_64-pc-linux-gnu-nm -B
checking whether ln -s works... yes
checking how to recognise dependent libraries... pass_all
checking for ANSI C header files... yes
checking for sys/types.h... yes
checking for sys/stat.h... yes
checking for stdlib.h... yes
checking for string.h... yes
checking for memory.h... yes
checking for strings.h... yes
checking for inttypes.h... yes
checking for stdint.h... yes
checking for unistd.h... yes
checking dlfcn.h usability... yes
checking dlfcn.h presence... yes
checking for dlfcn.h... yes
checking for x86_64-pc-linux-gnu-g77... no
checking for x86_64-pc-linux-gnu-f77... no
checking for x86_64-pc-linux-gnu-xlf... no
checking for x86_64-pc-linux-gnu-frt... no
checking for x86_64-pc-linux-gnu-pgf77... no
checking for x86_64-pc-linux-gnu-cf77... no
checking for x86_64-pc-linux-gnu-fort77... no
checking for x86_64-pc-linux-gnu-fl32... no
checking for x86_64-pc-linux-gnu-af77... no
checking for x86_64-pc-linux-gnu-f90... no
checking for x86_64-pc-linux-gnu-xlf90... no
checking for x86_64-pc-linux-gnu-pgf90... no
checking for x86_64-pc-linux-gnu-pghpf... no
checking for x86_64-pc-linux-gnu-epcf90... no
checking for x86_64-pc-linux-gnu-gfortran... x86_64-pc-linux-gnu-gfortran
checking whether we are using the GNU Fortran 77 compiler... yes
checking whether x86_64-pc-linux-gnu-gfortran accepts -g... yes
checking the maximum length of command line arguments... 32768
checking command to parse /usr/bin/x86_64-pc-linux-gnu-nm -B output from x86_64-pc-linux-gnu-gcc object... ok
checking for objdir... .libs
checking for x86_64-pc-linux-gnu-ar... x86_64-pc-linux-gnu-ar
checking for x86_64-pc-linux-gnu-ranlib... x86_64-pc-linux-gnu-ranlib
checking for x86_64-pc-linux-gnu-strip... x86_64-pc-linux-gnu-strip
checking if x86_64-pc-linux-gnu-gcc static flag  works... yes
checking if x86_64-pc-linux-gnu-gcc supports -fno-rtti -fno-exceptions... no
checking for x86_64-pc-linux-gnu-gcc option to produce PIC... -fPIC
checking if x86_64-pc-linux-gnu-gcc PIC flag -fPIC works... yes
checking if x86_64-pc-linux-gnu-gcc supports -c -o file.o... yes
checking whether the x86_64-pc-linux-gnu-gcc linker (/usr/x86_64-pc-linux-gnu/bin/ld -m elf_x86_64) supports shared libraries... yes
checking whether -lc should be explicitly linked in... no
checking dynamic linker characteristics... GNU/Linux ld.so
checking how to hardcode library paths into programs... immediate
checking whether stripping libraries is possible... yes
checking for shl_load... no
checking for shl_load in -ldld... no
checking for dlopen... no
checking for dlopen in -ldl... yes
checking whether a program can dlopen itself... yes
checking whether a statically linked program can dlopen itself... yes
checking if libtool supports shared libraries... yes
checking whether to build shared libraries... yes
checking whether to build static libraries... no
configure: creating libtool
appending configuration tag "CXX" to libtool
checking for ld used by x86_64-pc-linux-gnu-g++... /usr/x86_64-pc-linux-gnu/bin/ld -m elf_x86_64
checking if the linker (/usr/x86_64-pc-linux-gnu/bin/ld -m elf_x86_64) is GNU ld... yes
checking whether the x86_64-pc-linux-gnu-g++ linker (/usr/x86_64-pc-linux-gnu/bin/ld -m elf_x86_64) supports shared libraries... yes
checking for x86_64-pc-linux-gnu-g++ option to produce PIC... -fPIC
checking if x86_64-pc-linux-gnu-g++ PIC flag -fPIC works... yes
checking if x86_64-pc-linux-gnu-g++ supports -c -o file.o... yes
checking whether the x86_64-pc-linux-gnu-g++ linker (/usr/x86_64-pc-linux-gnu/bin/ld -m elf_x86_64) supports shared libraries... yes
checking dynamic linker characteristics... GNU/Linux ld.so
checking how to hardcode library paths into programs... immediate
checking whether stripping libraries is possible... yes
checking for shl_load... (cached) no
checking for shl_load in -ldld... (cached) no
checking for dlopen... (cached) no
checking for dlopen in -ldl... (cached) yes
checking whether a program can dlopen itself... (cached) yes
checking whether a statically linked program can dlopen itself... (cached) yes
appending configuration tag "F77" to libtool
checking if libtool supports shared libraries... yes
checking whether to build shared libraries... yes
checking whether to build static libraries... no
checking for x86_64-pc-linux-gnu-gfortran option to produce PIC... -fPIC
checking if x86_64-pc-linux-gnu-gfortran PIC flag -fPIC works... yes
checking if x86_64-pc-linux-gnu-gfortran supports -c -o file.o... yes
checking whether the x86_64-pc-linux-gnu-gfortran linker (/usr/x86_64-pc-linux-gnu/bin/ld -m elf_x86_64) supports shared libraries... yes
checking dynamic linker characteristics... GNU/Linux ld.so
checking how to hardcode library paths into programs... immediate
checking whether stripping libraries is possible... yes
checking for msgfmt... /usr/bin/msgfmt
checking for gmsgfmt... /usr/bin/gmsgfmt
checking for xgettext... /usr/bin/xgettext
checking if C++ programs can be compiled... yes
checking for strlcat... no
checking if strlcat needs custom prototype... yes - in libkdefakes
checking for strlcpy... no
checking if strlcpy needs custom prototype... yes - in libkdefakes
checking for main in -lutil... yes
checking for main in -lcompat... no
checking for crypt in -lcrypt... yes
checking for socklen_t... yes
checking for dnet_ntoa in -ldnet... no
checking for dnet_ntoa in -ldnet_stub... no
checking for inet_ntoa... yes
checking for connect... yes
checking for remove... yes
checking for shmat... yes
checking for sys/types.h... (cached) yes
checking for stdint.h... (cached) yes
checking sys/bitypes.h usability... yes
checking sys/bitypes.h presence... yes
checking for sys/bitypes.h... yes
checking for poll in -lpoll... no
checking Carbon/Carbon.h usability... no
checking Carbon/Carbon.h presence... no
checking for Carbon/Carbon.h... no
checking CoreAudio/CoreAudio.h usability... no
checking CoreAudio/CoreAudio.h presence... no
checking for CoreAudio/CoreAudio.h... no
checking if res_init needs -lresolv... yes
checking for res_init... yes
checking if res_init needs custom prototype... no
checking for killpg in -lucb... no
checking for int... yes
checking size of int... 4
checking for short... yes
checking size of short... 2
checking for long... yes
checking size of long... 8
checking for char *... yes
checking size of char *... 8
checking for dlopen in -ldl... (cached) yes
checking for shl_unload in -ldld... no
checking for size_t... yes
checking size of size_t... 8
checking for unsigned long... yes
checking size of unsigned long... 8
checking sizeof size_t == sizeof unsigned long... yes
checking for PIE support... yes
checking if enabling -pie/fPIE support... yes
checking crt_externs.h usability... no
checking crt_externs.h presence... no
checking for crt_externs.h... no
checking for _NSGetEnviron... no
checking for vsnprintf... yes
checking for snprintf... yes
checking for X... libraries /usr/lib64, headers .
checking for IceConnectionNumber in -lICE... yes
checking for libXext... yes
checking for pthread_create in -lpthread... yes
checking for extra includes... added
checking for extra libs... added
checking for libz... -lz
checking for libpng... -lpng -lz -lm
checking for libjpeg6b... no
checking for libjpeg... -ljpeg
checking for perl... /usr/bin/perl
checking for Qt... libraries /usr/qt/3/lib64, headers /usr/qt/3/include using -mt
checking for moc... /usr/qt/3/bin/moc
checking for uic... /usr/qt/3/bin/uic
checking whether uic supports -L ... yes
checking whether uic supports -nounload ... yes
checking if Qt needs -ljpeg... no
checking for rpath... yes
checking for KDE... libraries /usr/kde/3.5/lib64, headers /usr/kde/3.5/include
checking if UIC has KDE plugins available... yes
checking for KDE paths... defaults
checking for dcopidl... /usr/kde/3.5/bin/dcopidl
checking for dcopidl2cpp... /usr/kde/3.5/bin/dcopidl2cpp
checking for mcopidl... /usr/kde/3.5/bin/mcopidl
checking for artsc-config... /usr/kde/3.5/bin/artsc-config
checking for meinproc... /usr/kde/3.5/bin/meinproc
checking for kconfig_compiler... /usr/kde/3.5/bin/kconfig_compiler
checking for dcopidlng... /usr/kde/3.5/bin/dcopidlng
checking for makekdewidgets... /usr/kde/3.5/bin/makekdewidgets
checking for xmllint... /usr/bin/xmllint
checking for Qt docs... NO
checking for dot... not found
checking for doxygen... not found
checking for pkg-config... yes
checking for taglib-config... /usr/bin/taglib-config
checking for xine-config... yes
checking for xine-lib version >= 1.0.2... yes
checking for stdint.h... (cached) yes
checking whether fabsf is declared... yes
checking linux/inotify.h usability... yes
checking linux/inotify.h presence... yes
checking for linux/inotify.h... yes
checking for Qt with OpenGL support... yes
checking for int... (cached) yes
checking size of int... (cached) 4
checking for short... (cached) yes
checking size of short... (cached) 2
checking for long... (cached) yes
checking size of long... (cached) 8
checking for char *... (cached) yes
checking size of char *... (cached) 8
checking for mysql_config... yes
checking for pg_config... yes
checking for sdl-config... yes
checking for pkg-config... /usr/bin/pkg-config
checking for libvisual-0.4 >= 0.4.0... yes
checking LIBVISUAL_CFLAGS... -I/usr/include/libvisual-0.4
checking LIBVISUAL_LIBS... -lpthread -lm -ldl -lvisual-0.4
checking tunepimp-0.5/tp_c.h usability... yes
checking tunepimp-0.5/tp_c.h presence... yes
checking for tunepimp-0.5/tp_c.h... yes
checking for tr_GetPUID in -ltunepimp... yes
checking if sched_setaffinity should be enabled... yes
checking konqsidebarplugin.h usability... yes
checking konqsidebarplugin.h presence... yes
checking for konqsidebarplugin.h... yes
checking for _init in -lkonqsidebarplugin... yes
checking for libnjb... yes
checking LIBNJB_CFLAGS...
checking LIBNJB_LIBS... -lnjb -lusb
checking for libmtp >= 0.0.15... yes
checking LIBMTP_CFLAGS...
checking LIBMTP_LIBS... -lmtp -lusb
checking libkarma/lkarma.h usability... no
checking libkarma/lkarma.h presence... no
checking for libkarma/lkarma.h... no
checking usb.h usability... yes
checking usb.h presence... yes
checking for usb.h... yes

checking ifp.h usability... no
checking ifp.h presence... yes
configure: WARNING: ifp.h: present but cannot be compiled
configure: WARNING: ifp.h:     check for missing prerequisite headers?
configure: WARNING: ifp.h: see the Autoconf documentation
configure: WARNING: ifp.h:     section "Present But Cannot Be Compiled"
configure: WARNING: ifp.h: proceeding with the preprocessor's result
configure: WARNING: ifp.h: in the future, the compiler will take precedence
checking for ifp.h... yes
checking for usb.h... (cached) yes
checking for libgpod-1.0... yes
checking LIBGPOD_CFLAGS... -I/usr/include/gpod-1.0 -I/usr/include/glib-2.0 -I/usr/lib64/glib-2.0/include
checking LIBGPOD_LIBS... -lgpod -lglib-2.0
yes
checking for itdb_track_set_thumbnails... yes
checking for itdb_get_mountpoint... no
checking for itdb_device_get_ipod_info... no
checking for struct _Itdb_Track.movie_flag... no
checking for struct _Itdb_Track.skip_when_shuffling... no
checking for struct _Itdb_Track.mark_unplayed... no
checking for statvfs... yes
checking systems.h usability... no
checking systems.h presence... no
checking for systems.h... no
checking for mp4.h... yes
checking for MP4Read in -lmp4v2... yes
checking if KDE is at least 3.4 for DAAP support... yes
checking for uint8_t... yes
checking for u_int8_t... yes
checking for uint16_t... yes
checking for u_int16_t... yes
checking for uint32_t... yes
checking for u_int32_t... yes
checking for uint64_t... yes
checking for u_int64_t... yes
checking for ruby... /usr/bin/ruby
checking ruby.h usability... yes
checking ruby.h presence... yes
checking for ruby.h... yes
checking if amarok should be compiled... yes
checking if doc should be compiled... yes
checking if po should be compiled... yes
configure: creating ./config.status
wrong input (flag != 4) at admin/conf.change.pl line 117, <> line 1502.
config.status: creating Makefile
config.status: creating amarok/Makefile
config.status: creating amarok/src/Makefile
config.status: creating amarok/src/amarokcore/Makefile
config.status: creating amarok/src/analyzers/Makefile
config.status: creating amarok/src/collectionscanner/Makefile
config.status: creating amarok/src/data/Makefile
config.status: creating amarok/src/device/Makefile
config.status: creating amarok/src/device/massstorage/Makefile
config.status: creating amarok/src/device/nfs/Makefile
config.status: creating amarok/src/device/smb/Makefile
config.status: creating amarok/src/engine/Makefile
config.status: creating amarok/src/engine/akode/Makefile
config.status: creating amarok/src/engine/helix/Makefile
config.status: creating amarok/src/engine/helix/config/Makefile
config.status: creating amarok/src/engine/helix/helix-sp/Makefile
config.status: creating amarok/src/engine/kdemm/Makefile
config.status: creating amarok/src/engine/mas/Makefile
config.status: creating amarok/src/engine/nmm/Makefile
config.status: creating amarok/src/engine/nmm/icons/Makefile
config.status: creating amarok/src/engine/void/Makefile
config.status: creating amarok/src/engine/xine/Makefile
config.status: creating amarok/src/images/Makefile
config.status: creating amarok/src/images/icons/Makefile
config.status: creating amarok/src/konquisidebar/Makefile
config.status: creating amarok/src/loader/Makefile
config.status: creating amarok/src/magnatunebrowser/Makefile
config.status: creating amarok/src/mediadevice/Makefile
config.status: creating amarok/src/mediadevice/daap/Makefile
config.status: creating amarok/src/mediadevice/daap/daapreader/Makefile
config.status: creating amarok/src/mediadevice/daap/daapreader/authentication/Makefile
config.status: creating amarok/src/mediadevice/daap/mongrel/Makefile
config.status: creating amarok/src/mediadevice/daap/mongrel/http11/Makefile
config.status: creating amarok/src/mediadevice/daap/mongrel/lib/Makefile
config.status: creating amarok/src/mediadevice/daap/mongrel/lib/mongrel/Makefile
config.status: creating amarok/src/mediadevice/daap/mongrel/lib/rbconfig/Makefile
config.status: creating amarok/src/mediadevice/daap/mongrel/lib/rubygems/Makefile
config.status: creating amarok/src/mediadevice/fs/Makefile
config.status: creating amarok/src/mediadevice/generic/Makefile
config.status: creating amarok/src/mediadevice/ifp/Makefile
config.status: creating amarok/src/mediadevice/ipod/Makefile
config.status: creating amarok/src/mediadevice/mtp/Makefile
config.status: creating amarok/src/mediadevice/njb/Makefile
config.status: creating amarok/src/mediadevice/riokarma/Makefile
config.status: creating amarok/src/metadata/Makefile
config.status: creating amarok/src/metadata/aac/Makefile
config.status: creating amarok/src/metadata/audible/Makefile
config.status: creating amarok/src/metadata/m4a/Makefile
config.status: creating amarok/src/metadata/mp4/Makefile
config.status: creating amarok/src/metadata/rmff/Makefile
config.status: creating amarok/src/metadata/wav/Makefile
config.status: creating amarok/src/metadata/wma/Makefile
config.status: creating amarok/src/plugin/Makefile
config.status: creating amarok/src/scripts/Makefile
config.status: creating amarok/src/scripts/common/Makefile
config.status: creating amarok/src/scripts/graphequalizer/Makefile
config.status: creating amarok/src/scripts/lyrics_astraweb/Makefile
config.status: creating amarok/src/scripts/lyrics_lyrc/Makefile
config.status: creating amarok/src/scripts/playlist2html/Makefile
config.status: creating amarok/src/scripts/ruby_debug/Makefile
config.status: creating amarok/src/scripts/score_default/Makefile
config.status: creating amarok/src/scripts/score_impulsive/Makefile
config.status: creating amarok/src/scripts/templates/Makefile
config.status: creating amarok/src/scripts/webcontrol/Makefile
config.status: creating amarok/src/sqlite/Makefile
config.status: creating amarok/src/statusbar/Makefile
config.status: creating amarok/src/themes/Makefile
config.status: creating amarok/src/themes/example/Makefile
config.status: creating amarok/src/themes/reinhardt/Makefile
config.status: creating amarok/src/themes/reinhardt/images/Makefile
config.status: creating amarok/src/vis/Makefile
config.status: creating amarok/src/vis/libvisual/Makefile
config.status: creating amarok/src/vis/xmmswrapper/Makefile
config.status: creating doc/Makefile
config.status: creating doc/amarok/Makefile
config.status: creating doc/da/Makefile
config.status: creating doc/de/Makefile
config.status: creating doc/es/Makefile
config.status: creating doc/et/Makefile
config.status: creating doc/fr/Makefile
config.status: creating doc/it/Makefile
config.status: creating doc/nl/Makefile
config.status: creating doc/pl/Makefile
config.status: creating doc/pt/Makefile
config.status: creating doc/pt_BR/Makefile
config.status: creating doc/ru/Makefile
config.status: creating doc/sv/Makefile
config.status: creating po/Makefile
config.status: creating po/af/Makefile
config.status: creating po/ar/Makefile
config.status: creating po/az/Makefile
config.status: creating po/bg/Makefile
config.status: creating po/br/Makefile
config.status: creating po/ca/Makefile
config.status: creating po/cs/Makefile
config.status: creating po/cy/Makefile
config.status: creating po/da/Makefile
config.status: creating po/de/Makefile
config.status: creating po/el/Makefile
config.status: creating po/en_GB/Makefile
config.status: creating po/es/Makefile
config.status: creating po/et/Makefile
config.status: creating po/fi/Makefile
config.status: creating po/fr/Makefile
config.status: creating po/ga/Makefile
config.status: creating po/gl/Makefile
config.status: creating po/he/Makefile
config.status: creating po/hi/Makefile
config.status: creating po/hu/Makefile
config.status: creating po/is/Makefile
config.status: creating po/it/Makefile
config.status: creating po/ja/Makefile
config.status: creating po/ka/Makefile
config.status: creating po/km/Makefile
config.status: creating po/ko/Makefile
config.status: creating po/lt/Makefile
config.status: creating po/ms/Makefile
config.status: creating po/nb/Makefile
config.status: creating po/nl/Makefile
config.status: creating po/nn/Makefile
config.status: creating po/pa/Makefile
config.status: creating po/pl/Makefile
config.status: creating po/pt/Makefile
config.status: creating po/pt_BR/Makefile
config.status: creating po/ro/Makefile
config.status: creating po/ru/Makefile
config.status: creating po/rw/Makefile
config.status: creating po/sk/Makefile
config.status: creating po/sl/Makefile
config.status: creating po/sq/Makefile
config.status: creating po/sr/Makefile
config.status: creating po/sr@Latn/Makefile
config.status: creating po/sv/Makefile
config.status: creating po/ta/Makefile
config.status: creating po/tg/Makefile
config.status: creating po/th/Makefile
config.status: creating po/tr/Makefile
config.status: creating po/uk/Makefile
config.status: creating po/uz/Makefile
config.status: creating po/zh_CN/Makefile
config.status: creating po/zh_TW/Makefile
config.status: creating config.h
config.status: executing depfiles commands

 ==========================
 ===  Amarok - PLUGINS  ========================================================
 ==========================
 =
 = The following extra functionality will NOT be included:
 =   - NMM-engine
 =   - Helix-engine
 =   - XMMS Visualization Wrapper
 =   - Rio Karma Support
 =
 = The following extra functionality will be included:
 =   + xine-engine
 =   + libvisual Support
 =   + MySql Support
 =   + Postgresql Support
 =   + Konqueror Sidebar
 =   + MusicBrainz Support
 =   + MP4/AAC Tag Write Support
 =   + iPod Support (with Artwork)
 =   + iRiver iFP Support
 =   + Creative Nomad Jukebox Support
 =   + MTP Device Support
 =
 ===============================================================================

Good - your configure finished. Start make now

Making all in amarok
Making all in src
Making all in amarokcore
Making all in magnatunebrowser
Making all in sqlite
alter.c: In function 'renameTableFunc':
alter.c:42: warning: unused parameter 'argc'
analyze.c: In function 'analysisLoader':
analyze.c:343: warning: unused parameter 'argc'
analyze.c:343: warning: unused parameter 'azNotUsed'
attach.c: In function 'attachFunc':
attach.c:62: warning: unused parameter 'argc'
attach.c: In function 'detachFunc':
attach.c:222: warning: unused parameter 'argc'
alter.c: In function 'renameTriggerFunc':
alter.c:90: warning: unused parameter 'argc'
alter.c: In function 'sqlite3AlterFunctions':
alter.c:157: warning: initialization discards qualifiers from pointer target type
alter.c:159: warning: initialization discards qualifiers from pointer target type
alter.c:164: warning: comparison between signed and unsigned
btree.c: In function 'autoVacuumCommit':
btree.c:2374: warning: comparison between signed and unsigned
btree.c:2397: warning: comparison between signed and unsigned
btree.c:2402: warning: comparison between signed and unsigned
btree.c:2402: warning: comparison between signed and unsigned
btree.c:2405: warning: comparison between signed and unsigned
btree.c:2418: warning: comparison between signed and unsigned
btree.c: In function 'dfltCompare':
btree.c:2710: warning: unused parameter 'NotUsed'
btree.c: In function 'getPayload':
btree.c:2996: warning: comparison between signed and unsigned
btree.c: In function 'fetchPayload':
btree.c:3136: warning: comparison between signed and unsigned
btree.c: In function 'allocatePage':
btree.c:3817: warning: comparison between signed and unsigned
btree.c: In function 'clearCell':
btree.c:3970: warning: comparison between signed and unsigned
btree.c: In function 'sqlite3BtreeCreateTable':
btree.c:5499: warning: comparison between signed and unsigned
btree.c: In function 'clearDatabasePage':
btree.c:5591: warning: comparison between signed and unsigned
btree.c: In function 'sqlite3BtreeDropTable':
btree.c:5725: warning: comparison between signed and unsigned
btree.c:5768: warning: comparison between signed and unsigned
btree.c: In function 'checkAppendMsg':
btree.c:6078: warning: assignment discards qualifiers from pointer target type
btree.c: In function 'sqlite3BtreeIntegrityCheck':
btree.c:6418: warning: passing argument 5 of 'checkList' discards qualifiers from pointer target type
btree.c:6429: warning: passing argument 4 of 'checkTreePage' discards qualifiers from pointer target type
btree.c:6444: warning: comparison between signed and unsigned
btree.c:6448: warning: comparison between signed and unsigned
build.c: In function 'sqlite3FindDb':
build.c:622: warning: comparison between signed and unsigned
build.c: In function 'createTableStmt':
build.c:1307: warning: assignment discards qualifiers from pointer target type
build.c:1308: warning: assignment discards qualifiers from pointer target type
build.c:1309: warning: assignment discards qualifiers from pointer target type
build.c:1311: warning: assignment discards qualifiers from pointer target type
build.c:1312: warning: assignment discards qualifiers from pointer target type
build.c:1313: warning: assignment discards qualifiers from pointer target type
build.c: In function 'sqlite3EndTable':
build.c:1434: warning: assignment discards qualifiers from pointer target type
build.c:1435: warning: assignment discards qualifiers from pointer target type
build.c:1439: warning: assignment discards qualifiers from pointer target type
build.c:1440: warning: assignment discards qualifiers from pointer target type
btree.c: In function 'sqlite3BtreeDelete':
btree.c:5395: warning: 'szNext' may be used uninitialized in this function
date.c: In function 'parseModifier':
date.c:458: warning: comparison between signed and unsigned
date.c: In function 'strftimeFunc':
date.c:796: warning: comparison between signed and unsigned
date.c: In function 'ctimeFunc':
date.c:868: warning: unused parameter 'argc'
date.c:870: warning: unused parameter 'argv'
date.c: In function 'cdateFunc':
date.c:886: warning: unused parameter 'argc'
date.c:888: warning: unused parameter 'argv'
date.c: In function 'ctimestampFunc':
date.c:904: warning: unused parameter 'argc'
date.c:906: warning: unused parameter 'argv'
date.c: In function 'sqlite3RegisterDateTimeFunctions':
date.c:967: warning: initialization discards qualifiers from pointer target type
date.c:968: warning: initialization discards qualifiers from pointer target type
date.c:969: warning: initialization discards qualifiers from pointer target type
date.c:970: warning: initialization discards qualifiers from pointer target type
date.c:971: warning: initialization discards qualifiers from pointer target type
date.c:972: warning: initialization discards qualifiers from pointer target type
date.c:973: warning: initialization discards qualifiers from pointer target type
date.c:974: warning: initialization discards qualifiers from pointer target type
date.c:978: warning: comparison between signed and unsigned
delete.c: In function 'sqlite3GenerateRowDelete':
delete.c:377: warning: unused parameter 'db'
expr.c: In function 'lookupName':
expr.c:1010: warning: assignment discards qualifiers from pointer target type
expr.c:1031: warning: comparison between signed and unsigned
func.c: In function 'typeofFunc':
func.c:70: warning: unused parameter 'argc'
func.c: In function 'lengthFunc':
func.c:90: warning: unused parameter 'argc'
func.c: In function 'absFunc':
func.c:119: warning: unused parameter 'argc'
func.c: In function 'substrFunc':
func.c:152: warning: unused parameter 'argc'
func.c: In function 'randomFunc':
func.c:265: warning: unused parameter 'argc'
func.c:267: warning: unused parameter 'argv'
func.c: In function 'last_insert_rowid':
func.c:281: warning: unused parameter 'arg'
func.c:283: warning: unused parameter 'argv'
func.c: In function 'changes':
func.c:294: warning: unused parameter 'arg'
func.c:296: warning: unused parameter 'argv'
func.c: In function 'total_changes':
func.c:307: warning: unused parameter 'arg'
func.c:309: warning: unused parameter 'argv'
func.c: In function 'nullifFunc':
func.c:530: warning: unused parameter 'argc'
func.c: In function 'versionFunc':
func.c:545: warning: unused parameter 'argc'
func.c:547: warning: unused parameter 'argv'
func.c: In function 'sumStep':
func.c:846: warning: unused parameter 'argc'
func.c: In function 'minmaxStep':
func.c:925: warning: unused parameter 'argc'
func.c: In function 'sqlite3RegisterBuiltinFunctions':
func.c:980: warning: initialization discards qualifiers from pointer target type
func.c:981: warning: initialization discards qualifiers from pointer target type
func.c:982: warning: initialization discards qualifiers from pointer target type
func.c:983: warning: initialization discards qualifiers from pointer target type
func.c:984: warning: initialization discards qualifiers from pointer target type
func.c:985: warning: initialization discards qualifiers from pointer target type
func.c:986: warning: initialization discards qualifiers from pointer target type
func.c:988: warning: initialization discards qualifiers from pointer target type
func.c:990: warning: initialization discards qualifiers from pointer target type
func.c:991: warning: initialization discards qualifiers from pointer target type
func.c:992: warning: initialization discards qualifiers from pointer target type
func.c:993: warning: initialization discards qualifiers from pointer target type
func.c:994: warning: initialization discards qualifiers from pointer target type
func.c:995: warning: initialization discards qualifiers from pointer target type
func.c:996: warning: initialization discards qualifiers from pointer target type
func.c:997: warning: initialization discards qualifiers from pointer target type
func.c:998: warning: initialization discards qualifiers from pointer target type
func.c:999: warning: initialization discards qualifiers from pointer target type
func.c:1000: warning: initialization discards qualifiers from pointer target type
func.c:1001: warning: initialization discards qualifiers from pointer target type
func.c:1002: warning: initialization discards qualifiers from pointer target type
func.c:1003: warning: initialization discards qualifiers from pointer target type
func.c:1004: warning: initialization discards qualifiers from pointer target type
func.c:1005: warning: initialization discards qualifiers from pointer target type
func.c:1025: warning: initialization discards qualifiers from pointer target type
func.c:1026: warning: initialization discards qualifiers from pointer target type
func.c:1027: warning: initialization discards qualifiers from pointer target type
func.c:1028: warning: initialization discards qualifiers from pointer target type
func.c:1029: warning: initialization discards qualifiers from pointer target type
func.c:1030: warning: initialization discards qualifiers from pointer target type
func.c:1031: warning: initialization discards qualifiers from pointer target type
func.c:1035: warning: comparison between signed and unsigned
func.c:1057: warning: comparison between signed and unsigned
insert.c: In function 'sqlite3GenerateConstraintChecks':
insert.c:994: warning: comparison between signed and unsigned
insert.c:1001: warning: comparison between signed and unsigned
main.c: In function 'binCollFunc':
main.c:41: warning: unused parameter 'NotUsed'
main.c: In function 'nocaseCollatingFunc':
main.c:64: warning: unused parameter 'NotUsed'
main.c: In function 'sqlite3_close':
main.c:131: warning: comparison between signed and unsigned
main.c: In function 'sqliteDefaultBusyCallback':
main.c:266: warning: comparison between signed and unsigned
main.c: In function 'openDatabase':
main.c:859: warning: assignment discards qualifiers from pointer target type
main.c:862: warning: assignment discards qualifiers from pointer target type
In file included from os_unix.c:109:
os_common.h: In function 'sqlite3GenericAllocationSize':
os_common.h:187: warning: unused parameter 'p'
os_unix.c: In function 'sqlite3UnixTempFileName':
os_unix.c:869: warning: comparison between signed and unsigned
os_unix.c: In function 'full_fsync':
os_unix.c:1043: warning: unused parameter 'fullSync'
os_unix.c: In function 'sqlite3UnixThreadSpecificData':
os_unix.c:1891: warning: missing initializer
os_unix.c:1891: warning: (near initialization for 'zeroData.useSharedData')
pager.c: In function 'readMasterJournal':
pager.c:566: warning: comparison between signed and unsigned
pager.c: In function 'pager_playback_one_page':
pager.c:992: warning: comparison between signed and unsigned
pager.c: In function 'pager_playback':
pager.c:1330: warning: comparison between signed and unsigned
pager.c: In function 'memoryTruncate':
pager.c:1926: warning: comparison between signed and unsigned
pager.c: In function 'pager_write_pagelist':
pager.c:2305: warning: comparison between signed and unsigned
pager.c: In function 'sqlite3pager_get':
pager.c:2551: warning: comparison between signed and unsigned
pager.c: In function 'sqlite3pager_sync':
pager.c:3688: warning: comparison between signed and unsigned
pager.c:3689: warning: comparison between signed and unsigned
parse.c:1159: warning: no previous prototype for 'sqlite3ParserTokenName'
parse.c: In function 'sqlite3ParserTokenName':
parse.c:1159: warning: unused parameter 'tokenType'
parse.c: At top level:
parse.c:1183: warning: no previous prototype for 'sqlite3ParserAlloc'
parse.c:1330: warning: no previous prototype for 'sqlite3ParserFree'
parse.c: In function 'yy_find_shift_action':
parse.c:1359: warning: comparison between signed and unsigned
parse.c:1363: warning: comparison between signed and unsigned
parse.c: In function 'yy_find_reduce_action':
parse.c:1402: warning: comparison between signed and unsigned
parse.c: In function 'yy_syntax_error':
parse.c:3135: warning: unused parameter 'yymajor'
parse.c: At top level:
parse.c:3197: warning: no previous prototype for 'sqlite3Parser'
pragma.c: In function 'getSafetyLevel':
pragma.c:50: warning: comparison between signed and unsigned
pragma.c: In function 'flagPragma':
pragma.c:169: warning: comparison between signed and unsigned
pragma.c: In function 'sqlite3Pragma':
pragma.c:650: warning: initialization discards qualifiers from pointer target type
pragma.c:713: warning: initialization discards qualifiers from pointer target type
pragma.c:715: warning: initialization discards qualifiers from pointer target type
pragma.c:738: warning: initialization discards qualifiers from pointer target type
pragma.c:787: warning: initialization discards qualifiers from pointer target type
pragma.c:788: warning: initialization discards qualifiers from pointer target type
pragma.c:789: warning: initialization discards qualifiers from pointer target type
pragma.c:790: warning: initialization discards qualifiers from pointer target type
pragma.c:791: warning: initialization discards qualifiers from pointer target type
pragma.c:792: warning: initialization discards qualifiers from pointer target type
pragma.c:793: warning: initialization discards qualifiers from pointer target type
pragma.c:794: warning: initialization discards qualifiers from pointer target type
prepare.c: In function 'sqlite3InitCallback':
prepare.c:47: warning: unused parameter 'argc'
prepare.c:47: warning: unused parameter 'azColName'
prepare.c: In function 'sqlite3InitOne':
prepare.c:226: warning: comparison between signed and unsigned
printf.c: In function 'vxprintf':
printf.c:331: warning: comparison between signed and unsigned
printf.c:463: warning: assignment discards qualifiers from pointer target type
printf.c:594: warning: assignment discards qualifiers from pointer target type
printf.c:607: warning: assignment discards qualifiers from pointer target type
printf.c:664: warning: comparison between signed and unsigned
printf.c:680: warning: comparison between signed and unsigned
select.c: In function 'sqlite3JoinType':
select.c:135: warning: comparison between signed and unsigned
select.c:142: warning: comparison between signed and unsigned
select.c: In function 'generateColumnNames':
select.c:990: warning: assignment discards qualifiers from pointer target type
select.c: In function 'selectOpName':
select.c:1027: warning: assignment discards qualifiers from pointer target type
select.c:1028: warning: assignment discards qualifiers from pointer target type
select.c:1029: warning: assignment discards qualifiers from pointer target type
select.c:1030: warning: assignment discards qualifiers from pointer target type
select.c: In function 'generateSortTail':
select.c:691: warning: 'pseudoTab' may be used uninitialized in this function
table.c: In function 'sqlite3_get_table':
table.c:149: warning: cast to pointer from integer of different size
table.c: In function 'sqlite3_free_table':
table.c:194: warning: cast from pointer to integer of different size
trigger.c: In function 'sqlite3FinishTrigger':
trigger.c:227: warning: initialization discards qualifiers from pointer target type
trigger.c:231: warning: initialization discards qualifiers from pointer target type
trigger.c:234: warning: initialization discards qualifiers from pointer target type
trigger.c: In function 'sqlite3DropTriggerPtr':
trigger.c:518: warning: initialization discards qualifiers from pointer target type
trigger.c: In function 'sqlite3TriggersExist':
trigger.c:592: warning: unused parameter 'pParse'
utf.c: In function 'sqlite3utf16Substr':
utf.c:509: warning: unused parameter 'argc'
util.c: In function 'sqlite3SafetyOn':
util.c:1149: warning: comparison between signed and unsigned
util.c:1152: warning: comparison between signed and unsigned
util.c: In function 'sqlite3SafetyOff':
util.c:1165: warning: comparison between signed and unsigned
util.c:1168: warning: comparison between signed and unsigned
util.c: In function 'sqlite3SafetyCheck':
util.c:1188: warning: comparison between signed and unsigned
util.c:1189: warning: comparison between signed and unsigned
util.c:1190: warning: comparison between signed and unsigned
util.c: In function 'sqlite3ThreadDataReadOnly':
util.c:1412: warning: missing initializer
util.c:1412: warning: (near initialization for 'zeroData.useSharedData')
vacuum.c: In function 'sqlite3RunVacuum':
vacuum.c:277: warning: comparison between signed and unsigned
vdbe.c: In function 'sqlite3VdbeExec':
vdbe.c:433: warning: comparison between signed and unsigned
vdbe.c:769: warning: assignment discards qualifiers from pointer target type
vdbe.c:2000: warning: comparison between signed and unsigned
vdbe.c:2016: warning: comparison between signed and unsigned
vdbe.c:2031: warning: comparison between signed and unsigned
vdbe.c:2229: warning: comparison between signed and unsigned
vdbe.c:2262: warning: comparison between signed and unsigned
vdbe.c:3212: warning: comparison between signed and unsigned
vdbe.c:4129: warning: assignment discards qualifiers from pointer target type
vdbe.c:4642: warning: comparison between signed and unsigned
vdbeapi.c: In function 'sqlite3_step':
vdbeapi.c:165: warning: comparison between signed and unsigned
vdbeapi.c: In function 'vdbeUnbind':
vdbeapi.c:614: warning: comparison between signed and unsigned
vdbeapi.c: In function 'sqlite3_transfer_bindings':
vdbeapi.c:792: warning: comparison between signed and unsigned
vdbeapi.c:793: warning: comparison between signed and unsigned
vdbeaux.c: In function 'resizeOpArray':
vdbeaux.c:71: warning: comparison between signed and unsigned
vdbeaux.c: In function 'displayP3':
vdbeaux.c:564: warning: comparison between signed and unsigned
vdbeaux.c:573: warning: assignment discards qualifiers from pointer target type
vdbeaux.c: In function 'sqlite3VdbeList':
vdbeaux.c:625: warning: comparison between signed and unsigned
vdbeaux.c: At top level:
vdbeaux.c:693: warning: no previous prototype for 'sqlite3VdbePrintSql'
vdbeaux.c: In function 'sqlite3VdbePrintSql':
vdbeaux.c:693: warning: unused parameter 'p'
vdbeaux.c: In function 'vdbeCommit':
vdbeaux.c:1003: warning: declaration of 'random' shadows a global declaration
/usr/include/gentoo-multilib/amd64/stdlib.h:445: warning: shadowed declaration is here
vdbeaux.c: In function 'sqlite3AbortOtherActiveVdbes':
vdbeaux.c:1131: warning: comparison between signed and unsigned
vdbeaux.c: In function 'sqlite3VdbeHalt':
vdbeaux.c:1212: warning: comparison between signed and unsigned
vdbeaux.c: In function 'sqlite3VdbeReset':
vdbeaux.c:1368: warning: comparison between signed and unsigned
vdbeaux.c: In function 'sqlite3VdbeFinalize':
vdbeaux.c:1447: warning: comparison between signed and unsigned
vdbeaux.c: In function 'sqlite3VdbeRecordCompare':
vdbeaux.c:1813: warning: comparison between signed and unsigned
vdbeaux.c:1815: warning: comparison between signed and unsigned
vdbeaux.c:1841: warning: comparison between signed and unsigned
vdbeaux.c:1843: warning: comparison between signed and unsigned
vdbemem.c: In function 'sqlite3VdbeMemMakeWriteable':
vdbemem.c:106: warning: comparison between signed and unsigned
vdbemem.c: In function 'sqlite3ValueText':
vdbemem.c:779: warning: cast from pointer to integer of different size
where.c: In function 'bestIndex':
where.c:1097: warning: comparison between signed and unsigned
where.c: In function 'codeEqualityTerm':
where.c:1212: warning: unused parameter 'brk'
where.c: In function 'sqlite3WhereBegin':
where.c:1441: warning: comparison between signed and unsigned
where.c:1607: warning: comparison between signed and unsigned
Making all in analyzers
Making all in data
Making all in plugin
Making all in images
Making all in icons
Making all in loader
Making all in scripts
Making all in common
Making all in lyrics_astraweb
Making all in lyrics_lyrc
Making all in playlist2html
Making all in ruby_debug
Making all in score_default
Making all in score_impulsive
Making all in templates
Making all in webcontrol
Making all in themes
Making all in example
Making all in reinhardt
Making all in images
Making all in vis
Making all in libvisual
/usr/include/libvisual-0.4/libvisual/lv_time.h:104: warning: unused parameter ‘lo’
/usr/include/libvisual-0.4/libvisual/lv_time.h:104: warning: unused parameter ‘hi’
/usr/lib64/libSDL.so: undefined reference to `caca_end'
/usr/lib64/libSDL.so: undefined reference to `caca_refresh'
/usr/lib64/libSDL.so: undefined reference to `caca_get_width'
/usr/lib64/libSDL.so: undefined reference to `caca_draw_bitmap'
/usr/lib64/libSDL.so: undefined reference to `caca_init'
/usr/lib64/libSDL.so: undefined reference to `caca_get_height'
/usr/lib64/libSDL.so: undefined reference to `caca_create_bitmap'
/usr/lib64/libSDL.so: undefined reference to `caca_free_bitmap'
collect2: ld returned 1 exit status
make[5]: *** [amarok_libvisual] Error 1
make[4]: *** [all-recursive] Error 1
make[3]: *** [all-recursive] Error 1
make[2]: *** [all-recursive] Error 1
make[1]: *** [all-recursive] Error 1
make: *** [all] Error 2

!!! ERROR: media-sound/amarok-1.4.4-r3 failed.
Call stack:
  ebuild.sh, line 1580:   Called dyn_compile
  ebuild.sh, line 945:   Called src_compile
  amarok-1.4.4-r3.ebuild, line 79:   Called kde_src_compile
  kde.eclass, line 169:   Called kde_src_compile 'all'
  kde.eclass, line 339:   Called kde_src_compile 'myconf' 'configure' 'make'
  kde.eclass, line 335:   Called die

!!! died running emake, kde_src_compile:make
!!! If you need support, post the topmost build error, and the call stack if relevant.

!!! This ebuild is from an overlay: '/usr/portage/local/layman/sabayon'