rendered paste bodyMaking all in programs
make[3]: Entering directory `/opt/garnome-2.17.3.1/platform/gnome-vfs/work/main.d/gnome-vfs-2.17.2/programs'
if cc -DHAVE_CONFIG_H -I. -I. -I.. -I.. -I.. -DORBIT2=1 -pthread -I/opt/GNOME-2.17.3.1//include/gconf/2 -I/opt/GNOME-2.17.3.1//include/orbit-2.0 -I/opt/GNOME-2.17.3.1//include/glib-2.0 -I/opt/GNOME-2.17.3.1//lib/glib-2.0/include -DG_DISABLE_DEPRECATED -I/opt/GNOME-2.17.3.1//include -g -I/opt/GNOME-2.17.3.1//include -L/opt/GNOME-2.17.3.1//lib -O2 -pipe -march=athlon-xp -m3dnow -MT gnomevfs-cat.o -MD -MP -MF ".deps/gnomevfs-cat.Tpo" -c -o gnomevfs-cat.o gnomevfs-cat.c; \
then mv -f ".deps/gnomevfs-cat.Tpo" ".deps/gnomevfs-cat.Po"; else rm -f ".deps/gnomevfs-cat.Tpo"; exit 1; fi
/bin/sh ../libtool --tag=CC --mode=link cc -g -I/opt/GNOME-2.17.3.1//include -L/opt/GNOME-2.17.3.1//lib -O2 -pipe -march=athlon-xp -m3dnow -Wl,--export-dynamic -L/opt/GNOME-2.17.3.1//lib -o gnomevfs-cat gnomevfs-cat.o ../libgnomevfs/libgnomevfs-2.la -pthread -L/opt/GNOME-2.17.3.1//lib -lgconf-2 -lORBit-2 -lgobject-2.0 -lgthread-2.0 -lglib-2.0 -lselinux -lutil -lrt -lrt
mkdir .libs
cc -g -I/opt/GNOME-2.17.3.1//include -O2 -pipe -march=athlon-xp -m3dnow -Wl,--export-dynamic -o .libs/gnomevfs-cat gnomevfs-cat.o -pthread -L/opt/GNOME-2.17.3.1//lib ../libgnomevfs/.libs/libgnomevfs-2.so /opt/GNOME-2.17.3.1//lib/libxml2.so -lz -lm /usr/lib/libdbus-glib-1.so /usr/lib/libgobject-2.0.so /usr/lib/libglib-2.0.so -lssl -lcrypto /opt/GNOME-2.17.3.1//lib/libavahi-glib.so /opt/GNOME-2.17.3.1//lib/libavahi-client.so /usr/lib/libdbus-1.so -lnsl /opt/GNOME-2.17.3.1//lib/libavahi-common.so -lresolv /opt/GNOME-2.17.3.1//lib/libgconf-2.so /opt/GNOME-2.17.3.1//lib/libORBit-2.so /opt/GNOME-2.17.3.1//lib/libgmodule-2.0.so -ldl /opt/GNOME-2.17.3.1//lib/libgobject-2.0.so /opt/GNOME-2.17.3.1//lib/libgthread-2.0.so -lpthread /opt/GNOME-2.17.3.1//lib/libglib-2.0.so -lselinux -lutil -lrt -Wl,--rpath -Wl,/opt/GNOME-2.17.3.1//lib
../libgnomevfs/.libs/libgnomevfs-2.so: undefined reference to `g_type_register_static_simple'
collect2: ld returned 1 exit status
make[3]: *** [gnomevfs-cat] Error 1
make[3]: Leaving directory `/opt/garnome-2.17.3.1/platform/gnome-vfs/work/main.d/gnome-vfs-2.17.2/programs'
make[2]: *** [all-recursive] Error 1
make[2]: Leaving directory `/opt/garnome-2.17.3.1/platform/gnome-vfs/work/main.d/gnome-vfs-2.17.2'
make[1]: *** [all] Error 2
make[1]: Leaving directory `/opt/garnome-2.17.3.1/platform/gnome-vfs/work/main.d/gnome-vfs-2.17.2'
make: *** [build-work/main.d/gnome-vfs-2.17.2/Makefile] Error 2