C:\blender\blender>scons BF_TOOLSET=mingw BF_BUILDDIR=c:\b
scons: Reading SConscript files ...
Command-line arguments
BF_TOOLSET = mingw
BF_BUILDDIR = c:\b
Command-line targets
No targets given, using default
Using mingw
Using config file: config\win32-mingw-config.py
Using config file: user-config.py
Building in c:\b\
Configuring library bf_soundsystem
Configuring library bf_string
Configuring library bf_ghost
Configuring library bf_guardedalloc
Configuring library bf_bmfont
Configuring library bf_moto
Configuring library blender_CTR
Configuring library bf_memutil
Configuring library bf_decimation
Configuring library blender_IK
Configuring library blender_bop
Configuring library blender_ONL
Configuring library bf_elbeem
Configuring library blender_BSP
Configuring library extern_ftgl
Configuring library bf_avi
Configuring library bf_blenkernel
Configuring library bf_blenlib
Configuring library bf_blenloader
Configuring library bf_blenpluginapi
Configuring library bf_imbuf
Configuring library bf_cineon
Configuring library bf_dna
Configuring library blender_python
Configuring library blender_radiosity
Configuring library bf_readblenfile
Configuring library blender_render
Configuring library src0
Configuring library src1
Configuring library src2
Configuring library src3
Configuring library src4
Configuring library bf_yafray
Configuring library bf_ftfont
Configuring library bf_openexr
Configuring library bf_kernel
Configuring library blender_creator
Configuring resource winresource
Configuring program blender
scons: done reading SConscript files.
scons: Building targets ...
scons: `C:\b\lib\libbf_soundsystem.a' is up to date.
scons: `C:\b\lib\libbf_string.a' is up to date.
Compiling ==> 'GHOST_SystemWin32.cpp'
intern\ghost\intern\GHOST_SystemWin32.cpp:44: warning: ignoring #pragma warning
In file included from intern\ghost\intern\/GHOST_System.h:44,
from intern\ghost\intern\/GHOST_SystemWin32.h:45,
from intern\ghost\intern\GHOST_SystemWin32.cpp:46:
intern\ghost\intern\/GHOST_EventManager.h:40: warning: ignoring #pragma warning
In file included from intern\ghost\intern\/GHOST_DisplayManagerWin32.h:43,
from intern\ghost\intern\GHOST_SystemWin32.cpp:62:
intern\ghost\intern\/GHOST_DisplayManager.h:42: warning: ignoring #pragma warnin
g
In file included from intern\ghost\intern\GHOST_SystemWin32.cpp:68:
intern\ghost\intern\/GHOST_TimerManager.h:40: warning: ignoring #pragma warning
In file included from intern\ghost\intern\GHOST_SystemWin32.cpp:69:
intern\ghost\intern\/GHOST_WindowManager.h:40: warning: ignoring #pragma warning
In file included from intern\ghost\intern\GHOST_SystemWin32.cpp:70:
intern\ghost\intern\/GHOST_WindowWin32.h:48:20: wintab.h: No such file or direct
ory
intern\ghost\intern\/GHOST_WindowWin32.h:51:20: pktdef.h: No such file or direct
ory
In file included from intern\ghost\intern\GHOST_SystemWin32.cpp:70:
intern\ghost\intern\/GHOST_WindowWin32.h:54: error: expected `)' before '*' toke
n
intern\ghost\intern\/GHOST_WindowWin32.h:54: error: expected `,' or `;' before '
*' token
intern\ghost\intern\/GHOST_WindowWin32.h:55: error: ISO C++ forbids declaration
of `HCTX' with no type
intern\ghost\intern\/GHOST_WindowWin32.h:55: error: typedef `HCTX' is initialize
d (use __typeof__ instead)
intern\ghost\intern\/GHOST_WindowWin32.h:55: error: `API' was not declared in th
is scope
intern\ghost\intern\/GHOST_WindowWin32.h:55: error: `GHOST_WIN32_WTOpen' was not
declared in this scope
intern\ghost\intern\/GHOST_WindowWin32.h:55: error: expected `,' or `;' before '
(' token
intern\ghost\intern\/GHOST_WindowWin32.h:56: error: expected `)' before '*' toke
n
intern\ghost\intern\/GHOST_WindowWin32.h:56: error: expected `,' or `;' before '
*' token
intern\ghost\intern\/GHOST_WindowWin32.h:57: error: expected `)' before '*' toke
n
intern\ghost\intern\/GHOST_WindowWin32.h:57: error: expected `,' or `;' before '
*' token
intern\ghost\intern\GHOST_SystemWin32.cpp: In member function `virtual GHOST_TSu
ccess GHOST_SystemWin32::getCursorPosition(GHOST_TInt32&, GHOST_TInt32&) const':
intern\ghost\intern\GHOST_SystemWin32.cpp:228: warning: unused variable 'success
'
intern\ghost\intern\GHOST_SystemWin32.cpp: In static member function `static LRE
SULT GHOST_SystemWin32::s_wndProc(HWND__*, UINT, WPARAM, LPARAM)':
intern\ghost\intern\GHOST_SystemWin32.cpp:633: error: `WT_PACKET' undeclared (fi
rst use this function)
intern\ghost\intern\GHOST_SystemWin32.cpp:633: error: (Each undeclared identifie
r is reported only once for each function it appears in.)
intern\ghost\intern\GHOST_SystemWin32.cpp:636: error: `WT_CSRCHANGE' undeclared
(first use this function)
intern\ghost\intern\GHOST_SystemWin32.cpp:637: error: `WT_PROXIMITY' undeclared
(first use this function)
scons: *** [C:\b\intern\ghost\intern\GHOST_SystemWin32.o] Error 1
scons: building terminated because of errors.
C:\blender\blender>