All pastes #286855 Raw Edit

Stuff

public text v1 · immutable
#286855 ·published 2006-12-20 23:22 UTC
rendered paste body
_dialog.lo -MD -MP -MF .deps/add_event_dialog.Tpo -c add_event_dialog.c  -fPIC -                                                                                     
DPIC -o .libs/add_event_dialog.o
In file included from add_event_dialog.c:2:
e_mod_main.h:218: error: expected specifier-qualifier-list before 'E_Gadman_Clie                                                                                     
nt'
In file included from e_mod_main.h:327,
                 from add_event_dialog.c:2:
dialog_func.h:33: error: expected ')' before '*' token
dialog_func.h:35: error: expected ')' before '*' token
dialog_func.h:37: error: expected ')' before '*' token
In file included from e_mod_main.h:329,
                 from add_event_dialog.c:2:
cal_face_func.h:16: error: expected declaration specifiers or '...' before 'E_Ga                                                                                     
dman_Client'
cal_face_func.h:16: error: expected declaration specifiers or '...' before 'E_Ga                                                                                     
dman_Change'
add_event_dialog.c: In function '_add_event_basic_create_widgets':
add_event_dialog.c:130: warning: passing argument 2 of 'e_widget_entry_add' from                                                                                     
 incompatible pointer type
make[4]: *** [add_event_dialog.lo] Error 1
make[4]: Leaving directory `/var/tmp/portage/e_modules-9999/work/e_modules/calen                                                                                     
dar/src'
make[3]: *** [all-recursive] Error 1
make[3]: Leaving directory `/var/tmp/portage/e_modules-9999/work/e_modules/calen                                                                                     
dar/src'
make[2]: *** [all-recursive] Error 1
make[2]: Leaving directory `/var/tmp/portage/e_modules-9999/work/e_modules/calen                                                                                     
dar'
make[1]: *** [all] Error 2
make[1]: Leaving directory `/var/tmp/portage/e_modules-9999/work/e_modules/calen                                                                                     
dar'
make: *** [all] Error 1
 * This is a LIVE CVS ebuild.
 * That means there are NO promises it will work.
 * If it fails to build, FIX THE CODE YOURSELF
 * before reporting any issues.

!!! ERROR: x11-plugins/e_modules-9999 failed.
Call stack:
  ebuild.sh, line 1546:   Called dyn_compile
  ebuild.sh, line 937:   Called src_compile
  ebuild.sh, line 1255:   Called enlightenment_src_compile
  enlightenment.eclass, line 156:   Called enlightenment_die 'emake failed'
  enlightenment.eclass, line 106:   Called die

!!! emake failed
!!! SEND BUG REPORTS TO vapier@gentoo.org NOT THE E TEAM
!!! If you need support, post the topmost build error, and the call stack if rel                                                                                     
evant.