evas_engine_dfb_image_objects.c:100: error: conflicting types for 'evas_engine_directfb_image_new_from_data'
evas_engine_dfb_image_objects.h:8: error: previous declaration of 'evas_engine_directfb_image_new_from_data' was here
evas_engine_dfb_image_objects.c:108: error: conflicting types for 'evas_engine_directfb_image_new_from_copied_data'
evas_engine_dfb_image_objects.h:13: error: previous declaration of 'evas_engine_directfb_image_new_from_copied_data' was here
evas_engine_dfb_image_objects.c: In function 'evas_engine_directfb_image_data_put':
evas_engine_dfb_image_objects.c:238: error: too few arguments to function 'evas_engine_directfb_image_new_from_data'
make[5]: *** [evas_engine_dfb_image_objects.lo] Error 1
make[5]: *** Waiting for unfinished jobs....
make[5]: Leaving directory `/var/tmp/portage/evas-9999/work/e17/libs/evas/src/modules/engines/directfb'
make[4]: *** [all-recursive] Error 1
make[4]: Leaving directory `/var/tmp/portage/evas-9999/work/e17/libs/evas/src/modules/engines'
make[3]: *** [all-recursive] Error 1
make[3]: Leaving directory `/var/tmp/portage/evas-9999/work/e17/libs/evas/src/modules'
make[2]: *** [all-recursive] Error 1
make[2]: Leaving directory `/var/tmp/portage/evas-9999/work/e17/libs/evas/src'
make[1]: *** [all-recursive] Error 1
make[1]: Leaving directory `/var/tmp/portage/evas-9999/work/e17/libs/evas'
make: *** [all] Error 2
* This is a LIVE CVS ebuild.
* That means there are NO promises it will work.
* If it fails to build, FIX THE CODE YOURSELF
* before reporting any issues.
!!! ERROR: x11-libs/evas-9999 failed.
Call stack:
ebuild.sh, line 1546: Called dyn_compile
ebuild.sh, line 937: Called src_compile
evas-9999.ebuild, line 78: Called enlightenment_src_compile
enlightenment.eclass, line 156: Called enlightenment_die 'emake failed'
enlightenment.eclass, line 106: Called die
!!! emake failed
!!! SEND BUG REPORTS TO vapier@gentoo.org NOT THE E TEAM
!!! If you need support, post the topmost build error, and the call stack if relevant.