All pastes #286718 Raw Edit

Mine

public text v1 · immutable
#286718 ·published 2006-12-20 21:44 UTC
rendered paste body
kwwii@clive:~/kimagefx$ make
cd src && make -f Makefile
make[1]: Entering directory `/home/kwwii/kimagefx/src'
g++ -c -pipe -Wall -W -g -D_REENTRANT -fPIC  -DQT_THREAD_SUPPORT -DQT_SHARED -DQT_TABLET_SUPPORT -I/usr/s
hare/qt3/mkspecs/default -I. -I../effects -I. -I/usr/include/qt3 -Itmp/ -o tmp/filter.o filter.cpp
In file included from filter.cpp:1:
filter.h:4:17: error: QList: No such file or directory
filter.h:5:19: error: QString: No such file or directory
filter.h:6:20: error: QVariant: No such file or directory
In file included from effect_p.h:4,
                 from filter.cpp:3:
layer.h:4:18: error: QImage: No such file or directory
layer.h:5:19: error: QPixmap: No such file or directory
In file included from filter.cpp:3:
effect_p.h:6:16: error: QMap: No such file or directory
filter.h:17: error: expected ‘,’ or ‘...’ before ‘&’ token
filter.h:17: error: ISO C++ forbids declaration of ‘QString’ with no type
filter.h:20: error: ‘QString’ does not name a type
filter.h:27: error: ISO C++ forbids declaration of ‘QMap’ with no type
filter.h:27: error: expected &#8216;;&#8217; before &#8216;<&#8217; token
filter.h:29: error: expected &#8216;,&#8217; or &#8216;...&#8217; before &#8216;&&#8217; token
filter.h:29: error: ISO C++ forbids declaration of &#8216;QString&#8217; with no type
filter.h:30: error: &#8216;QVariant&#8217; does not name a type
filter.h:32: error: expected &#8216;,&#8217; or &#8216;...&#8217; before &#8216;<&#8217; token
filter.h:32: error: ISO C++ forbids declaration of &#8216;QMap&#8217; with no type
filter.h:33: error: ISO C++ forbids declaration of &#8216;QMap&#8217; with no type
filter.h:33: error: expected &#8216;;&#8217; before &#8216;<&#8217; token
filter.h:40: error: ISO C++ forbids declaration of &#8216;QList&#8217; with no type
filter.h:40: error: expected &#8216;;&#8217; before &#8216;<&#8217; token
layer.h:24: error: &#8216;LayerSurfaces&#8217; has not been declared
layer.h:24: error: ISO C++ forbids declaration of &#8216;Q_DECLARE_FLAGS&#8217; with no type
layer.h:25: error: expected &#8216;;&#8217; before &#8216;public&#8217;
layer.h:29: error: expected `)' before &#8216;*&#8217; token
layer.h:30: error: expected `)' before &#8216;*&#8217; token
layer.h:31: error: expected &#8216;,&#8217; or &#8216;...&#8217; before &#8216;&&#8217; token
layer.h:31: error: ISO C++ forbids declaration of &#8216;QImage&#8217; with no type
layer.h:32: error: expected &#8216;,&#8217; or &#8216;...&#8217; before &#8216;&&#8217; token
layer.h:32: error: ISO C++ forbids declaration of &#8216;QPixmap&#8217; with no type
layer.h:32: error: &#8216;KImageFx::Layer::Layer(int)&#8217; cannot be overloaded
layer.h:31: error: with &#8216;KImageFx::Layer::Layer(int)&#8217;
layer.h:33: error: expected &#8216;,&#8217; or &#8216;...&#8217; before &#8216;&&#8217; token
layer.h:33: error: ISO C++ forbids declaration of &#8216;QString&#8217; with no type
layer.h:33: error: &#8216;KImageFx::Layer::Layer(int)&#8217; cannot be overloaded
layer.h:31: error: with &#8216;KImageFx::Layer::Layer(int)&#8217;
layer.h:38: error: &#8216;QImage&#8217; does not name a type
layer.h:39: error: &#8216;QPixmap&#8217; does not name a type
layer.h:42: error: ISO C++ forbids declaration of &#8216;QImage&#8217; with no type
layer.h:42: error: expected &#8216;;&#8217; before &#8216;&&#8217; token
layer.h:43: error: ISO C++ forbids declaration of &#8216;QPixmap&#8217; with no type
layer.h:43: error: expected &#8216;;&#8217; before &#8216;&&#8217; token
layer.h:56: error: ISO C++ forbids declaration of &#8216;QList&#8217; with no type
layer.h:56: error: expected &#8216;;&#8217; before &#8216;<&#8217; token
effect_p.h:18: error: &#8216;LayerSurfaces&#8217; in class &#8216;KImageFx::Layer&#8217; does not name a type
effect_p.h:20: error: &#8216;QString&#8217; does not name a type
effect_p.h:22: error: &#8216;QString&#8217; does not name a type
effect_p.h:24: error: ISO C++ forbids declaration of &#8216;QMap&#8217; with no type
effect_p.h:24: error: &#8216;QMap&#8217; declared as a &#8216;virtual&#8217; field
effect_p.h:24: error: expected &#8216;;&#8217; before &#8216;<&#8217; token
effect_p.h:30: error: expected &#8216;,&#8217; or &#8216;...&#8217; before &#8216;&&#8217; token
effect_p.h:30: error: ISO C++ forbids declaration of &#8216;QString&#8217; with no type
effect_p.h:31: error: &#8216;QVariant&#8217; does not name a type
effect_p.h:33: error: expected &#8216;,&#8217; or &#8216;...&#8217; before &#8216;<&#8217; token
effect_p.h:33: error: ISO C++ forbids declaration of &#8216;QMap&#8217; with no type
effect_p.h:34: error: ISO C++ forbids declaration of &#8216;QMap&#8217; with no type
effect_p.h:34: error: expected &#8216;;&#8217; before &#8216;<&#8217; token
loader_p.h:17: error: ISO C++ forbids declaration of &#8216;QList&#8217; with no type
loader_p.h:17: error: expected &#8216;;&#8217; before &#8216;<&#8217; token
loader_p.h:18: error: ISO C++ forbids declaration of &#8216;QList&#8217; with no type
loader_p.h:18: error: expected &#8216;;&#8217; before &#8216;<&#8217; token
loader_p.h:24: error: ISO C++ forbids declaration of &#8216;QList&#8217; with no type
loader_p.h:24: error: expected &#8216;;&#8217; before &#8216;<&#8217; token
filter.cpp:14: error: expected &#8216;,&#8217; or &#8216;...&#8217; before &#8216;&&#8217; token
filter.cpp:14: error: ISO C++ forbids declaration of &#8216;QString&#8217; with no type
filter.cpp: In constructor &#8216;KImageFx::Filter::Filter(int)&#8217;:
filter.cpp:17: error: &#8216;m_effects&#8217; was not declared in this scope
filter.cpp:17: error: &#8216;class KImageFx::Loader&#8217; has no member named &#8216;effects&#8217;
filter.cpp:17: error: &#8216;path&#8217; was not declared in this scope
filter.cpp: At global scope:
filter.cpp:14: warning: unused parameter &#8216;QString&#8217;
filter.cpp:21: error: &#8216;QString&#8217; does not name a type
filter.cpp:55: error: expected &#8216;,&#8217; or &#8216;...&#8217; before &#8216;&&#8217; token
filter.cpp:55: error: ISO C++ forbids declaration of &#8216;QString&#8217; with no type
filter.cpp: In member function &#8216;void KImageFx::Filter::setArgument(int)&#8217;:
filter.cpp:58: error: &#8216;key&#8217; was not declared in this scope
filter.cpp:58: error: &#8216;value&#8217; was not declared in this scope
filter.cpp: At global scope:
filter.cpp:55: warning: unused parameter &#8216;QString&#8217;
filter.cpp:61: error: &#8216;QVariant&#8217; does not name a type
filter.cpp:68: error: expected &#8216;,&#8217; or &#8216;...&#8217; before &#8216;<&#8217; token
filter.cpp:68: error: ISO C++ forbids declaration of &#8216;QMap&#8217; with no type
filter.cpp: In member function &#8216;void KImageFx::Filter::setArguments(int)&#8217;:
filter.cpp:71: error: &#8216;args&#8217; was not declared in this scope
filter.cpp: At global scope:
filter.cpp:68: warning: unused parameter &#8216;QMap&#8217;
filter.cpp:74: error: expected constructor, destructor, or type conversion before &#8216;<&#8217; token
filter.cpp:81: error: expected constructor, destructor, or type conversion before &#8216;<&#8217; token
make[1]: *** [tmp/filter.o] Error 1
make[1]: Leaving directory `/home/kwwii/kimagefx/src'
make: *** [sub-src] Error 2