All pastes #286179 Raw Edit

Quelque chose

public text v1 · immutable
#286179 ·published 2006-12-20 13:10 UTC
rendered paste body
helena@ubuntu:~/Desktop/RT73_Linux_STA_Drv1.0.3.6/Module$ sudo make all
make -C /lib/modules/2.6.17-10-386/build SUBDIRS=/home/helena/Desktop/RT73_Linux_STA_Drv1.0.3.6/Module modules
make[1]: entrant dans le répertoire « /usr/src/linux-headers-2.6.17-10-386 »
  CC [M]  /home/helena/Desktop/RT73_Linux_STA_Drv1.0.3.6/Module/rtmp_main.o
In file included from /home/helena/Desktop/RT73_Linux_STA_Drv1.0.3.6/Module/rt_config.h:184,
                 from /home/helena/Desktop/RT73_Linux_STA_Drv1.0.3.6/Module/rtmp_main.c:40:
/home/helena/Desktop/RT73_Linux_STA_Drv1.0.3.6/Module/rtmp_def.h:832: error: expected identifier or ‘(’ before ‘{’ token
/home/helena/Desktop/RT73_Linux_STA_Drv1.0.3.6/Module/rtmp_def.h:832: error: expected identifier or ‘(’ before ‘}’ token
/home/helena/Desktop/RT73_Linux_STA_Drv1.0.3.6/Module/rtmp_main.c:65: error: expected expression before ‘;’ token
make[2]: *** [/home/helena/Desktop/RT73_Linux_STA_Drv1.0.3.6/Module/rtmp_main.o] Erreur 1
make[1]: *** [_module_/home/helena/Desktop/RT73_Linux_STA_Drv1.0.3.6/Module] Erreur 2
make[1]: quittant le répertoire « /usr/src/linux-headers-2.6.17-10-386 »
make: *** [all] Erreur 2