All pastes #285438 Raw Edit

Untitled

public text v1 · immutable
#285438 ·published 2006-12-19 20:55 UTC
rendered paste body
libmpc.h:170: error: 'mpc_demux' has not been declared
libmpc.cpp: In function 'void mpcGetSongInfo(char*, char**, int*)':
libmpc.cpp:329: error: 'mpc_demux' was not declared in this scope
libmpc.cpp:329: error: 'demux' was not declared in this scope
libmpc.cpp:330: error: 'mpc_reader_init_stdio' was not declared in this scope
libmpc.cpp:330: error: 'MPC_STATUS_OK' was not declared in this scope
libmpc.cpp:330: error: 'mpc_demux_init' was not declared in this scope
libmpc.cpp:335: error: 'mpc_demux_get_info' was not declared in this scope
libmpc.cpp:337: error: 'mpc_demux_exit' was not declared in this scope
libmpc.cpp:338: error: 'mpc_reader_exit_stdio' was not declared in this scope
libmpc.cpp: In function 'void mpcFileInfoBox(char*)':
libmpc.cpp:528: error: 'mpc_demux' was not declared in this scope
libmpc.cpp:528: error: 'demux' was not declared in this scope
libmpc.cpp:529: error: 'mpc_reader_init_stdio' was not declared in this scope
libmpc.cpp:529: error: 'MPC_STATUS_OK' was not declared in this scope
libmpc.cpp:529: error: 'mpc_demux_init' was not declared in this scope
libmpc.cpp:531: error: 'mpc_demux_get_info' was not declared in this scope
libmpc.cpp:540: error: 'struct mpc_streaminfo' has no member named 'pns'
libmpc.cpp:568: error: 'mpc_demux_exit' was not declared in this scope
libmpc.cpp:569: error: 'mpc_reader_exit_stdio' was not declared in this scope
libmpc.cpp: In function 'void* decodeStream(void*)':
libmpc.cpp:757: error: 'mpc_reader_init_stdio' was not declared in this scope
libmpc.cpp:757: error: 'MPC_STATUS_OK' was not declared in this scope
libmpc.cpp:762: error: 'mpc_demux' was not declared in this scope
libmpc.cpp:762: error: 'demux' was not declared in this scope
libmpc.cpp:763: error: 'mpc_demux_init' was not declared in this scope
libmpc.cpp:767: error: 'mpc_reader_exit_stdio' was not declared in this scope
libmpc.cpp:772: error: 'mpc_demux_get_info' was not declared in this scope
libmpc.cpp:792: error: 'mpc_reader_exit_stdio' was not declared in this scope
libmpc.cpp:808: error: 'mpc_demux_seek_second' was not declared in this scope
libmpc.cpp:838: error: 'mpc_demux_exit' was not declared in this scope
libmpc.cpp:839: error: 'mpc_reader_exit_stdio' was not declared in this scope
libmpc.cpp: At global scope:
libmpc.cpp:843: error: 'mpc_demux' has not been declared
libmpc.cpp: In function 'int processBuffer(MPC_SAMPLE_FORMAT*, char*, int&)':
libmpc.cpp:845: error: 'mpc_frame_info' was not declared in this scope
libmpc.cpp:845: error: expected `;' before 'info'
libmpc.cpp:847: error: 'info' was not declared in this scope
libmpc.cpp:848: error: 'mpc_demux_decode' was not declared in this scope
make[2]: *** [libmpc.lo] Error 1
make[2]: Leaving directory `/mnt/data/personal/SHIT_TO_DO2/Software/MUSEPACK/SOU                                            RCE/SVN/SV8/libmpc-r2d-r167/xmms'
make[1]: *** [all-recursive] Error 1
make[1]: Leaving directory `/mnt/data/personal/SHIT_TO_DO2/Software/MUSEPACK/SOU                                            RCE/SVN/SV8/libmpc-r2d-r167'
make: *** [all] Error 2