All pastes #28524 Raw Edit

Something

public text v1 · immutable
#28524 ·published 2005-11-13 06:28 UTC
rendered paste body
 gcc -DHAVE_CONFIG_H -I. -I. -I../include -I../include -I../libs/lpc10 -g -O2 -MT codec_lpc10_la-codec_lpc10.lo -MD -MP -MF .dep
s/codec_lpc10_la-codec_lpc10.Tpo -c codec_lpc10.c  -fPIC -DPIC -o .libs/codec_lpc10_la-codec_lpc10.o
In file included from /usr/local/include/spandsp.h:77,
                 from codec_lpc10.c:38:
/usr/local/include/spandsp/t4.h:82: error: syntax error before "TIFF"
/usr/local/include/spandsp/t4.h:159: error: syntax error before '}' token
/usr/local/include/spandsp/t4.h:193: error: syntax error before '*' token
/usr/local/include/spandsp/t4.h:201: error: syntax error before '*' token
/usr/local/include/spandsp/t4.h:207: error: syntax error before '*' token
/usr/local/include/spandsp/t4.h:214: error: syntax error before '*' token
/usr/local/include/spandsp/t4.h:220: error: syntax error before '*' token
/usr/local/include/spandsp/t4.h:228: error: syntax error before '*' token
/usr/local/include/spandsp/t4.h:237: error: syntax error before '*' token
/usr/local/include/spandsp/t4.h:243: error: syntax error before '*' token
/usr/local/include/spandsp/t4.h:249: error: syntax error before '*' token
/usr/local/include/spandsp/t4.h:255: error: syntax error before '*' token
/usr/local/include/spandsp/t4.h:261: error: syntax error before '*' token
/usr/local/include/spandsp/t4.h:267: error: syntax error before '*' token
/usr/local/include/spandsp/t4.h:273: error: syntax error before '*' token
/usr/local/include/spandsp/t4.h:279: error: syntax error before '*' token
/usr/local/include/spandsp/t4.h:285: error: syntax error before '*' token
/usr/local/include/spandsp/t4.h:293: error: syntax error before '*' token
/usr/local/include/spandsp/t4.h:302: error: syntax error before '*' token
/usr/local/include/spandsp/t4.h:308: error: syntax error before '*' token
/usr/local/include/spandsp/t4.h:314: error: syntax error before '*' token
/usr/local/include/spandsp/t4.h:320: error: syntax error before '*' token
/usr/local/include/spandsp/t4.h:330: error: syntax error before '*' token
/usr/local/include/spandsp/t4.h:338: error: syntax error before '*' token
/usr/local/include/spandsp/t4.h:345: error: syntax error before '*' token
/usr/local/include/spandsp/t4.h:351: error: syntax error before '*' token
/usr/local/include/spandsp/t4.h:359: error: syntax error before '*' token
/usr/local/include/spandsp/t4.h:365: error: syntax error before '*' token
/usr/local/include/spandsp/t4.h:375: error: syntax error before '*' token
/usr/local/include/spandsp/t4.h:381: error: syntax error before '*' token
/usr/local/include/spandsp/t4.h:387: error: syntax error before '*' token
/usr/local/include/spandsp/t4.h:393: error: syntax error before '*' token
/usr/local/include/spandsp/t4.h:399: error: syntax error before '*' token
/usr/local/include/spandsp/t4.h:406: error: syntax error before '*' token
In file included from /usr/local/include/spandsp.h:78,
                 from codec_lpc10.c:38:
/usr/local/include/spandsp/t30.h:276: error: syntax error before "t4_state_t"
/usr/local/include/spandsp/t30.h:282: error: conflicting types for 'local_ident'
/usr/local/include/spandsp/t4.h:108: error: previous declaration of 'local_ident' was here
/usr/local/include/spandsp/t30.h:284: error: conflicting types for 'far_ident'
/usr/local/include/spandsp/t4.h:109: error: previous declaration of 'far_ident' was here
/usr/local/include/spandsp/t30.h:286: error: conflicting types for 'sub_address'
/usr/local/include/spandsp/t4.h:110: error: previous declaration of 'sub_address' was here
/usr/local/include/spandsp/t30.h:395: error: syntax error before '}' token
In file included from /usr/local/include/spandsp.h:82,
                 from codec_lpc10.c:38:
/usr/local/include/spandsp/t38.h:286: error: field `t30_state' has incomplete type
In file included from /usr/local/include/spandsp.h:83,
                 from codec_lpc10.c:38:
/usr/local/include/spandsp/fax.h:53: error: field `t30_state' has incomplete type
make[1]: *** [codec_lpc10_la-codec_lpc10.lo] Error 1
make[1]: Leaving directory `/usr/src/openpbx/branches/opus/trunk/codecs'
make: *** [all-recursive] Error 1
[rewt@localhost trunk]$ 
[rewt@localhost trunk]$ rpm -qa | grep tiff
libtiff-3.6.1-9.fc3
libtiff-devel-3.6.1-9.fc3