All pastes #284037 Raw Edit

Someone

public text v1 · immutable
#284037 ·published 2006-12-18 20:38 UTC
rendered paste body
/home/users/arekm/tcl-test/bin/tclsh8.5 aaa.tcl > bbb.txt
application-specific initialization failed: too many nested evaluations (infinite loop?)
too many nested evaluations (infinite loop?)
    while executing
"puts stderr [set auto_path]"
    (file "aaa.tcl" line 1)
make: *** [test] Błąd 1
zsh: exit 2     make test
[arekm@arm ~/tcl]$ make test
/home/users/arekm/tcl-test/bin/tclsh8.5 aaa.tcl > bbb.txt
/home/users/arekm/tcl-test/lib/tcl8.5 /home/users/arekm/tcl-test/lib
[arekm@arm ~/tcl]$ make test
/home/users/arekm/tcl-test/bin/tclsh8.5 aaa.tcl > bbb.txt
/home/users/arekm/tcl-test/lib/tcl8.5 /home/users/arekm/tcl-test/lib
[arekm@arm ~/tcl]$ make test
/home/users/arekm/tcl-test/bin/tclsh8.5 aaa.tcl > bbb.txt
/home/users/arekm/tcl-test/lib/tcl8.5 /home/users/arekm/tcl-test/lib
[arekm@arm ~/tcl]$ make test
/home/users/arekm/tcl-test/bin/tclsh8.5 aaa.tcl > bbb.txt
application-specific initialization failed: too many nested evaluations (infinite loop?)
too many nested evaluations (infinite loop?)
    while executing
"puts stderr [set auto_path]"
    (file "aaa.tcl" line 1)
make: *** [test] Błąd 1
zsh: exit 2     make test
[arekm@arm ~/tcl]$ make test
/home/users/arekm/tcl-test/bin/tclsh8.5 aaa.tcl > bbb.txt
application-specific initialization failed: too many nested evaluations (infinite loop?)
too many nested evaluations (infinite loop?)
    while executing
"puts stderr [set auto_path]"
    (file "aaa.tcl" line 1)
make: *** [test] Błąd 1
zsh: exit 2     make test
[arekm@arm ~/tcl]$ make test
/home/users/arekm/tcl-test/bin/tclsh8.5 aaa.tcl > bbb.txt
application-specific initialization failed: too many nested evaluations (infinite loop?)
too many nested evaluations (infinite loop?)
    while executing
"puts stderr [set auto_path]"
    (file "aaa.tcl" line 1)
make: *** [test] Błąd 1
zsh: exit 2     make test
[arekm@arm ~/tcl]$ ldd /home/users/arekm/tcl-test/bin/tclsh8.5
        libtcl8.5.so => /home/users/arekm/tcl-test/lib/libtcl8.5.so (0x00002b4f46572000)
        libdl.so.2 => /lib64/libdl.so.2 (0x00002b4f46892000)
        libpthread.so.0 => /lib64/libpthread.so.0 (0x00002b4f46a96000)
        libm.so.6 => /lib64/libm.so.6 (0x00002b4f46cb1000)
        libc.so.6 => /lib64/libc.so.6 (0x00002b4f46f34000)
        /lib64/ld-linux-x86-64.so.2 (0x00002b4f46356000)
[arekm@arm ~/tcl]$