All pastes #282728 Raw Edit

config.log

public text v1 · immutable
#282728 ·published 2006-12-17 20:47 UTC
rendered paste body
This file contains any messages produced by compilers while
running configure, to aid debugging if configure makes a mistake.

It was created by configure, which was
generated by GNU Autoconf 2.60.  Invocation command line was

  $ ./configure --prefix=/opt/kde3 --enable-debug=full --with-libgpod --with-mp4v2

## --------- ##
## Platform. ##
## --------- ##

hostname = Frankenstein
uname -m = i686
uname -r = 2.6.18.2-34-bigsmp
uname -s = Linux
uname -v = #1 SMP Mon Nov 27 11:46:27 UTC 2006

/usr/bin/uname -p = unknown
/bin/uname -X     = unknown

/bin/arch              = i686
/usr/bin/arch -k       = unknown
/usr/convex/getsysinfo = unknown
/usr/bin/hostinfo      = unknown
/bin/machine           = unknown
/usr/bin/oslevel       = unknown
/bin/universe          = unknown

PATH: /home/flo/bin
PATH: /usr/local/bin
PATH: /usr/bin
PATH: /usr/X11R6/bin
PATH: /bin
PATH: /usr/games
PATH: /opt/gnome/bin
PATH: /opt/kde3/bin
PATH: .
PATH: /usr/lib/jvm/jre/bin
PATH: /usr/lib/mit/bin
PATH: /usr/lib/mit/sbin
PATH: /usr/lib/qt3/bin


## ----------- ##
## Core tests. ##
## ----------- ##

configure:2235: checking build system type
configure:2253: result: i686-pc-linux-gnu
configure:2275: checking host system type
configure:2290: result: i686-pc-linux-gnu
configure:2312: checking target system type
configure:2327: result: i686-pc-linux-gnu
configure:2388: checking for a BSD-compatible install
configure:2444: result: /usr/bin/install -c
configure:2459: checking for -p flag to install
configure:2472: result: yes
configure:2483: checking whether build environment is sane
configure:2526: result: yes
configure:2578: checking for gawk
configure:2594: found /usr/bin/gawk
configure:2605: result: gawk
configure:2616: checking whether make sets $(MAKE)
configure:2637: result: yes
configure:2911: checking for kde-config
configure:2973: result: /opt/kde3/bin/kde-config
configure:2996: checking where to install
configure:3004: result: /opt/kde3 (as requested)
configure:3055: checking for style of include used by make
configure:3083: result: GNU
configure:3233: checking for gcc
configure:3249: found /usr/bin/gcc
configure:3260: result: gcc
configure:3498: checking for C compiler version
configure:3505: gcc --version >&5
gcc (GCC) 4.1.2 20061115 (prerelease) (SUSE Linux)
Copyright (C) 2006 Free Software Foundation, Inc.
This is free software; see the source for copying conditions.  There is NO
warranty; not even for MERCHANTABILITY or FITNESS FOR A PARTICULAR PURPOSE.

configure:3508: $? = 0
configure:3515: gcc -v >&5
Using built-in specs.
Target: i586-suse-linux
Configured with: ../configure --enable-threads=posix --prefix=/usr --with-local-prefix=/usr/local --infodir=/usr/share/info --mandir=/usr/share/man --libdir=/usr/lib --libexecdir=/usr/lib --enable-languages=c,c++,objc,fortran,obj-c++,java,ada --enable-checking=release --with-gxx-include-dir=/usr/include/c++/4.1.2 --enable-ssp --disable-libssp --disable-libgcj --with-slibdir=/lib --with-system-zlib --enable-shared --enable-__cxa_atexit --enable-libstdcxx-allocator=new --program-suffix=-4.1 --enable-version-specific-runtime-libs --without-system-libunwind --with-cpu=generic --host=i586-suse-linux
Thread model: posix
gcc version 4.1.2 20061115 (prerelease) (SUSE Linux)
configure:3518: $? = 0
configure:3525: gcc -V >&5
gcc: '-V' option must have argument
configure:3528: $? = 1
configure:3551: checking for C compiler default output file name
configure:3578: gcc     conftest.c  >&5
configure:3581: $? = 0
configure:3627: result: a.out
configure:3632: checking whether the C compiler works
configure:3642: ./a.out
configure:3645: $? = 0
configure:3662: result: yes
configure:3669: checking whether we are cross compiling
configure:3671: result: no
configure:3674: checking for suffix of executables
configure:3681: gcc -o conftest     conftest.c  >&5
configure:3684: $? = 0
configure:3708: result: 
configure:3714: checking for suffix of object files
configure:3740: gcc -c    conftest.c >&5
configure:3743: $? = 0
configure:3766: result: o
configure:3770: checking whether we are using the GNU C compiler
configure:3799: gcc -c    conftest.c >&5
configure:3805: $? = 0
configure:3812: test -z "$ac_c_werror_flag" || test ! -s conftest.err
configure:3815: $? = 0
configure:3822: test -s conftest.o
configure:3825: $? = 0
configure:3839: result: yes
configure:3844: checking whether gcc accepts -g
configure:3874: gcc -c -g  conftest.c >&5
configure:3880: $? = 0
configure:3887: test -z "$ac_c_werror_flag" || test ! -s conftest.err
configure:3890: $? = 0
configure:3897: test -s conftest.o
configure:3900: $? = 0
configure:4030: result: yes
configure:4047: checking for gcc option to accept ISO C89
configure:4121: gcc  -c    conftest.c >&5
configure:4127: $? = 0
configure:4134: test -z "$ac_c_werror_flag" || test ! -s conftest.err
configure:4137: $? = 0
configure:4144: test -s conftest.o
configure:4147: $? = 0
configure:4167: result: none needed
configure:4187: checking dependency style of gcc
configure:4277: result: gcc3
configure:4300: checking how to run the C preprocessor
configure:4340: gcc -E  conftest.c
configure:4346: $? = 0
configure:4384: gcc -E  conftest.c
conftest.c:10:28: error: ac_nonexistent.h: No such file or directory
configure:4390: $? = 1
configure: failed program was:
| /* confdefs.h.  */
| #define PACKAGE_NAME ""
| #define PACKAGE_TARNAME ""
| #define PACKAGE_VERSION ""
| #define PACKAGE_STRING ""
| #define PACKAGE_BUGREPORT ""
| #define PACKAGE "amarok-svn"
| #define VERSION "3.5.5"
| /* end confdefs.h.  */
| #include <ac_nonexistent.h>
configure:4430: result: gcc -E
configure:4459: gcc -E  conftest.c
configure:4465: $? = 0
configure:4503: gcc -E  conftest.c
conftest.c:10:28: error: ac_nonexistent.h: No such file or directory
configure:4509: $? = 1
configure: failed program was:
| /* confdefs.h.  */
| #define PACKAGE_NAME ""
| #define PACKAGE_TARNAME ""
| #define PACKAGE_VERSION ""
| #define PACKAGE_STRING ""
| #define PACKAGE_BUGREPORT ""
| #define PACKAGE "amarok-svn"
| #define VERSION "3.5.5"
| /* end confdefs.h.  */
| #include <ac_nonexistent.h>
configure:4640: checking for g++
configure:4656: found /usr/bin/g++
configure:4667: result: g++
configure:4698: checking for C++ compiler version
configure:4705: g++ --version >&5
g++ (GCC) 4.1.2 20061115 (prerelease) (SUSE Linux)
Copyright (C) 2006 Free Software Foundation, Inc.
This is free software; see the source for copying conditions.  There is NO
warranty; not even for MERCHANTABILITY or FITNESS FOR A PARTICULAR PURPOSE.

configure:4708: $? = 0
configure:4715: g++ -v >&5
Using built-in specs.
Target: i586-suse-linux
Configured with: ../configure --enable-threads=posix --prefix=/usr --with-local-prefix=/usr/local --infodir=/usr/share/info --mandir=/usr/share/man --libdir=/usr/lib --libexecdir=/usr/lib --enable-languages=c,c++,objc,fortran,obj-c++,java,ada --enable-checking=release --with-gxx-include-dir=/usr/include/c++/4.1.2 --enable-ssp --disable-libssp --disable-libgcj --with-slibdir=/lib --with-system-zlib --enable-shared --enable-__cxa_atexit --enable-libstdcxx-allocator=new --program-suffix=-4.1 --enable-version-specific-runtime-libs --without-system-libunwind --with-cpu=generic --host=i586-suse-linux
Thread model: posix
gcc version 4.1.2 20061115 (prerelease) (SUSE Linux)
configure:4718: $? = 0
configure:4725: g++ -V >&5
g++: '-V' option must have argument
configure:4728: $? = 1
configure:4731: checking whether we are using the GNU C++ compiler
configure:4760: g++ -c    conftest.cpp >&5
configure:4766: $? = 0
configure:4773: test -z "$ac_cxx_werror_flag" || test ! -s conftest.err
configure:4776: $? = 0
configure:4783: test -s conftest.o
configure:4786: $? = 0
configure:4800: result: yes
configure:4805: checking whether g++ accepts -g
configure:4835: g++ -c -g  conftest.cpp >&5
configure:4841: $? = 0
configure:4848: test -z "$ac_cxx_werror_flag" || test ! -s conftest.err
configure:4851: $? = 0
configure:4858: test -s conftest.o
configure:4861: $? = 0
configure:4991: result: yes
configure:5016: checking dependency style of g++
configure:5106: result: gcc3
configure:5125: checking whether gcc is blacklisted
configure:5156: gcc -c -g3 -fno-inline    conftest.c >&5
configure:5162: $? = 0
configure:5169: test -z "$ac_c_werror_flag" || test ! -s conftest.err
configure:5172: $? = 0
configure:5179: test -s conftest.o
configure:5182: $? = 0
configure:5195: result: no
configure:5238: checking whether g++ supports -fno-builtin
configure:5280: rm -rf SunWS_cache; g++ -o conftest -g3 -fno-inline   -fno-builtin   conftest.cpp  1>&5
configure:5286: $? = 0
configure:5293: test -z "$ac_cxx_werror_flag" || test ! -s conftest.err
configure:5296: $? = 0
configure:5303: test -s conftest
configure:5306: $? = 0
configure:5329: result: yes
configure:5342: checking whether g++ supports -Woverloaded-virtual
configure:5382: rm -rf SunWS_cache; g++ -o conftest -fno-builtin -g3 -fno-inline   -Woverloaded-virtual   conftest.cpp  1>&5
configure:5388: $? = 0
configure:5395: test -z "$ac_cxx_werror_flag" || test ! -s conftest.err
configure:5398: $? = 0
configure:5405: test -s conftest
configure:5408: $? = 0
configure:5431: result: yes
configure:5571: checking whether g++ supports -Wmissing-format-attribute
configure:5611: rm -rf SunWS_cache; g++ -o conftest -ansi -D_XOPEN_SOURCE=500 -D_BSD_SOURCE -Wcast-align -Wconversion -Wchar-subscripts -Wall -W -Wpointer-arith -fno-builtin -g3 -fno-inline   -Wmissing-format-attribute   conftest.cpp  1>&5
configure:5617: $? = 0
configure:5624: test -z "$ac_cxx_werror_flag" || test ! -s conftest.err
configure:5627: $? = 0
configure:5634: test -s conftest
configure:5637: $? = 0
configure:5660: result: yes
configure:5672: checking whether gcc supports -Wmissing-format-attribute
configure:5709: gcc -o conftest -std=iso9899:1990 -W -Wall -Wchar-subscripts -Wshadow -Wpointer-arith -Wmissing-prototypes -Wwrite-strings -D_XOPEN_SOURCE=500 -D_BSD_SOURCE -g3 -fno-inline   -Wmissing-format-attribute   conftest.c  >&5
configure:5715: $? = 0
configure:5722: test -z "$ac_c_werror_flag" || test ! -s conftest.err
configure:5725: $? = 0
configure:5732: test -s conftest
configure:5735: $? = 0
configure:5758: result: yes
configure:5772: checking whether g++ supports -Wundef
configure:5812: rm -rf SunWS_cache; g++ -o conftest -ansi -D_XOPEN_SOURCE=500 -D_BSD_SOURCE -Wcast-align -Wconversion -Wchar-subscripts -Wall -W -Wpointer-arith -fno-builtin -g3 -fno-inline   -Wformat-security -Wmissing-format-attribute -Wundef   conftest.cpp  1>&5
configure:5818: $? = 0
configure:5825: test -z "$ac_cxx_werror_flag" || test ! -s conftest.err
configure:5828: $? = 0
configure:5835: test -s conftest
configure:5838: $? = 0
configure:5861: result: yes
configure:5873: checking whether g++ supports -Wno-long-long
configure:5913: rm -rf SunWS_cache; g++ -o conftest -Wundef -ansi -D_XOPEN_SOURCE=500 -D_BSD_SOURCE -Wcast-align -Wconversion -Wchar-subscripts -Wall -W -Wpointer-arith -fno-builtin -g3 -fno-inline   -Wformat-security -Wmissing-format-attribute -Wno-long-long   conftest.cpp  1>&5
configure:5919: $? = 0
configure:5926: test -z "$ac_cxx_werror_flag" || test ! -s conftest.err
configure:5929: $? = 0
configure:5936: test -s conftest
configure:5939: $? = 0
configure:5962: result: yes
configure:5974: checking whether g++ supports -Wno-non-virtual-dtor
configure:6014: rm -rf SunWS_cache; g++ -o conftest -Wno-long-long -Wundef -ansi -D_XOPEN_SOURCE=500 -D_BSD_SOURCE -Wcast-align -Wconversion -Wchar-subscripts -Wall -W -Wpointer-arith -fno-builtin -g3 -fno-inline   -Wformat-security -Wmissing-format-attribute -Wno-non-virtual-dtor   conftest.cpp  1>&5
configure:6020: $? = 0
configure:6027: test -z "$ac_cxx_werror_flag" || test ! -s conftest.err
configure:6030: $? = 0
configure:6037: test -s conftest
configure:6040: $? = 0
configure:6063: result: yes
configure:6095: checking whether g++ supports -fno-reorder-blocks
configure:6135: rm -rf SunWS_cache; g++ -o conftest -Wno-long-long -Wundef -ansi -D_XOPEN_SOURCE=500 -D_BSD_SOURCE -Wcast-align -Wconversion -Wchar-subscripts -Wall -W -Wpointer-arith -fno-builtin -g3 -fno-inline   -Wformat-security -Wmissing-format-attribute -Wno-non-virtual-dtor -fno-reorder-blocks   conftest.cpp  1>&5
configure:6141: $? = 0
configure:6148: test -z "$ac_cxx_werror_flag" || test ! -s conftest.err
configure:6151: $? = 0
configure:6158: test -s conftest
configure:6161: $? = 0
configure:6184: result: yes
configure:6202: checking whether g++ supports -fno-exceptions
configure:6242: rm -rf SunWS_cache; g++ -o conftest -Wno-long-long -Wundef -ansi -D_XOPEN_SOURCE=500 -D_BSD_SOURCE -Wcast-align -Wconversion -Wchar-subscripts -Wall -W -Wpointer-arith -fno-builtin -g3 -fno-inline   -Wformat-security -Wmissing-format-attribute -Wno-non-virtual-dtor -fno-exceptions   conftest.cpp  1>&5
configure:6248: $? = 0
configure:6255: test -z "$ac_cxx_werror_flag" || test ! -s conftest.err
configure:6258: $? = 0
configure:6265: test -s conftest
configure:6268: $? = 0
configure:6291: result: yes
configure:6303: checking whether g++ supports -fno-check-new
configure:6343: rm -rf SunWS_cache; g++ -o conftest -Wno-long-long -Wundef -ansi -D_XOPEN_SOURCE=500 -D_BSD_SOURCE -Wcast-align -Wconversion -Wchar-subscripts -Wall -W -Wpointer-arith -fno-builtin -g3 -fno-inline   -Wformat-security -Wmissing-format-attribute -Wno-non-virtual-dtor -fno-exceptions -fno-check-new   conftest.cpp  1>&5
configure:6349: $? = 0
configure:6356: test -z "$ac_cxx_werror_flag" || test ! -s conftest.err
configure:6359: $? = 0
configure:6366: test -s conftest
configure:6369: $? = 0
configure:6392: result: yes
configure:6404: checking whether g++ supports -fno-common
configure:6444: rm -rf SunWS_cache; g++ -o conftest -Wno-long-long -Wundef -ansi -D_XOPEN_SOURCE=500 -D_BSD_SOURCE -Wcast-align -Wconversion -Wchar-subscripts -Wall -W -Wpointer-arith -fno-builtin -g3 -fno-inline   -Wformat-security -Wmissing-format-attribute -Wno-non-virtual-dtor -fno-exceptions -fno-check-new -fno-common   conftest.cpp  1>&5
configure:6450: $? = 0
configure:6457: test -z "$ac_cxx_werror_flag" || test ! -s conftest.err
configure:6460: $? = 0
configure:6467: test -s conftest
configure:6470: $? = 0
configure:6493: result: yes
configure:6505: checking whether g++ supports -fexceptions
configure:6545: rm -rf SunWS_cache; g++ -o conftest -Wno-long-long -Wundef -ansi -D_XOPEN_SOURCE=500 -D_BSD_SOURCE -Wcast-align -Wconversion -Wchar-subscripts -Wall -W -Wpointer-arith -fno-builtin -g3 -fno-inline   -Wformat-security -Wmissing-format-attribute -Wno-non-virtual-dtor -fno-exceptions -fno-check-new -fno-common -fexceptions   conftest.cpp  1>&5
configure:6551: $? = 0
configure:6558: test -z "$ac_cxx_werror_flag" || test ! -s conftest.err
configure:6561: $? = 0
configure:6568: test -s conftest
configure:6571: $? = 0
configure:6594: result: yes
configure:6637: checking whether system headers can cope with -O2 -fno-inline
configure:6719: result: irrelevant
configure:7453: checking how to run the C++ preprocessor
configure:7489: g++ -E  conftest.cpp
configure:7495: $? = 0
configure:7533: g++ -E  conftest.cpp
conftest.cpp:10:28: error: ac_nonexistent.h: No such file or directory
configure:7539: $? = 1
configure: failed program was:
| /* confdefs.h.  */
| #define PACKAGE_NAME ""
| #define PACKAGE_TARNAME ""
| #define PACKAGE_VERSION ""
| #define PACKAGE_STRING ""
| #define PACKAGE_BUGREPORT ""
| #define PACKAGE "amarok-svn"
| #define VERSION "3.5.5"
| /* end confdefs.h.  */
| #include <ac_nonexistent.h>
configure:7579: result: g++ -E
configure:7608: g++ -E  conftest.cpp
configure:7614: $? = 0
configure:7652: g++ -E  conftest.cpp
conftest.cpp:10:28: error: ac_nonexistent.h: No such file or directory
configure:7658: $? = 1
configure: failed program was:
| /* confdefs.h.  */
| #define PACKAGE_NAME ""
| #define PACKAGE_TARNAME ""
| #define PACKAGE_VERSION ""
| #define PACKAGE_STRING ""
| #define PACKAGE_BUGREPORT ""
| #define PACKAGE "amarok-svn"
| #define VERSION "3.5.5"
| /* end confdefs.h.  */
| #include <ac_nonexistent.h>
configure:7707: checking whether g++ supports -O0
configure:7747: rm -rf SunWS_cache; g++ -o conftest -Wno-long-long -Wundef -ansi -D_XOPEN_SOURCE=500 -D_BSD_SOURCE -Wcast-align -Wconversion -Wchar-subscripts -Wall -W -Wpointer-arith -fno-builtin -g3 -fno-inline -Wformat-security -Wmissing-format-attribute -Wno-non-virtual-dtor -fno-exceptions -fno-check-new -fno-common -O0   conftest.cpp  1>&5
configure:7753: $? = 0
configure:7760: test -z "$ac_cxx_werror_flag" || test ! -s conftest.err
configure:7763: $? = 0
configure:7770: test -s conftest
configure:7773: $? = 0
configure:7796: result: yes
configure:8093: checking whether g++ supports -Wl,--no-undefined
configure:8133: rm -rf SunWS_cache; g++ -o conftest -Wno-long-long -Wundef -ansi -D_XOPEN_SOURCE=500 -D_BSD_SOURCE -Wcast-align -Wconversion -Wchar-subscripts -Wall -W -Wpointer-arith -fno-builtin -g3 -fno-inline -Wformat-security -Wmissing-format-attribute -Wno-non-virtual-dtor -fno-exceptions -fno-check-new -fno-common -Wl,--no-undefined   conftest.cpp  1>&5
configure:8139: $? = 0
configure:8146: test -z "$ac_cxx_werror_flag" || test ! -s conftest.err
configure:8149: $? = 0
configure:8156: test -s conftest
configure:8159: $? = 0
configure:8182: result: yes
configure:8186: checking whether g++ supports -Wl,--allow-shlib-undefined
configure:8226: rm -rf SunWS_cache; g++ -o conftest -Wno-long-long -Wundef -ansi -D_XOPEN_SOURCE=500 -D_BSD_SOURCE -Wcast-align -Wconversion -Wchar-subscripts -Wall -W -Wpointer-arith -fno-builtin -g3 -fno-inline -Wformat-security -Wmissing-format-attribute -Wno-non-virtual-dtor -fno-exceptions -fno-check-new -fno-common -Wl,--allow-shlib-undefined   conftest.cpp  1>&5
configure:8232: $? = 0
configure:8239: test -z "$ac_cxx_werror_flag" || test ! -s conftest.err
configure:8242: $? = 0
configure:8249: test -s conftest
configure:8252: $? = 0
configure:8275: result: yes
configure:8400: result: not using lib directory suffix
configure:8445: checking for a sed that does not truncate output
configure:8499: result: /usr/bin/sed
configure:8502: checking for grep that handles long lines and -e
configure:8576: result: /usr/bin/grep
configure:8581: checking for egrep
configure:8659: result: /usr/bin/grep -E
configure:8675: checking for ld used by gcc
configure:8742: result: /usr/i586-suse-linux/bin/ld
configure:8751: checking if the linker (/usr/i586-suse-linux/bin/ld) is GNU ld
configure:8766: result: yes
configure:8771: checking for /usr/i586-suse-linux/bin/ld option to reload object files
configure:8778: result: -r
configure:8787: checking for BSD-compatible nm
configure:8829: result: /usr/bin/nm -B
configure:8833: checking whether ln -s works
configure:8837: result: yes
configure:8844: checking how to recognise dependent libraries
configure:9051: result: pass_all
configure:9273: checking for ANSI C header files
configure:9303: gcc -c -std=iso9899:1990 -W -Wall -Wchar-subscripts -Wshadow -Wpointer-arith -Wmissing-prototypes -Wwrite-strings -D_XOPEN_SOURCE=500 -D_BSD_SOURCE -g3 -fno-inline   -Wformat-security -Wmissing-format-attribute  conftest.c >&5
configure:9309: $? = 0
configure:9316: test -z "$ac_c_werror_flag" || test ! -s conftest.err
configure:9319: $? = 0
configure:9326: test -s conftest.o
configure:9329: $? = 0
configure:9425: gcc -o conftest -std=iso9899:1990 -W -Wall -Wchar-subscripts -Wshadow -Wpointer-arith -Wmissing-prototypes -Wwrite-strings -D_XOPEN_SOURCE=500 -D_BSD_SOURCE -g3 -fno-inline   -Wformat-security -Wmissing-format-attribute   conftest.c  >&5
configure:9428: $? = 0
configure:9434: ./conftest
configure:9437: $? = 0
configure:9454: result: yes
configure:9478: checking for sys/types.h
configure:9499: gcc -c -std=iso9899:1990 -W -Wall -Wchar-subscripts -Wshadow -Wpointer-arith -Wmissing-prototypes -Wwrite-strings -D_XOPEN_SOURCE=500 -D_BSD_SOURCE -g3 -fno-inline   -Wformat-security -Wmissing-format-attribute  conftest.c >&5
configure:9505: $? = 0
configure:9512: test -z "$ac_c_werror_flag" || test ! -s conftest.err
configure:9515: $? = 0
configure:9522: test -s conftest.o
configure:9525: $? = 0
configure:9538: result: yes
configure:9478: checking for sys/stat.h
configure:9499: gcc -c -std=iso9899:1990 -W -Wall -Wchar-subscripts -Wshadow -Wpointer-arith -Wmissing-prototypes -Wwrite-strings -D_XOPEN_SOURCE=500 -D_BSD_SOURCE -g3 -fno-inline   -Wformat-security -Wmissing-format-attribute  conftest.c >&5
configure:9505: $? = 0
configure:9512: test -z "$ac_c_werror_flag" || test ! -s conftest.err
configure:9515: $? = 0
configure:9522: test -s conftest.o
configure:9525: $? = 0
configure:9538: result: yes
configure:9478: checking for stdlib.h
configure:9499: gcc -c -std=iso9899:1990 -W -Wall -Wchar-subscripts -Wshadow -Wpointer-arith -Wmissing-prototypes -Wwrite-strings -D_XOPEN_SOURCE=500 -D_BSD_SOURCE -g3 -fno-inline   -Wformat-security -Wmissing-format-attribute  conftest.c >&5
configure:9505: $? = 0
configure:9512: test -z "$ac_c_werror_flag" || test ! -s conftest.err
configure:9515: $? = 0
configure:9522: test -s conftest.o
configure:9525: $? = 0
configure:9538: result: yes
configure:9478: checking for string.h
configure:9499: gcc -c -std=iso9899:1990 -W -Wall -Wchar-subscripts -Wshadow -Wpointer-arith -Wmissing-prototypes -Wwrite-strings -D_XOPEN_SOURCE=500 -D_BSD_SOURCE -g3 -fno-inline   -Wformat-security -Wmissing-format-attribute  conftest.c >&5
configure:9505: $? = 0
configure:9512: test -z "$ac_c_werror_flag" || test ! -s conftest.err
configure:9515: $? = 0
configure:9522: test -s conftest.o
configure:9525: $? = 0
configure:9538: result: yes
configure:9478: checking for memory.h
configure:9499: gcc -c -std=iso9899:1990 -W -Wall -Wchar-subscripts -Wshadow -Wpointer-arith -Wmissing-prototypes -Wwrite-strings -D_XOPEN_SOURCE=500 -D_BSD_SOURCE -g3 -fno-inline   -Wformat-security -Wmissing-format-attribute  conftest.c >&5
configure:9505: $? = 0
configure:9512: test -z "$ac_c_werror_flag" || test ! -s conftest.err
configure:9515: $? = 0
configure:9522: test -s conftest.o
configure:9525: $? = 0
configure:9538: result: yes
configure:9478: checking for strings.h
configure:9499: gcc -c -std=iso9899:1990 -W -Wall -Wchar-subscripts -Wshadow -Wpointer-arith -Wmissing-prototypes -Wwrite-strings -D_XOPEN_SOURCE=500 -D_BSD_SOURCE -g3 -fno-inline   -Wformat-security -Wmissing-format-attribute  conftest.c >&5
configure:9505: $? = 0
configure:9512: test -z "$ac_c_werror_flag" || test ! -s conftest.err
configure:9515: $? = 0
configure:9522: test -s conftest.o
configure:9525: $? = 0
configure:9538: result: yes
configure:9478: checking for inttypes.h
configure:9499: gcc -c -std=iso9899:1990 -W -Wall -Wchar-subscripts -Wshadow -Wpointer-arith -Wmissing-prototypes -Wwrite-strings -D_XOPEN_SOURCE=500 -D_BSD_SOURCE -g3 -fno-inline   -Wformat-security -Wmissing-format-attribute  conftest.c >&5
configure:9505: $? = 0
configure:9512: test -z "$ac_c_werror_flag" || test ! -s conftest.err
configure:9515: $? = 0
configure:9522: test -s conftest.o
configure:9525: $? = 0
configure:9538: result: yes
configure:9478: checking for stdint.h
configure:9499: gcc -c -std=iso9899:1990 -W -Wall -Wchar-subscripts -Wshadow -Wpointer-arith -Wmissing-prototypes -Wwrite-strings -D_XOPEN_SOURCE=500 -D_BSD_SOURCE -g3 -fno-inline   -Wformat-security -Wmissing-format-attribute  conftest.c >&5
configure:9505: $? = 0
configure:9512: test -z "$ac_c_werror_flag" || test ! -s conftest.err
configure:9515: $? = 0
configure:9522: test -s conftest.o
configure:9525: $? = 0
configure:9538: result: yes
configure:9478: checking for unistd.h
configure:9499: gcc -c -std=iso9899:1990 -W -Wall -Wchar-subscripts -Wshadow -Wpointer-arith -Wmissing-prototypes -Wwrite-strings -D_XOPEN_SOURCE=500 -D_BSD_SOURCE -g3 -fno-inline   -Wformat-security -Wmissing-format-attribute  conftest.c >&5
configure:9505: $? = 0
configure:9512: test -z "$ac_c_werror_flag" || test ! -s conftest.err
configure:9515: $? = 0
configure:9522: test -s conftest.o
configure:9525: $? = 0
configure:9538: result: yes
configure:9565: checking dlfcn.h usability
configure:9582: gcc -c -std=iso9899:1990 -W -Wall -Wchar-subscripts -Wshadow -Wpointer-arith -Wmissing-prototypes -Wwrite-strings -D_XOPEN_SOURCE=500 -D_BSD_SOURCE -g3 -fno-inline   -Wformat-security -Wmissing-format-attribute  conftest.c >&5
configure:9588: $? = 0
configure:9595: test -z "$ac_c_werror_flag" || test ! -s conftest.err
configure:9598: $? = 0
configure:9605: test -s conftest.o
configure:9608: $? = 0
configure:9619: result: yes
configure:9623: checking dlfcn.h presence
configure:9638: gcc -E  conftest.c
configure:9644: $? = 0
configure:9665: result: yes
configure:9693: checking for dlfcn.h
configure:9701: result: yes
configure:9767: checking for g77
configure:9797: result: no
configure:9767: checking for f77
configure:9797: result: no
configure:9767: checking for xlf
configure:9797: result: no
configure:9767: checking for frt
configure:9797: result: no
configure:9767: checking for pgf77
configure:9797: result: no
configure:9767: checking for cf77
configure:9797: result: no
configure:9767: checking for fort77
configure:9797: result: no
configure:9767: checking for fl32
configure:9797: result: no
configure:9767: checking for af77
configure:9797: result: no
configure:9767: checking for f90
configure:9797: result: no
configure:9767: checking for xlf90
configure:9797: result: no
configure:9767: checking for pgf90
configure:9797: result: no
configure:9767: checking for pghpf
configure:9797: result: no
configure:9767: checking for epcf90
configure:9797: result: no
configure:9767: checking for gfortran
configure:9797: result: no
configure:9767: checking for g95
configure:9797: result: no
configure:9767: checking for f95
configure:9797: result: no
configure:9767: checking for fort
configure:9797: result: no
configure:9767: checking for xlf95
configure:9797: result: no
configure:9767: checking for ifort
configure:9797: result: no
configure:9767: checking for ifc
configure:9797: result: no
configure:9767: checking for efc
configure:9797: result: no
configure:9767: checking for pgf95
configure:9797: result: no
configure:9767: checking for lf95
configure:9797: result: no
configure:9767: checking for ftn
configure:9797: result: no
configure:9824: checking for Fortran 77 compiler version
configure:9831:  --version >&5
./configure: line 9832: --version: command not found
configure:9834: $? = 127
configure:9841:  -v >&5
./configure: line 9842: -v: command not found
configure:9844: $? = 127
configure:9851:  -V >&5
./configure: line 9852: -V: command not found
configure:9854: $? = 127
configure:9862: checking whether we are using the GNU Fortran 77 compiler
configure:9881:  -c  conftest.F >&5
./configure: line 9882: -c: command not found
configure:9887: $? = 127
configure: failed program was:
|       program main
| #ifndef __GNUC__
|        choke me
| #endif
| 
|       end
configure:9921: result: no
configure:9927: checking whether  accepts -g
configure:9944:  -c -g conftest.f >&5
./configure: line 9945: -c: command not found
configure:9950: $? = 127
configure: failed program was:
|       program main
| 
|       end
configure:9983: result: no
configure:10013: checking the maximum length of command line arguments
configure:10072: result: 32768
configure:10083: checking command to parse /usr/bin/nm -B output from gcc object
configure:10172: gcc -c -std=iso9899:1990 -W -Wall -Wchar-subscripts -Wshadow -Wpointer-arith -Wmissing-prototypes -Wwrite-strings -D_XOPEN_SOURCE=500 -D_BSD_SOURCE -g3 -fno-inline   -Wformat-security -Wmissing-format-attribute  conftest.c >&5
conftest.c:5: warning: no previous prototype for 'nm_test_func'
configure:10175: $? = 0
configure:10179: /usr/bin/nm -B conftest.o \| sed -n -e 's/^.*[ 	]\([ABCDGISTW][ABCDGISTW]*\)[ 	][ 	]*\(\)\([_A-Za-z][_A-Za-z0-9]*\)$/\1 \2\3 \3/p' \> conftest.nm
configure:10182: $? = 0
configure:10234: gcc -o conftest -std=iso9899:1990 -W -Wall -Wchar-subscripts -Wshadow -Wpointer-arith -Wmissing-prototypes -Wwrite-strings -D_XOPEN_SOURCE=500 -D_BSD_SOURCE -g3 -fno-inline   -Wformat-security -Wmissing-format-attribute   conftest.c conftstm.o >&5
configure:10237: $? = 0
configure:10275: result: ok
configure:10279: checking for objdir
configure:10294: result: .libs
configure:10386: checking for ar
configure:10402: found /usr/bin/ar
configure:10413: result: ar
configure:10482: checking for ranlib
configure:10498: found /usr/bin/ranlib
configure:10509: result: ranlib
configure:10578: checking for strip
configure:10594: found /usr/bin/strip
configure:10605: result: strip
configure:10881: checking if gcc static flag  works
configure:10904: result: yes
configure:10926: checking if gcc supports -fno-rtti -fno-exceptions
configure:10944: gcc -c -std=iso9899:1990 -W -Wall -Wchar-subscripts -Wshadow -Wpointer-arith -Wmissing-prototypes -Wwrite-strings -D_XOPEN_SOURCE=500 -D_BSD_SOURCE -g3 -fno-inline   -Wformat-security -Wmissing-format-attribute  -fno-rtti -fno-exceptions conftest.c >&5
cc1: warning: command line option "-fno-rtti" is valid for C++/ObjC++ but not for C
configure:10948: $? = 0
configure:10959: result: no
configure:10974: checking for gcc option to produce PIC
configure:11151: result: -fPIC
configure:11159: checking if gcc PIC flag -fPIC works
configure:11177: gcc -c -std=iso9899:1990 -W -Wall -Wchar-subscripts -Wshadow -Wpointer-arith -Wmissing-prototypes -Wwrite-strings -D_XOPEN_SOURCE=500 -D_BSD_SOURCE -g3 -fno-inline   -Wformat-security -Wmissing-format-attribute  -fPIC -DPIC conftest.c >&5
configure:11181: $? = 0
configure:11192: result: yes
configure:11216: checking if gcc supports -c -o file.o
configure:11244: gcc -c -std=iso9899:1990 -W -Wall -Wchar-subscripts -Wshadow -Wpointer-arith -Wmissing-prototypes -Wwrite-strings -D_XOPEN_SOURCE=500 -D_BSD_SOURCE -g3 -fno-inline   -Wformat-security -Wmissing-format-attribute  -o out/conftest2.o conftest.c >&5
configure:11248: $? = 0
configure:11265: result: yes
configure:11291: checking whether the gcc linker (/usr/i586-suse-linux/bin/ld) supports shared libraries
configure:12131: result: yes
configure:12157: checking whether -lc should be explicitly linked in
configure:12162: gcc -c -std=iso9899:1990 -W -Wall -Wchar-subscripts -Wshadow -Wpointer-arith -Wmissing-prototypes -Wwrite-strings -D_XOPEN_SOURCE=500 -D_BSD_SOURCE -g3 -fno-inline   -Wformat-security -Wmissing-format-attribute  conftest.c >&5
configure:12165: $? = 0
configure:12179: gcc -shared -v conftest.o  -Wl,-soname -Wl,conftest -o conftest 2\>\&1 \| grep  -lc  \>/dev/null 2\>\&1
configure:12182: $? = 0
configure:12194: result: no
configure:12202: checking dynamic linker characteristics
configure:12720: result: GNU/Linux ld.so
configure:12724: checking how to hardcode library paths into programs
configure:12749: result: immediate
configure:12763: checking whether stripping libraries is possible
configure:12768: result: yes
configure:12907: checking for shl_load
configure:12963: gcc -o conftest -std=iso9899:1990 -W -Wall -Wchar-subscripts -Wshadow -Wpointer-arith -Wmissing-prototypes -Wwrite-strings -D_XOPEN_SOURCE=500 -D_BSD_SOURCE -g3 -fno-inline   -Wformat-security -Wmissing-format-attribute   conftest.c  >&5
/tmp/cc4odV5f.o: In function `main':
/home/flo/.kde/share/apps/amarok/amarok-svn/conftest.c:56: undefined reference to `shl_load'
collect2: ld returned 1 exit status
configure:12969: $? = 1
configure: failed program was:
| /* confdefs.h.  */
| #define PACKAGE_NAME ""
| #define PACKAGE_TARNAME ""
| #define PACKAGE_VERSION ""
| #define PACKAGE_STRING ""
| #define PACKAGE_BUGREPORT ""
| #define PACKAGE "amarok-svn"
| #define VERSION "3.5.5"
| #define KDELIBSUFF ""
| #define STDC_HEADERS 1
| #define HAVE_SYS_TYPES_H 1
| #define HAVE_SYS_STAT_H 1
| #define HAVE_STDLIB_H 1
| #define HAVE_STRING_H 1
| #define HAVE_MEMORY_H 1
| #define HAVE_STRINGS_H 1
| #define HAVE_INTTYPES_H 1
| #define HAVE_STDINT_H 1
| #define HAVE_UNISTD_H 1
| #define HAVE_DLFCN_H 1
| /* end confdefs.h.  */
| /* Define shl_load to an innocuous variant, in case <limits.h> declares shl_load.
|    For example, HP-UX 11i <limits.h> declares gettimeofday.  */
| #define shl_load innocuous_shl_load
| 
| /* System header to define __stub macros and hopefully few prototypes,
|     which can conflict with char shl_load (); below.
|     Prefer <limits.h> to <assert.h> if __STDC__ is defined, since
|     <limits.h> exists even on freestanding compilers.  */
| 
| #ifdef __STDC__
| # include <limits.h>
| #else
| # include <assert.h>
| #endif
| 
| #undef shl_load
| 
| /* Override any GCC internal prototype to avoid an error.
|    Use char because int might match the return type of a GCC
|    builtin and then its argument prototype would still apply.  */
| #ifdef __cplusplus
| extern "C"
| #endif
| char shl_load ();
| /* The GNU C library defines this for functions which it implements
|     to always fail with ENOSYS.  Some functions are actually named
|     something starting with __ and the normal name is an alias.  */
| #if defined __stub_shl_load || defined __stub___shl_load
| choke me
| #endif
| 
| int
| main ()
| {
| return shl_load ();
|   ;
|   return 0;
| }
configure:13002: result: no
configure:13007: checking for shl_load in -ldld
configure:13042: gcc -o conftest -std=iso9899:1990 -W -Wall -Wchar-subscripts -Wshadow -Wpointer-arith -Wmissing-prototypes -Wwrite-strings -D_XOPEN_SOURCE=500 -D_BSD_SOURCE -g3 -fno-inline   -Wformat-security -Wmissing-format-attribute   conftest.c -ldld   >&5
/usr/lib/gcc/i586-suse-linux/4.1.2/../../../../i586-suse-linux/bin/ld: cannot find -ldld
collect2: ld returned 1 exit status
configure:13048: $? = 1
configure: failed program was:
| /* confdefs.h.  */
| #define PACKAGE_NAME ""
| #define PACKAGE_TARNAME ""
| #define PACKAGE_VERSION ""
| #define PACKAGE_STRING ""
| #define PACKAGE_BUGREPORT ""
| #define PACKAGE "amarok-svn"
| #define VERSION "3.5.5"
| #define KDELIBSUFF ""
| #define STDC_HEADERS 1
| #define HAVE_SYS_TYPES_H 1
| #define HAVE_SYS_STAT_H 1
| #define HAVE_STDLIB_H 1
| #define HAVE_STRING_H 1
| #define HAVE_MEMORY_H 1
| #define HAVE_STRINGS_H 1
| #define HAVE_INTTYPES_H 1
| #define HAVE_STDINT_H 1
| #define HAVE_UNISTD_H 1
| #define HAVE_DLFCN_H 1
| /* end confdefs.h.  */
| 
| /* Override any GCC internal prototype to avoid an error.
|    Use char because int might match the return type of a GCC
|    builtin and then its argument prototype would still apply.  */
| #ifdef __cplusplus
| extern "C"
| #endif
| char shl_load ();
| int
| main ()
| {
| return shl_load ();
|   ;
|   return 0;
| }
configure:13082: result: no
configure:13087: checking for dlopen
configure:13143: gcc -o conftest -std=iso9899:1990 -W -Wall -Wchar-subscripts -Wshadow -Wpointer-arith -Wmissing-prototypes -Wwrite-strings -D_XOPEN_SOURCE=500 -D_BSD_SOURCE -g3 -fno-inline   -Wformat-security -Wmissing-format-attribute   conftest.c  >&5
/tmp/cciPd8C6.o: In function `main':
/home/flo/.kde/share/apps/amarok/amarok-svn/conftest.c:56: undefined reference to `dlopen'
collect2: ld returned 1 exit status
configure:13149: $? = 1
configure: failed program was:
| /* confdefs.h.  */
| #define PACKAGE_NAME ""
| #define PACKAGE_TARNAME ""
| #define PACKAGE_VERSION ""
| #define PACKAGE_STRING ""
| #define PACKAGE_BUGREPORT ""
| #define PACKAGE "amarok-svn"
| #define VERSION "3.5.5"
| #define KDELIBSUFF ""
| #define STDC_HEADERS 1
| #define HAVE_SYS_TYPES_H 1
| #define HAVE_SYS_STAT_H 1
| #define HAVE_STDLIB_H 1
| #define HAVE_STRING_H 1
| #define HAVE_MEMORY_H 1
| #define HAVE_STRINGS_H 1
| #define HAVE_INTTYPES_H 1
| #define HAVE_STDINT_H 1
| #define HAVE_UNISTD_H 1
| #define HAVE_DLFCN_H 1
| /* end confdefs.h.  */
| /* Define dlopen to an innocuous variant, in case <limits.h> declares dlopen.
|    For example, HP-UX 11i <limits.h> declares gettimeofday.  */
| #define dlopen innocuous_dlopen
| 
| /* System header to define __stub macros and hopefully few prototypes,
|     which can conflict with char dlopen (); below.
|     Prefer <limits.h> to <assert.h> if __STDC__ is defined, since
|     <limits.h> exists even on freestanding compilers.  */
| 
| #ifdef __STDC__
| # include <limits.h>
| #else
| # include <assert.h>
| #endif
| 
| #undef dlopen
| 
| /* Override any GCC internal prototype to avoid an error.
|    Use char because int might match the return type of a GCC
|    builtin and then its argument prototype would still apply.  */
| #ifdef __cplusplus
| extern "C"
| #endif
| char dlopen ();
| /* The GNU C library defines this for functions which it implements
|     to always fail with ENOSYS.  Some functions are actually named
|     something starting with __ and the normal name is an alias.  */
| #if defined __stub_dlopen || defined __stub___dlopen
| choke me
| #endif
| 
| int
| main ()
| {
| return dlopen ();
|   ;
|   return 0;
| }
configure:13182: result: no
configure:13187: checking for dlopen in -ldl
configure:13222: gcc -o conftest -std=iso9899:1990 -W -Wall -Wchar-subscripts -Wshadow -Wpointer-arith -Wmissing-prototypes -Wwrite-strings -D_XOPEN_SOURCE=500 -D_BSD_SOURCE -g3 -fno-inline   -Wformat-security -Wmissing-format-attribute   conftest.c -ldl   >&5
configure:13228: $? = 0
configure:13235: test -z "$ac_c_werror_flag" || test ! -s conftest.err
configure:13238: $? = 0
configure:13245: test -s conftest
configure:13248: $? = 0
configure:13262: result: yes
configure:13463: checking whether a program can dlopen itself
configure:13535: gcc -o conftest -std=iso9899:1990 -W -Wall -Wchar-subscripts -Wshadow -Wpointer-arith -Wmissing-prototypes -Wwrite-strings -D_XOPEN_SOURCE=500 -D_BSD_SOURCE -g3 -fno-inline   -Wformat-security -Wmissing-format-attribute  -DHAVE_DLFCN_H  -Wl,--export-dynamic conftest.c -ldl  >&5
configure:13518: warning: no previous prototype for 'fnord'
configure: In function 'fnord':
configure:13518: warning: unused variable 'i'
configure: In function 'main':
configure:13531: warning: implicit declaration of function 'exit'
configure:13531: warning: incompatible implicit declaration of built-in function 'exit'
configure:13538: $? = 0
configure:13556: result: yes
configure:13561: checking whether a statically linked program can dlopen itself
configure:13633: gcc -o conftest -std=iso9899:1990 -W -Wall -Wchar-subscripts -Wshadow -Wpointer-arith -Wmissing-prototypes -Wwrite-strings -D_XOPEN_SOURCE=500 -D_BSD_SOURCE -g3 -fno-inline   -Wformat-security -Wmissing-format-attribute  -DHAVE_DLFCN_H  -Wl,--export-dynamic  conftest.c -ldl  >&5
configure:13616: warning: no previous prototype for 'fnord'
configure: In function 'fnord':
configure:13616: warning: unused variable 'i'
configure: In function 'main':
configure:13629: warning: implicit declaration of function 'exit'
configure:13629: warning: incompatible implicit declaration of built-in function 'exit'
configure:13636: $? = 0
configure:13654: result: yes
configure:13677: checking if libtool supports shared libraries
configure:13679: result: yes
configure:13682: checking whether to build shared libraries
configure:13740: result: yes
configure:13743: checking whether to build static libraries
configure:13747: result: no
configure:13838: creating libtool
configure:14382: checking for ld used by g++
configure:14449: result: /usr/i586-suse-linux/bin/ld
configure:14458: checking if the linker (/usr/i586-suse-linux/bin/ld) is GNU ld
configure:14473: result: yes
configure:14524: checking whether the g++ linker (/usr/i586-suse-linux/bin/ld) supports shared libraries
configure:15366: result: yes
configure:15388: g++ -c -Wno-long-long -Wundef -ansi -D_XOPEN_SOURCE=500 -D_BSD_SOURCE -Wcast-align -Wconversion -Wchar-subscripts -Wall -W -Wpointer-arith -fno-builtin -g3 -fno-inline -Wformat-security -Wmissing-format-attribute -Wno-non-virtual-dtor -fno-exceptions -fno-check-new -fno-common  conftest.cc >&5
configure:15391: $? = 0
configure:15487: checking for g++ option to produce PIC
configure:15739: result: -fPIC
configure:15747: checking if g++ PIC flag -fPIC works
configure:15765: g++ -c -Wno-long-long -Wundef -ansi -D_XOPEN_SOURCE=500 -D_BSD_SOURCE -Wcast-align -Wconversion -Wchar-subscripts -Wall -W -Wpointer-arith -fno-builtin -g3 -fno-inline -Wformat-security -Wmissing-format-attribute -Wno-non-virtual-dtor -fno-exceptions -fno-check-new -fno-common  -fPIC -DPIC conftest.cc >&5
configure:15769: $? = 0
configure:15780: result: yes
configure:15804: checking if g++ supports -c -o file.o
configure:15832: g++ -c -Wno-long-long -Wundef -ansi -D_XOPEN_SOURCE=500 -D_BSD_SOURCE -Wcast-align -Wconversion -Wchar-subscripts -Wall -W -Wpointer-arith -fno-builtin -g3 -fno-inline -Wformat-security -Wmissing-format-attribute -Wno-non-virtual-dtor -fno-exceptions -fno-check-new -fno-common  -o out/conftest2.o conftest.cc >&5
configure:15836: $? = 0
configure:15853: result: yes
configure:15879: checking whether the g++ linker (/usr/i586-suse-linux/bin/ld) supports shared libraries
configure:15904: result: yes
configure:15975: checking dynamic linker characteristics
configure:16493: result: GNU/Linux ld.so
configure:16497: checking how to hardcode library paths into programs
configure:16522: result: immediate
configure:16536: checking whether stripping libraries is possible
configure:16541: result: yes
configure:16680: checking for shl_load
configure:16775: result: no
configure:16780: checking for shl_load in -ldld
configure:16855: result: no
configure:16860: checking for dlopen
configure:16955: result: no
configure:16960: checking for dlopen in -ldl
configure:17035: result: yes
configure:17236: checking whether a program can dlopen itself
configure:17329: result: yes
configure:17334: checking whether a statically linked program can dlopen itself
configure:17427: result: yes
configure:23900: checking for msgfmt
configure:23927: result: /usr/bin/msgfmt
configure:23936: checking for gmsgfmt
configure:23967: result: /usr/bin/msgfmt
configure:23987: checking for xgettext
configure:24014: result: /usr/bin/xgettext
configure:24133: checking if C++ programs can be compiled
configure:24167: g++ -c -Wno-long-long -Wundef -ansi -D_XOPEN_SOURCE=500 -D_BSD_SOURCE -Wcast-align -Wconversion -Wchar-subscripts -Wall -W -Wpointer-arith -fno-builtin -g3 -fno-inline -Wformat-security -Wmissing-format-attribute -Wno-non-virtual-dtor  -fno-check-new -fno-common  conftest.cpp >&5
/tmp/ccAID01P.s: Assembler messages:
/tmp/ccAID01P.s:6872: Error: unknown pseudo-op: `.weakref'
/tmp/ccAID01P.s:6873: Error: unknown pseudo-op: `.weakref'
/tmp/ccAID01P.s:6874: Error: unknown pseudo-op: `.weakref'
/tmp/ccAID01P.s:6875: Error: unknown pseudo-op: `.weakref'
/tmp/ccAID01P.s:6876: Error: unknown pseudo-op: `.weakref'
/tmp/ccAID01P.s:6877: Error: unknown pseudo-op: `.weakref'
/tmp/ccAID01P.s:6878: Error: unknown pseudo-op: `.weakref'
/tmp/ccAID01P.s:6879: Error: unknown pseudo-op: `.weakref'
/tmp/ccAID01P.s:6880: Error: unknown pseudo-op: `.weakref'
/tmp/ccAID01P.s:6881: Error: unknown pseudo-op: `.weakref'
/tmp/ccAID01P.s:6882: Error: unknown pseudo-op: `.weakref'
/tmp/ccAID01P.s:6883: Error: unknown pseudo-op: `.weakref'
/tmp/ccAID01P.s:6884: Error: unknown pseudo-op: `.weakref'
/tmp/ccAID01P.s:6885: Error: unknown pseudo-op: `.weakref'
configure:24173: $? = 1
configure: failed program was:
| /* confdefs.h.  */
| #define PACKAGE_NAME ""
| #define PACKAGE_TARNAME ""
| #define PACKAGE_VERSION ""
| #define PACKAGE_STRING ""
| #define PACKAGE_BUGREPORT ""
| #define PACKAGE "amarok-svn"
| #define VERSION "3.5.5"
| #define KDELIBSUFF ""
| #define STDC_HEADERS 1
| #define HAVE_SYS_TYPES_H 1
| #define HAVE_SYS_STAT_H 1
| #define HAVE_STDLIB_H 1
| #define HAVE_STRING_H 1
| #define HAVE_MEMORY_H 1
| #define HAVE_STRINGS_H 1
| #define HAVE_INTTYPES_H 1
| #define HAVE_STDINT_H 1
| #define HAVE_UNISTD_H 1
| #define HAVE_DLFCN_H 1
| /* end confdefs.h.  */
| 
| #include <string>
| using namespace std;
| 
| int
| main ()
| {
| 
|   string astring="Hallo Welt.";
|   astring.erase(0, 6); // now astring is "Welt"
|   return 0;
| 
|   ;
|   return 0;
| }
configure:24208: result: no
configure:24221: error: Your Installation isn't able to compile simple C++ programs.
Check config.log for details - if you're using a Linux distribution you might miss
a package named similar to libstdc++-dev.

## ---------------- ##
## Cache variables. ##
## ---------------- ##

ac_cv_build=i686-pc-linux-gnu
ac_cv_c_compiler_gnu=yes
ac_cv_cxx_compiler_gnu=yes
ac_cv_env_CCC_set=
ac_cv_env_CCC_value=
ac_cv_env_CC_set=
ac_cv_env_CC_value=
ac_cv_env_CFLAGS_set=
ac_cv_env_CFLAGS_value=
ac_cv_env_CPPFLAGS_set=
ac_cv_env_CPPFLAGS_value=
ac_cv_env_CPP_set=
ac_cv_env_CPP_value=
ac_cv_env_CXXCPP_set=
ac_cv_env_CXXCPP_value=
ac_cv_env_CXXFLAGS_set=
ac_cv_env_CXXFLAGS_value=
ac_cv_env_CXX_set=
ac_cv_env_CXX_value=
ac_cv_env_F77_set=
ac_cv_env_F77_value=
ac_cv_env_FFLAGS_set=
ac_cv_env_FFLAGS_value=
ac_cv_env_LDFLAGS_set=
ac_cv_env_LDFLAGS_value=
ac_cv_env_PKGCONFIGFOUND_set=
ac_cv_env_PKGCONFIGFOUND_value=
ac_cv_env_XMKMF_set=
ac_cv_env_XMKMF_value=
ac_cv_env_build_alias_set=
ac_cv_env_build_alias_value=
ac_cv_env_host_alias_set=
ac_cv_env_host_alias_value=
ac_cv_env_target_alias_set=
ac_cv_env_target_alias_value=
ac_cv_f77_compiler_gnu=no
ac_cv_func_dlopen=no
ac_cv_func_shl_load=no
ac_cv_header_dlfcn_h=yes
ac_cv_header_inttypes_h=yes
ac_cv_header_memory_h=yes
ac_cv_header_stdc=yes
ac_cv_header_stdint_h=yes
ac_cv_header_stdlib_h=yes
ac_cv_header_string_h=yes
ac_cv_header_strings_h=yes
ac_cv_header_sys_stat_h=yes
ac_cv_header_sys_types_h=yes
ac_cv_header_unistd_h=yes
ac_cv_host=i686-pc-linux-gnu
ac_cv_lib_dl_dlopen=yes
ac_cv_lib_dld_shl_load=no
ac_cv_objext=o
ac_cv_path_EGREP='/usr/bin/grep -E'
ac_cv_path_GMSGFMT=/usr/bin/msgfmt
ac_cv_path_GREP=/usr/bin/grep
ac_cv_path_MSGFMT=/usr/bin/msgfmt
ac_cv_path_XGETTEXT=/usr/bin/xgettext
ac_cv_path_install='/usr/bin/install -c'
ac_cv_prog_AWK=gawk
ac_cv_prog_CPP='gcc -E'
ac_cv_prog_CXXCPP='g++ -E'
ac_cv_prog_ac_ct_AR=ar
ac_cv_prog_ac_ct_CC=gcc
ac_cv_prog_ac_ct_CXX=g++
ac_cv_prog_ac_ct_RANLIB=ranlib
ac_cv_prog_ac_ct_STRIP=strip
ac_cv_prog_cc_c89=
ac_cv_prog_cc_g=yes
ac_cv_prog_cxx_g=yes
ac_cv_prog_f77_g=no
ac_cv_prog_make_make_set=yes
ac_cv_target=i686-pc-linux-gnu
am_cv_CC_dependencies_compiler_type=gcc3
am_cv_CXX_dependencies_compiler_type=gcc3
kde_cv_opt_noinline_match=irrelevant
kde_cv_path=/opt/kde3/bin/kde-config
kde_cv_path_kde_config=/opt/kde3/bin/kde-config
kde_cv_prog_cc_Wmissing_format_attribute=yes
kde_cv_prog_cxx_O0=yes
kde_cv_prog_cxx_Wl___allow_shlib_undefined=yes
kde_cv_prog_cxx_Wl___no_undefined=yes
kde_cv_prog_cxx_Wmissing_format_attribute=yes
kde_cv_prog_cxx_Wno_long_long=yes
kde_cv_prog_cxx_Wno_non_virtual_dtor=yes
kde_cv_prog_cxx_Woverloaded_virtual=yes
kde_cv_prog_cxx_Wundef=yes
kde_cv_prog_cxx_fexceptions=yes
kde_cv_prog_cxx_fno_builtin=yes
kde_cv_prog_cxx_fno_check_new=yes
kde_cv_prog_cxx_fno_common=yes
kde_cv_prog_cxx_fno_exceptions=yes
kde_cv_prog_cxx_fno_reorder_blocks=yes
kde_cv_stl_works=no
lt_cv_deplibs_check_method=pass_all
lt_cv_dlopen=dlopen
lt_cv_dlopen_libs=-ldl
lt_cv_dlopen_self=yes
lt_cv_dlopen_self_static=yes
lt_cv_file_magic_cmd='$MAGIC_CMD'
lt_cv_file_magic_test_file='/lib/libc.so.6 /lib/libc-2.5.so'
lt_cv_ld_reload_flag=-r
lt_cv_objdir=.libs
lt_cv_path_LD=/usr/i586-suse-linux/bin/ld
lt_cv_path_LDCXX=/usr/i586-suse-linux/bin/ld
lt_cv_path_NM='/usr/bin/nm -B'
lt_cv_path_SED=/usr/bin/sed
lt_cv_prog_compiler_c_o=yes
lt_cv_prog_compiler_c_o_CXX=yes
lt_cv_prog_compiler_rtti_exceptions=no
lt_cv_prog_gnu_ld=yes
lt_cv_prog_gnu_ldcxx=yes
lt_cv_sys_global_symbol_pipe='sed -n -e '\''s/^.*[ 	]\([ABCDGISTW][ABCDGISTW]*\)[ 	][ 	]*\(\)\([_A-Za-z][_A-Za-z0-9]*\)$/\1 \2\3 \3/p'\'''
lt_cv_sys_global_symbol_to_c_name_address='sed -n -e '\''s/^: \([^ ]*\) $/  {\"\1\", (lt_ptr) 0},/p'\'' -e '\''s/^[BCDEGRST] \([^ ]*\) \([^ ]*\)$/  {"\2", (lt_ptr) \&\2},/p'\'''
lt_cv_sys_global_symbol_to_cdecl='sed -n -e '\''s/^. .* \(.*\)$/extern int \1;/p'\'''
lt_cv_sys_max_cmd_len=32768
lt_lt_cv_prog_compiler_c_o='"yes"'
lt_lt_cv_prog_compiler_c_o_CXX='"yes"'
lt_lt_cv_sys_global_symbol_pipe='"sed -n -e '\''s/^.*[ 	]\\([ABCDGISTW][ABCDGISTW]*\\)[ 	][ 	]*\\(\\)\\([_A-Za-z][_A-Za-z0-9]*\\)\$/\\1 \\2\\3 \\3/p'\''"'
lt_lt_cv_sys_global_symbol_to_c_name_address='"sed -n -e '\''s/^: \\([^ ]*\\) \$/  {\\\"\\1\\\", (lt_ptr) 0},/p'\'' -e '\''s/^[BCDEGRST] \\([^ ]*\\) \\([^ ]*\\)\$/  {\"\\2\", (lt_ptr) \\&\\2},/p'\''"'
lt_lt_cv_sys_global_symbol_to_cdecl='"sed -n -e '\''s/^. .* \\(.*\\)\$/extern int \\1;/p'\''"'

## ----------------- ##
## Output variables. ##
## ----------------- ##

ACLOCAL='${SHELL} /home/flo/.kde/share/apps/amarok/amarok-svn/admin/missing --run aclocal-1.9'
ALSALIB_CFLAGS=''
ALSALIB_LIBS=''
AMDEPBACKSLASH='\'
AMDEP_FALSE='#'
AMDEP_TRUE=''
AMTAR='${SHELL} /home/flo/.kde/share/apps/amarok/amarok-svn/admin/missing --run tar'
AR='ar'
ARTSCCONFIG=''
AUTOCONF='$(SHELL) $(top_srcdir)/admin/cvs.sh configure || touch configure'
AUTODIRS=''
AUTOHEADER='${SHELL} /home/flo/.kde/share/apps/amarok/amarok-svn/admin/missing --run autoheader'
AUTOMAKE='${SHELL} /home/flo/.kde/share/apps/amarok/amarok-svn/admin/missing --run automake-1.9'
AWK='gawk'
CC='gcc'
CCDEPMODE='depmode=gcc3'
CFLAGS='-std=iso9899:1990 -W -Wall -Wchar-subscripts -Wshadow -Wpointer-arith -Wmissing-prototypes -Wwrite-strings -D_XOPEN_SOURCE=500 -D_BSD_SOURCE -g3 -fno-inline   -Wformat-security -Wmissing-format-attribute'
CFLAGS_NMM=''
CFLAGS_XINE=''
CFLAGS_YAUAP=''
CONF_FILES=' $(top_srcdir)/./admin/configure.in.min $(top_srcdir)/configure.in.in $(top_srcdir)/./amarok/configure.in.bot $(top_srcdir)/./amarok/configure.in.in $(top_srcdir)/configure.in.bot'
CPP='gcc -E'
CPPFLAGS=''
CXX='g++'
CXXCPP='g++ -E'
CXXDEPMODE='depmode=gcc3'
CXXFLAGS='-Wno-long-long -Wundef -ansi -D_XOPEN_SOURCE=500 -D_BSD_SOURCE -Wcast-align -Wconversion -Wchar-subscripts -Wall -W -Wpointer-arith -fno-builtin -g3 -fno-inline -Wformat-security -Wmissing-format-attribute -Wno-non-virtual-dtor  -fno-check-new -fno-common'
CYGPATH_W='echo'
DBUSGLIB_CFLAGS=''
DBUSGLIB_LIBS=''
DCOPIDL2CPP=''
DCOPIDL=''
DCOPIDLNG=''
DCOP_DEPENDENCIES=''
DEFS=''
DEPDIR='.deps'
DNSSD_LIBS=''
DOXYGEN=''
DOXYGEN_PROJECT_NAME=''
DOXYGEN_PROJECT_NUMBER=''
ECHO='echo'
ECHO_C=''
ECHO_N='-n'
ECHO_T=''
EGREP='/usr/bin/grep -E'
ENABLE_PERMISSIVE_FLAG='-fpermissive'
EXEEXT=''
F77=''
FFLAGS=''
FRAMEWORK_COREAUDIO=''
GMSGFMT='/usr/bin/msgfmt'
GOBJECT_CFLAGS=''
GOBJECT_LIBS=''
GREP='/usr/bin/grep'
HAVE_GCC_VISIBILITY='0'
IFP_INCLUDES=''
IFP_LIBS=''
INSTALL_DATA='${INSTALL} -m 644'
INSTALL_PROGRAM='${INSTALL} $(INSTALL_STRIP_FLAG)'
INSTALL_SCRIPT='${INSTALL}'
INSTALL_STRIP_PROGRAM='${SHELL} $(install_sh) -c -s'
KCFG_DEPENDENCIES=''
KCONFIG_COMPILER=''
KDECONFIG='/opt/kde3/bin/kde-config'
KDE_CHECK_PLUGIN='$(KDE_PLUGIN) -rpath $(libdir)'
KDE_EXTRA_RPATH=''
KDE_HAS_DOXYGEN=''
KDE_HAVE_DOT=''
KDE_INCLUDES=''
KDE_LDFLAGS=''
KDE_MT_LDFLAGS=''
KDE_MT_LIBS=''
KDE_NO_UNDEFINED='-Wl,--no-undefined -Wl,--allow-shlib-undefined'
KDE_PLUGIN='-avoid-version -module -no-undefined $(KDE_NO_UNDEFINED) $(KDE_RPATH) $(KDE_MT_LDFLAGS)'
KDE_RPATH=''
KDE_USE_CLOSURE_FALSE=''
KDE_USE_CLOSURE_TRUE='#'
KDE_USE_FINAL_FALSE=''
KDE_USE_FINAL_TRUE='#'
KDE_USE_FPIE=''
KDE_USE_NMCHECK_FALSE=''
KDE_USE_NMCHECK_TRUE='#'
KDE_USE_PIE=''
KDE_XSL_STYLESHEET=''
LDFLAGS=''
LDFLAGS_AS_NEEDED=''
LDFLAGS_NEW_DTAGS=''
LDFLAGS_NMM=''
LIBCOMPAT=''
LIBCRYPT=''
LIBDL=''
LIBGPOD_CFLAGS=''
LIBGPOD_LIBS=''
LIBJPEG=''
LIBMTP_CFLAGS=''
LIBMTP_LIBS=''
LIBNJB_CFLAGS=''
LIBNJB_LIBS=''
LIBOBJS=''
LIBPNG=''
LIBPTHREAD=''
LIBRESOLV=''
LIBS=''
LIBSM=''
LIBSOCKET=''
LIBS_XINE=''
LIBTOOL='$(SHELL) $(top_builddir)/libtool --silent'
LIBUCB=''
LIBUTIL=''
LIBVISUAL_CFLAGS=''
LIBVISUAL_LIBS=''
LIBZ=''
LIB_ARTS=''
LIB_KAB=''
LIB_KABC=''
LIB_KDECORE=''
LIB_KDED=''
LIB_KDEPIM=''
LIB_KDEPRINT=''
LIB_KDEUI=''
LIB_KDNSSD=''
LIB_KFILE=''
LIB_KFM=''
LIB_KHTML=''
LIB_KIMPROXY=''
LIB_KIO=''
LIB_KJS=''
LIB_KNEWSTUFF=''
LIB_KPARTS=''
LIB_KSPELL=''
LIB_KSYCOCA=''
LIB_KUNITTEST=''
LIB_KUTILS=''
LIB_POLL=''
LIB_QPE=''
LIB_QT=''
LIB_SMB=''
LIB_SQLITE=''
LIB_TUNEPIMP=''
LIB_X11=''
LIB_XEXT=''
LIB_XRENDER=''
LIB_YAUAP=''
LN_S='ln -s'
LTLIBOBJS=''
MAKEINFO='${SHELL} /home/flo/.kde/share/apps/amarok/amarok-svn/admin/missing --run makeinfo'
MAKEKDEWIDGETS=''
MCOPIDL=''
MEINPROC=''
MOC=''
MP4V2_INCLUDES=''
MP4V2_LIBS=''
MSGFMT='/usr/bin/msgfmt'
MYSQL_CONFIG=''
NOOPT_CFLAGS='-O0'
NOOPT_CXXFLAGS='-O0'
OBJEXT='o'
PACKAGE='amarok-svn'
PACKAGE_BUGREPORT=''
PACKAGE_NAME=''
PACKAGE_STRING=''
PACKAGE_TARNAME=''
PACKAGE_VERSION=''
PATH_SEPARATOR=':'
PERL=''
PKGCONFIGFOUND=''
PKG_CONFIG=''
POSTGRESQL_CONFIG=''
QTDOCDIR=''
QTE_NORTTI=''
QT_INCLUDES=''
QT_LDFLAGS=''
RANLIB='ranlib'
RUBY=''
SDL_CONFIG=''
SET_MAKE=''
SHELL='/bin/sh'
SQLITE_CFLAGS=''
SQLITE_LIBS=''
STRIP='strip'
TAGLIB_CONFIG=''
TOPSUBDIRS=''
UIC=''
UIC_TR=''
USER_INCLUDES=''
USER_LDFLAGS=''
USE_EXCEPTIONS='-fexceptions'
USE_RTTI=''
USE_THREADS=''
VERSION='3.5.5'
WOVERLOADED_VIRTUAL='-Woverloaded-virtual'
XGETTEXT='/usr/bin/xgettext'
XINE_CONFIG=''
XMKMF=''
XMLLINT=''
X_EXTRA_LIBS=''
X_INCLUDES=''
X_LDFLAGS=''
X_PRE_LIBS=''
X_RPATH=''
ac_ct_CC='gcc'
ac_ct_CXX='g++'
ac_ct_F77=''
all_includes=''
all_libraries=''
am__fastdepCC_FALSE='#'
am__fastdepCC_TRUE=''
am__fastdepCXX_FALSE='#'
am__fastdepCXX_TRUE=''
am__include='include'
am__leading_dot='.'
am__quote=''
am__tar='${AMTAR} chof - "$$tardir"'
am__untar='${AMTAR} xf -'
amarok_SUBDIR_included_FALSE=''
amarok_SUBDIR_included_TRUE=''
atleast_kde34_FALSE=''
atleast_kde34_TRUE=''
bindir='${exec_prefix}/bin'
build='i686-pc-linux-gnu'
build_alias=''
build_cpu='i686'
build_os='linux-gnu'
build_vendor='pc'
datadir='${datarootdir}'
datarootdir='${prefix}/share'
doc_SUBDIR_included_FALSE=''
doc_SUBDIR_included_TRUE=''
docdir='${datarootdir}/doc/${PACKAGE}'
dvidir='${docdir}'
enable_mysql_FALSE=''
enable_mysql_TRUE=''
enable_postgresql_FALSE=''
enable_postgresql_TRUE=''
exec_prefix='NONE'
gl_libs=''
host='i686-pc-linux-gnu'
host_alias=''
host_cpu='i686'
host_os='linux-gnu'
host_vendor='pc'
htmldir='${docdir}'
include_ARTS_FALSE=''
include_ARTS_TRUE=''
include_x11_FALSE=''
include_x11_TRUE=''
includedir='${prefix}/include'
infodir='${datarootdir}/info'
install_sh='/home/flo/.kde/share/apps/amarok/amarok-svn/admin/install-sh'
kde_appsdir=''
kde_bindir=''
kde_confdir=''
kde_datadir=''
kde_htmldir=''
kde_icondir=''
kde_includes=''
kde_kcfgdir=''
kde_libraries=''
kde_libs_htmldir='/opt/kde3/share/doc/HTML'
kde_libs_prefix='/opt/kde3'
kde_locale=''
kde_mimedir=''
kde_moduledir=''
kde_qtver='3'
kde_servicesdir=''
kde_servicetypesdir=''
kde_sounddir=''
kde_styledir=''
kde_templatesdir=''
kde_wallpaperdir=''
kde_widgetdir=''
kdeinitdir=''
libdir='${exec_prefix}/lib'
libexecdir='${exec_prefix}/libexec'
localedir='${datarootdir}/locale'
localstatedir='${prefix}/var'
mandir='${datarootdir}/man'
mkdir_p='mkdir -p --'
mysql_includes=''
mysql_libs=''
oldincludedir='/usr/include'
pdfdir='${docdir}'
postgresql_includes=''
postgresql_libs=''
prefix='/opt/kde3'
program_transform_name='s,x,x,'
psdir='${docdir}'
qt_includes=''
qt_libraries=''
ruby_includes=''
ruby_ldflags=''
sbindir='${exec_prefix}/sbin'
sdl_cflags=''
sdl_libs=''
sharedstatedir='${prefix}/com'
sysconfdir='${prefix}/etc'
taglib_includes=''
taglib_libs=''
target='i686-pc-linux-gnu'
target_alias=''
target_cpu='i686'
target_os='linux-gnu'
target_vendor='pc'
unsermake_enable_pch_FALSE=''
unsermake_enable_pch_TRUE='#'
with_helix_FALSE=''
with_helix_TRUE=''
with_ifp_FALSE=''
with_ifp_TRUE=''
with_included_sqlite_FALSE=''
with_included_sqlite_TRUE=''
with_konqsidebar_FALSE=''
with_konqsidebar_TRUE=''
with_libgpod_FALSE=''
with_libgpod_TRUE=''
with_libkarma_FALSE=''
with_libkarma_TRUE=''
with_libmtp_FALSE=''
with_libmtp_TRUE=''
with_libnjb_FALSE=''
with_libnjb_TRUE=''
with_libvisual_FALSE=''
with_libvisual_TRUE=''
with_mp4v2_FALSE=''
with_mp4v2_TRUE=''
with_nmm_FALSE=''
with_nmm_TRUE=''
with_xine_FALSE=''
with_xine_TRUE=''
with_yauap_FALSE=''
with_yauap_TRUE=''
x_includes='NONE'
x_libraries='NONE'
xdg_appsdir=''
xdg_directorydir=''
xdg_menudir=''

## ----------- ##
## confdefs.h. ##
## ----------- ##

#define PACKAGE_NAME ""
#define PACKAGE_TARNAME ""
#define PACKAGE_VERSION ""
#define PACKAGE_STRING ""
#define PACKAGE_BUGREPORT ""
#define PACKAGE "amarok-svn"
#define VERSION "3.5.5"
#define KDELIBSUFF ""
#define STDC_HEADERS 1
#define HAVE_SYS_TYPES_H 1
#define HAVE_SYS_STAT_H 1
#define HAVE_STDLIB_H 1
#define HAVE_STRING_H 1
#define HAVE_MEMORY_H 1
#define HAVE_STRINGS_H 1
#define HAVE_INTTYPES_H 1
#define HAVE_STDINT_H 1
#define HAVE_UNISTD_H 1
#define HAVE_DLFCN_H 1

configure: exit 1