All pastes #282679 Raw Edit

Someone

public text v1 · immutable
#282679 ·published 2006-12-17 20:09 UTC
rendered paste body
x86_64-pld-linux-g++ -DHAVE_CONFIG_H -I. -I..    -I/usr/lib64/wx/include/gtk2-unicode-release-2.8 -I/usr/include/wx-2.8 -D_FILE_OFFSET_BITS=64 -D_LARGE_FILES -D__WXGTK__ -pthread -DwxUSE_GUI=0  -I./libs -Ilibs -DAMULE_DAEMON  -O2 -fno-strict-aliasing -fwrapv -march=x86-64 -gdwarf-2 -g2  -DUSE_EMBEDDED_CRYPTO -W -Wall -Wshadow -Wundef -O2  -MT amuled-amule.o -MD -MP -MF .deps/amuled-amule.Tpo -c -o amuled-amule.o `test -f 'amule.cpp' || echo './'`amule.cpp
In file included from amule.cpp:80:
FriendList.h:63:3: warning: #warning THIS MUST BE MADE PRIVATE AFTER EC IS CODED
In file included from /usr/include/wx-2.8/wx/window.h:23,
                 from amule.cpp:34:
/usr/include/wx-2.8/wx/cursor.h: In constructor ‘wxBusyCursorSuspender::wxBusyCursorSuspender()’:
/usr/include/wx-2.8/wx/cursor.h:65: error: ‘wxIsBusy’ was not declared in this scope
/usr/include/wx-2.8/wx/cursor.h:67: error: ‘wxBusyCursor’ has not been declared
/usr/include/wx-2.8/wx/cursor.h:67: error: ‘wxSetCursor’ was not declared in this scope
/usr/include/wx-2.8/wx/cursor.h: In destructor ‘wxBusyCursorSuspender::~wxBusyCursorSuspender()’:
/usr/include/wx-2.8/wx/cursor.h:72: error: ‘wxIsBusy’ was not declared in this scope
/usr/include/wx-2.8/wx/cursor.h:74: error: ‘wxBusyCursor’ has not been declared
/usr/include/wx-2.8/wx/cursor.h:74: error: ‘wxSetCursor’ was not declared in this scope
In file included from /usr/include/wx-2.8/wx/region.h:16,
                 from /usr/include/wx-2.8/wx/window.h:26,
                 from amule.cpp:34:
/usr/include/wx-2.8/wx/gdicmn.h: In member function ‘bool wxRect::Inside(int, int) const’:
/usr/include/wx-2.8/wx/gdicmn.h:486: warning: declaration of ‘y’ shadows a member of 'this'
/usr/include/wx-2.8/wx/gdicmn.h:486: warning: declaration of ‘x’ shadows a member of 'this'
In file included from amule.cpp:34:
/usr/include/wx-2.8/wx/window.h: At global scope:
/usr/include/wx-2.8/wx/window.h:907: error: ‘wxUpdateUIEvent’ has not been declared
/usr/include/wx-2.8/wx/window.h:910: error: ‘wxMenu’ has not been declared
/usr/include/wx-2.8/wx/window.h:912: error: ‘wxMenu’ has not been declared
/usr/include/wx-2.8/wx/window.h:973: error: ‘wxHelpEvent’ has not been declared
/usr/include/wx-2.8/wx/window.h:973: error: expected ‘,’ or ‘...’ before ‘origin’
/usr/include/wx-2.8/wx/window.h:1088: error: ‘wxSysColourChangedEvent’ has not been declared
/usr/include/wx-2.8/wx/window.h:1089: error: ‘wxInitDialogEvent’ has not been declared
/usr/include/wx-2.8/wx/window.h:1090: error: ‘wxMouseEvent’ has not been declared
/usr/include/wx-2.8/wx/window.h:1092: error: ‘wxHelpEvent’ has not been declared
/usr/include/wx-2.8/wx/window.h:1369: error: ‘wxMenu’ has not been declared
/usr/include/wx-2.8/wx/window.h:556: error: ‘wxNavigationKeyEvent’ has not been declared
/usr/include/wx-2.8/wx/window.h: In member function ‘wxString wxWindowBase::GetHelpText() const’:
/usr/include/wx-2.8/wx/window.h:977: error: ‘wxHelpEvent’ has not been declared
In file included from /usr/include/wx-2.8/wx/window.h:1452,
                 from amule.cpp:34:
/usr/include/wx-2.8/wx/gtk/window.h: At global scope:
/usr/include/wx-2.8/wx/gtk/window.h:142: error: ‘wxIdleEvent’ has not been declared
/usr/include/wx-2.8/wx/gtk/window.h:340: error: ‘wxMenu’ has not been declared
make[3]: *** [amuled-amule.o] Błąd 1
make[3]: Opuszczenie katalogu `/home/users/arekm/rpm/BUILD/aMule-2.1.3/src'