All pastes #282622 Raw Edit

Untitled

public text v1 · immutable
#282622 ·published 2006-12-17 19:24 UTC
rendered paste body
make -C /lib/modules/2.6.16-suspend2-r8/build SUBDIRS=/root/usb-rndis-lite modules
make[1]: Entering directory `/usr/src/linux-2.6.16-suspend2-r8'

  WARNING: Symbol version dump /usr/src/linux-2.6.16-suspend2-r8/Module.symvers
           is missing; modules will have no dependencies and modversions.

  CC [M]  /root/usb-rndis-lite/usbnet.o
In file included from include/linux/module.h:10,
                 from /root/usb-rndis-lite/usbnet.c:36:
include/linux/sched.h:4:36: error: asm/param.h: No such file or directory
In file included from include/linux/types.h:15,
                 from include/linux/capability.h:16,
                 from include/linux/sched.h:7,
                 from include/linux/module.h:10,
                 from /root/usb-rndis-lite/usbnet.c:36:
include/linux/posix_types.h:47:29: error: asm/posix_types.h: No such file or directory
In file included from include/linux/capability.h:16,
                 from include/linux/sched.h:7,
                 from include/linux/module.h:10,
                 from /root/usb-rndis-lite/usbnet.c:36:
include/linux/types.h:16:23: error: asm/types.h: No such file or directory
In file included from include/linux/capability.h:16,
                 from include/linux/sched.h:7,
                 from include/linux/module.h:10,
                 from /root/usb-rndis-lite/usbnet.c:36:
include/linux/types.h:20: error: expected '=', ',', ';', 'asm' or '__attribute__' before '__kernel_dev_t'
include/linux/types.h:23: error: expected '=', ',', ';', 'asm' or '__attribute__' before 'dev_t'
include/linux/types.h:24: error: expected '=', ',', ';', 'asm' or '__attribute__' before 'ino_t'
include/linux/types.h:25: error: expected '=', ',', ';', 'asm' or '__attribute__' before 'mode_t'
include/linux/types.h:26: error: expected '=', ',', ';', 'asm' or '__attribute__' before 'nlink_t'
include/linux/types.h:27: error: expected '=', ',', ';', 'asm' or '__attribute__' before 'off_t'
include/linux/types.h:28: error: expected '=', ',', ';', 'asm' or '__attribute__' before 'pid_t'
include/linux/types.h:29: error: expected '=', ',', ';', 'asm' or '__attribute__' before 'daddr_t'
include/linux/types.h:31: error: expected '=', ',', ';', 'asm' or '__attribute__' before 'suseconds_t'
include/linux/types.h:32: error: expected '=', ',', ';', 'asm' or '__attribute__' before 'timer_t'
include/linux/types.h:33: error: expected '=', ',', ';', 'asm' or '__attribute__' before 'clockid_t'
include/linux/types.h:37: error: expected '=', ',', ';', 'asm' or '__attribute__' before 'uid_t'
include/linux/types.h:38: error: expected '=', ',', ';', 'asm' or '__attribute__' before 'gid_t'
include/linux/types.h:39: error: expected '=', ',', ';', 'asm' or '__attribute__' before 'uid16_t'
include/linux/types.h:40: error: expected '=', ',', ';', 'asm' or '__attribute__' before 'gid16_t'
include/linux/types.h:44: error: expected '=', ',', ';', 'asm' or '__attribute__' before 'old_uid_t'
include/linux/types.h:45: error: expected '=', ',', ';', 'asm' or '__attribute__' before 'old_gid_t'
include/linux/types.h:57: error: expected '=', ',', ';', 'asm' or '__attribute__' before 'loff_t'
include/linux/types.h:66: error: expected '=', ',', ';', 'asm' or '__attribute__' before 'size_t'
include/linux/types.h:71: error: expected '=', ',', ';', 'asm' or '__attribute__' before 'ssize_t'
include/linux/types.h:76: error: expected '=', ',', ';', 'asm' or '__attribute__' before 'ptrdiff_t'
include/linux/types.h:81: error: expected '=', ',', ';', 'asm' or '__attribute__' before 'time_t'
include/linux/types.h:86: error: expected '=', ',', ';', 'asm' or '__attribute__' before 'clock_t'
include/linux/types.h:91: error: expected '=', ',', ';', 'asm' or '__attribute__' before 'caddr_t'
include/linux/types.h:109: error: expected '=', ',', ';', 'asm' or '__attribute__' before 'u_int8_t'
include/linux/types.h:110: error: expected '=', ',', ';', 'asm' or '__attribute__' before 'int8_t'
include/linux/types.h:111: error: expected '=', ',', ';', 'asm' or '__attribute__' before 'u_int16_t'
include/linux/types.h:112: error: expected '=', ',', ';', 'asm' or '__attribute__' before 'int16_t'
include/linux/types.h:113: error: expected '=', ',', ';', 'asm' or '__attribute__' before 'u_int32_t'
include/linux/types.h:114: error: expected '=', ',', ';', 'asm' or '__attribute__' before 'int32_t'
include/linux/types.h:118: error: expected '=', ',', ';', 'asm' or '__attribute__' before 'uint8_t'
include/linux/types.h:119: error: expected '=', ',', ';', 'asm' or '__attribute__' before 'uint16_t'
include/linux/types.h:120: error: expected '=', ',', ';', 'asm' or '__attribute__' before 'uint32_t'
include/linux/types.h:123: error: expected '=', ',', ';', 'asm' or '__attribute__' before 'uint64_t'
include/linux/types.h:124: error: expected '=', ',', ';', 'asm' or '__attribute__' before 'u_int64_t'
include/linux/types.h:125: error: expected '=', ',', ';', 'asm' or '__attribute__' before 'int64_t'
include/linux/types.h:166: error: expected '=', ',', ';', 'asm' or '__attribute__' before '__le16'
include/linux/types.h:167: error: expected '=', ',', ';', 'asm' or '__attribute__' before '__be16'
include/linux/types.h:168: error: expected '=', ',', ';', 'asm' or '__attribute__' before '__le32'
include/linux/types.h:169: error: expected '=', ',', ';', 'asm' or '__attribute__' before '__be32'
include/linux/types.h:171: error: expected '=', ',', ';', 'asm' or '__attribute__' before '__le64'
include/linux/types.h:172: error: expected '=', ',', ';', 'asm' or '__attribute__' before '__be64'
include/linux/types.h:180: error: expected specifier-qualifier-list before '__kernel_daddr_t'
In file included from include/linux/sched.h:7,
                 from include/linux/module.h:10,
                 from /root/usb-rndis-lite/usbnet.c:36:
include/linux/capability.h:33: error: expected specifier-qualifier-list before '__u32'
include/linux/capability.h:38: error: expected specifier-qualifier-list before '__u32'
In file included from include/linux/thread_info.h:20,
                 from include/linux/preempt.h:10,
                 from include/linux/spinlock.h:50,
                 from include/linux/capability.h:45,
                 from include/linux/sched.h:7,
                 from include/linux/module.h:10,
                 from /root/usb-rndis-lite/usbnet.c:36:
include/linux/bitops.h:77:24: error: asm/bitops.h: No such file or directory
In file included from include/linux/thread_info.h:20,
                 from include/linux/preempt.h:10,
                 from include/linux/spinlock.h:50,
                 from include/linux/capability.h:45,
                 from include/linux/sched.h:7,
                 from include/linux/module.h:10,
                 from /root/usb-rndis-lite/usbnet.c:36:
include/linux/bitops.h:80: error: expected ')' before 'x'
include/linux/bitops.h: In function 'get_bitmask_order':
include/linux/bitops.h:92: warning: implicit declaration of function 'fls'
include/linux/bitops.h: At top level:
include/linux/bitops.h:135: error: expected ')' before 'w'
include/linux/bitops.h:137:5: warning: "BITS_PER_LONG" is not defined
include/linux/bitops.h: In function 'hweight_long':
include/linux/bitops.h:153: warning: implicit declaration of function 'generic_hweight64'
include/linux/bitops.h: At top level:
include/linux/bitops.h:162: error: expected '=', ',', ';', 'asm' or '__attribute__' before 'rol32'
include/linux/bitops.h:173: error: expected '=', ',', ';', 'asm' or '__attribute__' before 'ror32'
In file included from include/linux/preempt.h:10,
                 from include/linux/spinlock.h:50,
                 from include/linux/capability.h:45,
                 from include/linux/sched.h:7,
                 from include/linux/module.h:10,
                 from /root/usb-rndis-lite/usbnet.c:36:
include/linux/thread_info.h:21:29: error: asm/thread_info.h: No such file or directory
In file included from include/linux/preempt.h:10,
                 from include/linux/spinlock.h:50,
                 from include/linux/capability.h:45,
                 from include/linux/sched.h:7,
                 from include/linux/module.h:10,
                 from /root/usb-rndis-lite/usbnet.c:36:
include/linux/thread_info.h:30: warning: 'struct thread_info' declared inside parameter list
include/linux/thread_info.h:30: warning: its scope is only this definition or declaration, which is probably not what you want
include/linux/thread_info.h: In function 'set_ti_thread_flag':
include/linux/thread_info.h:32: warning: implicit declaration of function 'set_bit'
include/linux/thread_info.h:32: error: dereferencing pointer to incomplete type
include/linux/thread_info.h: At top level:
include/linux/thread_info.h:35: warning: 'struct thread_info' declared inside parameter list
include/linux/thread_info.h: In function 'clear_ti_thread_flag':
include/linux/thread_info.h:37: warning: implicit declaration of function 'clear_bit'
include/linux/thread_info.h:37: error: dereferencing pointer to incomplete type
include/linux/thread_info.h: At top level:
include/linux/thread_info.h:40: warning: 'struct thread_info' declared inside parameter list
include/linux/thread_info.h: In function 'test_and_set_ti_thread_flag':
include/linux/thread_info.h:42: warning: implicit declaration of function 'test_and_set_bit'
include/linux/thread_info.h:42: error: dereferencing pointer to incomplete type
include/linux/thread_info.h: At top level:
include/linux/thread_info.h:45: warning: 'struct thread_info' declared inside parameter list
include/linux/thread_info.h: In function 'test_and_clear_ti_thread_flag':
include/linux/thread_info.h:47: warning: implicit declaration of function 'test_and_clear_bit'
include/linux/thread_info.h:47: error: dereferencing pointer to incomplete type
include/linux/thread_info.h: At top level:
include/linux/thread_info.h:50: warning: 'struct thread_info' declared inside parameter list
include/linux/thread_info.h: In function 'test_ti_thread_flag':
include/linux/thread_info.h:52: warning: implicit declaration of function 'test_bit'
include/linux/thread_info.h:52: error: dereferencing pointer to incomplete type
In file included from include/linux/preempt.h:11,
                 from include/linux/spinlock.h:50,
                 from include/linux/capability.h:45,
                 from include/linux/sched.h:7,
                 from include/linux/module.h:10,
                 from /root/usb-rndis-lite/usbnet.c:36:
include/linux/linkage.h:5:25: error: asm/linkage.h: No such file or directory
In file included from include/linux/spinlock.h:54,
                 from include/linux/capability.h:45,
                 from include/linux/sched.h:7,
                 from include/linux/module.h:10,
                 from /root/usb-rndis-lite/usbnet.c:36:
include/linux/kernel.h:16:27: error: asm/byteorder.h: No such file or directory
include/linux/kernel.h:17:21: error: asm/bug.h: No such file or directory
In file included from include/linux/spinlock.h:54,
                 from include/linux/capability.h:45,
                 from include/linux/sched.h:7,
                 from include/linux/module.h:10,
                 from /root/usb-rndis-lite/usbnet.c:36:
include/linux/kernel.h: At top level:
include/linux/kernel.h:106: error: expected declaration specifiers or '...' before 'size_t'
include/linux/kernel.h:107: error: format string argument not a string type
include/linux/kernel.h:110: error: expected declaration specifiers or '...' before 'size_t'
include/linux/kernel.h:112: error: expected declaration specifiers or '...' before 'size_t'
include/linux/kernel.h:113: error: format string argument not a string type
include/linux/kernel.h:114: error: expected declaration specifiers or '...' before 'size_t'
include/linux/kernel.h:245:2: error: #error "Please fix asm/byteorder.h"
In file included from include/linux/capability.h:45,
                 from include/linux/sched.h:7,
                 from include/linux/module.h:10,
                 from /root/usb-rndis-lite/usbnet.c:36:
include/linux/spinlock.h:57:24: error: asm/system.h: No such file or directory
In file included from include/linux/spinlock.h:79,
                 from include/linux/capability.h:45,
                 from include/linux/sched.h:7,
                 from include/linux/module.h:10,
                 from /root/usb-rndis-lite/usbnet.c:36:
include/linux/spinlock_types.h:13:33: error: asm/spinlock_types.h: No such file or directory
In file included from include/linux/spinlock.h:79,
                 from include/linux/capability.h:45,
                 from include/linux/sched.h:7,
                 from include/linux/module.h:10,
                 from /root/usb-rndis-lite/usbnet.c:36:
include/linux/spinlock_types.h:19: error: expected specifier-qualifier-list before 'raw_spinlock_t'
include/linux/spinlock_types.h:32: error: expected specifier-qualifier-list before 'raw_rwlock_t'
In file included from include/linux/capability.h:45,
                 from include/linux/sched.h:7,
                 from include/linux/module.h:10,
                 from /root/usb-rndis-lite/usbnet.c:36:
include/linux/spinlock.h:81: error: expected ')' before '*' token
In file included from include/linux/capability.h:45,
                 from include/linux/sched.h:7,
                 from include/linux/module.h:10,
                 from /root/usb-rndis-lite/usbnet.c:36:
include/linux/spinlock.h:87:27: error: asm/spinlock.h: No such file or directory
include/linux/spinlock.h:231:24: error: asm/atomic.h: No such file or directory
In file included from include/linux/capability.h:45,
                 from include/linux/sched.h:7,
                 from include/linux/module.h:10,
                 from /root/usb-rndis-lite/usbnet.c:36:
include/linux/spinlock.h:237: error: expected ')' before '*' token
In file included from include/linux/sched.h:7,
                 from include/linux/module.h:10,
                 from /root/usb-rndis-lite/usbnet.c:36:
include/linux/capability.h:46:25: error: asm/current.h: No such file or directory
In file included from include/linux/sched.h:7,
                 from include/linux/module.h:10,
                 from /root/usb-rndis-lite/usbnet.c:36:
include/linux/capability.h:58: error: expected '=', ',', ';', 'asm' or '__attribute__' before 'kernel_cap_t'
include/linux/capability.h:295: error: expected '=', ',', ';', 'asm' or '__attribute__' before 'cap_bset'
include/linux/capability.h:323: error: expected '=', ',', ';', 'asm' or '__attribute__' before 'cap_combine'
include/linux/capability.h:330: error: expected '=', ',', ';', 'asm' or '__attribute__' before 'cap_intersect'
include/linux/capability.h:337: error: expected '=', ',', ';', 'asm' or '__attribute__' before 'cap_drop'
include/linux/capability.h:344: error: expected '=', ',', ';', 'asm' or '__attribute__' before 'cap_invert'
In file included from include/linux/time.h:7,
                 from include/linux/timex.h:58,
                 from include/linux/sched.h:11,
                 from include/linux/module.h:10,
                 from /root/usb-rndis-lite/usbnet.c:36:
include/linux/seqlock.h: In function 'write_seqlock':
include/linux/seqlock.h:54: warning: implicit declaration of function 'smp_wmb'
include/linux/seqlock.h: In function 'write_sequnlock':
include/linux/seqlock.h:61: warning: implicit declaration of function '__raw_spin_unlock'
include/linux/seqlock.h:61: error: 'spinlock_t' has no member named 'raw_lock'
include/linux/seqlock.h: In function 'read_seqbegin':
include/linux/seqlock.h:79: warning: implicit declaration of function 'smp_rmb'
In file included from include/linux/timex.h:58,
                 from include/linux/sched.h:11,
                 from include/linux/module.h:10,
                 from /root/usb-rndis-lite/usbnet.c:36:
include/linux/time.h: At top level:
include/linux/time.h:13: error: expected specifier-qualifier-list before 'time_t'
include/linux/time.h:19: error: expected specifier-qualifier-list before 'time_t'
include/linux/time.h: In function 'timespec_equal':
include/linux/time.h:38: error: 'struct timespec' has no member named 'tv_sec'
include/linux/time.h:38: error: 'struct timespec' has no member named 'tv_sec'
include/linux/time.h:38: error: 'struct timespec' has no member named 'tv_nsec'
include/linux/time.h:38: error: 'struct timespec' has no member named 'tv_nsec'
include/linux/time.h: In function 'timespec_compare':
include/linux/time.h:48: error: 'struct timespec' has no member named 'tv_sec'
include/linux/time.h:48: error: 'struct timespec' has no member named 'tv_sec'
include/linux/time.h:50: error: 'struct timespec' has no member named 'tv_sec'
include/linux/time.h:50: error: 'struct timespec' has no member named 'tv_sec'
include/linux/time.h:52: error: 'struct timespec' has no member named 'tv_nsec'
include/linux/time.h:52: error: 'struct timespec' has no member named 'tv_nsec'
include/linux/time.h: In function 'timeval_compare':
include/linux/time.h:57: error: 'struct timeval' has no member named 'tv_sec'
include/linux/time.h:57: error: 'struct timeval' has no member named 'tv_sec'
include/linux/time.h:59: error: 'struct timeval' has no member named 'tv_sec'
include/linux/time.h:59: error: 'struct timeval' has no member named 'tv_sec'
include/linux/time.h:61: error: 'struct timeval' has no member named 'tv_usec'
include/linux/time.h:61: error: 'struct timeval' has no member named 'tv_usec'
include/linux/time.h: At top level:
include/linux/time.h:68: error: expected declaration specifiers or '...' before 'time_t'
include/linux/time.h:80: error: expected '=', ',', ';', 'asm' or '__attribute__' before 'nsec_t'
include/linux/time.h: In function 'get_seconds':
include/linux/time.h:88: error: 'struct timespec' has no member named 'tv_sec'
include/linux/time.h: At top level:
include/linux/time.h:116: error: expected '=', ',', ';', 'asm' or '__attribute__' before 'timespec_to_ns'
include/linux/time.h:128: error: expected '=', ',', ';', 'asm' or '__attribute__' before 'timeval_to_ns'
include/linux/time.h:140: warning: type defaults to 'int' in declaration of 'nsec_t'
include/linux/time.h:140: error: expected ';', ',' or ')' before 'nsec'
include/linux/time.h:148: warning: type defaults to 'int' in declaration of 'nsec_t'
include/linux/time.h:148: error: expected ';', ',' or ')' before 'nsec'
In file included from include/linux/sched.h:11,
                 from include/linux/module.h:10,
                 from /root/usb-rndis-lite/usbnet.c:36:
include/linux/timex.h:61:23: error: asm/timex.h: No such file or directory
In file included from include/linux/sched.h:11,
                 from include/linux/module.h:10,
                 from /root/usb-rndis-lite/usbnet.c:36:
include/linux/timex.h:349: error: expected '=', ',', ';', 'asm' or '__attribute__' before 'current_tick_length'
In file included from include/linux/jiffies.h:4,
                 from include/linux/sched.h:12,
                 from include/linux/module.h:10,
                 from /root/usb-rndis-lite/usbnet.c:36:
include/linux/calc64.h:5:23: error: asm/div64.h: No such file or directory
In file included from include/linux/jiffies.h:4,
                 from include/linux/sched.h:12,
                 from include/linux/module.h:10,
                 from /root/usb-rndis-lite/usbnet.c:36:
include/linux/calc64.h: In function 'do_div_llr':
include/linux/calc64.h:23: error: 'u64' undeclared (first use in this function)
include/linux/calc64.h:23: error: (Each undeclared identifier is reported only once
include/linux/calc64.h:23: error: for each function it appears in.)
include/linux/calc64.h:23: error: expected ';' before 'result'
include/linux/calc64.h:25: warning: implicit declaration of function 'do_div'
include/linux/calc64.h:25: error: 'result' undeclared (first use in this function)
In file included from include/linux/sched.h:12,
                 from include/linux/module.h:10,
                 from /root/usb-rndis-lite/usbnet.c:36:
include/linux/jiffies.h:18:5: warning: "HZ" is not defined
include/linux/jiffies.h:20:7: warning: "HZ" is not defined
include/linux/jiffies.h:22:7: warning: "HZ" is not defined
include/linux/jiffies.h:24:7: warning: "HZ" is not defined
include/linux/jiffies.h:26:7: warning: "HZ" is not defined
include/linux/jiffies.h:28:7: warning: "HZ" is not defined
include/linux/jiffies.h:30:7: warning: "HZ" is not defined
include/linux/jiffies.h:33:3: error: #error You lose.
In file included from include/linux/sched.h:12,
                 from include/linux/module.h:10,
                 from /root/usb-rndis-lite/usbnet.c:36:
include/linux/jiffies.h: At top level:
include/linux/jiffies.h:75: warning: type defaults to 'int' in declaration of 'u64'
include/linux/jiffies.h:75: error: expected ',' or ';' before 'jiffies_64'
include/linux/jiffies.h:78:6: warning: "BITS_PER_LONG" is not defined
include/linux/jiffies.h:79: error: expected '=', ',', ';', 'asm' or '__attribute__' before 'get_jiffies_64'
include/linux/jiffies.h:204:31: warning: "CLOCK_TICK_RATE" is not defined
include/linux/jiffies.h:204:31: warning: "CLOCK_TICK_RATE" is not defined
include/linux/jiffies.h:204:31: warning: "HZ" is not defined
include/linux/jiffies.h:204:31: warning: "HZ" is not defined
include/linux/jiffies.h:204:31: error: division by zero in #if
include/linux/jiffies.h:204:31: error: division by zero in #if
include/linux/jiffies.h:204:31: warning: "CLOCK_TICK_RATE" is not defined
include/linux/jiffies.h:204:31: warning: "CLOCK_TICK_RATE" is not defined
include/linux/jiffies.h:204:31: warning: "HZ" is not defined
include/linux/jiffies.h:204:31: warning: "HZ" is not defined
include/linux/jiffies.h:204:31: error: division by zero in #if
include/linux/jiffies.h:204:31: error: division by zero in #if
include/linux/jiffies.h:204:31: warning: "CLOCK_TICK_RATE" is not defined
include/linux/jiffies.h:204:31: warning: "HZ" is not defined
include/linux/jiffies.h:204:31: warning: "HZ" is not defined
include/linux/jiffies.h:204:31: error: division by zero in #if
include/linux/jiffies.h:204:31: warning: "CLOCK_TICK_RATE" is not defined
include/linux/jiffies.h:204:31: warning: "HZ" is not defined
include/linux/jiffies.h:204:31: warning: "HZ" is not defined
include/linux/jiffies.h:204:31: error: division by zero in #if
include/linux/jiffies.h:204:31: error: division by zero in #if
include/linux/jiffies.h:204:31: error: division by zero in #if
include/linux/jiffies.h:204:31: warning: "CLOCK_TICK_RATE" is not defined
include/linux/jiffies.h:204:31: warning: "CLOCK_TICK_RATE" is not defined
include/linux/jiffies.h:204:31: warning: "HZ" is not defined
include/linux/jiffies.h:204:31: warning: "HZ" is not defined
include/linux/jiffies.h:204:31: error: division by zero in #if
include/linux/jiffies.h:204:31: error: division by zero in #if
include/linux/jiffies.h:204:31: warning: "CLOCK_TICK_RATE" is not defined
include/linux/jiffies.h:204:31: warning: "CLOCK_TICK_RATE" is not defined
include/linux/jiffies.h:204:31: warning: "HZ" is not defined
include/linux/jiffies.h:204:31: warning: "HZ" is not defined
include/linux/jiffies.h:204:31: error: division by zero in #if
include/linux/jiffies.h:204:31: error: division by zero in #if
include/linux/jiffies.h:204:31: warning: "CLOCK_TICK_RATE" is not defined
include/linux/jiffies.h:204:31: warning: "HZ" is not defined
include/linux/jiffies.h:204:31: warning: "HZ" is not defined
include/linux/jiffies.h:204:31: error: division by zero in #if
include/linux/jiffies.h:204:31: warning: "CLOCK_TICK_RATE" is not defined
include/linux/jiffies.h:204:31: warning: "HZ" is not defined
include/linux/jiffies.h:204:31: warning: "HZ" is not defined
include/linux/jiffies.h:204:31: error: division by zero in #if
include/linux/jiffies.h:204:31: error: division by zero in #if
include/linux/jiffies.h:204:31: error: division by zero in #if
include/linux/jiffies.h:204:31: warning: "CLOCK_TICK_RATE" is not defined
include/linux/jiffies.h:204:31: warning: "CLOCK_TICK_RATE" is not defined
include/linux/jiffies.h:204:31: warning: "HZ" is not defined
include/linux/jiffies.h:204:31: warning: "HZ" is not defined
include/linux/jiffies.h:204:31: error: division by zero in #if
include/linux/jiffies.h:204:31: error: division by zero in #if
include/linux/jiffies.h:204:31: warning: "CLOCK_TICK_RATE" is not defined
include/linux/jiffies.h:204:31: warning: "CLOCK_TICK_RATE" is not defined
include/linux/jiffies.h:204:31: warning: "HZ" is not defined
include/linux/jiffies.h:204:31: warning: "HZ" is not defined
include/linux/jiffies.h:204:31: error: division by zero in #if
include/linux/jiffies.h:204:31: error: division by zero in #if
include/linux/jiffies.h:204:31: warning: "CLOCK_TICK_RATE" is not defined
include/linux/jiffies.h:204:31: warning: "HZ" is not defined
include/linux/jiffies.h:204:31: warning: "HZ" is not defined
include/linux/jiffies.h:204:31: error: division by zero in #if
include/linux/jiffies.h:204:31: warning: "CLOCK_TICK_RATE" is not defined
include/linux/jiffies.h:204:31: warning: "HZ" is not defined
include/linux/jiffies.h:204:31: warning: "HZ" is not defined
include/linux/jiffies.h:204:31: error: division by zero in #if
include/linux/jiffies.h:204:31: error: division by zero in #if
include/linux/jiffies.h:204:31: warning: "CLOCK_TICK_RATE" is not defined
include/linux/jiffies.h:204:31: warning: "CLOCK_TICK_RATE" is not defined
include/linux/jiffies.h:204:31: warning: "HZ" is not defined
include/linux/jiffies.h:204:31: warning: "HZ" is not defined
include/linux/jiffies.h:204:31: error: division by zero in #if
include/linux/jiffies.h:204:31: error: division by zero in #if
include/linux/jiffies.h:204:31: warning: "CLOCK_TICK_RATE" is not defined
include/linux/jiffies.h:204:31: warning: "CLOCK_TICK_RATE" is not defined
include/linux/jiffies.h:204:31: warning: "HZ" is not defined
include/linux/jiffies.h:204:31: warning: "HZ" is not defined
include/linux/jiffies.h:204:31: error: division by zero in #if
include/linux/jiffies.h:204:31: error: division by zero in #if
include/linux/jiffies.h:204:31: warning: "CLOCK_TICK_RATE" is not defined
include/linux/jiffies.h:204:31: warning: "HZ" is not defined
include/linux/jiffies.h:204:31: warning: "HZ" is not defined
include/linux/jiffies.h:204:31: error: division by zero in #if
include/linux/jiffies.h:204:31: warning: "CLOCK_TICK_RATE" is not defined
include/linux/jiffies.h:204:31: warning: "HZ" is not defined
include/linux/jiffies.h:204:31: warning: "HZ" is not defined
include/linux/jiffies.h:204:31: error: division by zero in #if
include/linux/jiffies.h:204:31: error: division by zero in #if
include/linux/jiffies.h:204:31: error: division by zero in #if
include/linux/jiffies.h:204:46: warning: "SHIFT_HZ" is not defined
include/linux/jiffies.h:231:5: warning: "BITS_PER_LONG" is not defined
include/linux/jiffies.h:248:5: warning: "HZ" is not defined
include/linux/jiffies.h:248:44: warning: "HZ" is not defined
include/linux/jiffies.h:248:46: error: division by zero in #if
include/linux/jiffies.h:250:7: warning: "HZ" is not defined
include/linux/jiffies.h: In function 'jiffies_to_msecs':
include/linux/jiffies.h:253: error: 'HZ' undeclared (first use in this function)
include/linux/jiffies.h:259:5: warning: "HZ" is not defined
include/linux/jiffies.h:259:44: warning: "HZ" is not defined
include/linux/jiffies.h:259:46: error: division by zero in #if
include/linux/jiffies.h:261:7: warning: "HZ" is not defined
include/linux/jiffies.h: In function 'jiffies_to_usecs':
include/linux/jiffies.h:264: error: 'HZ' undeclared (first use in this function)
include/linux/jiffies.h:272:5: warning: "HZ" is not defined
include/linux/jiffies.h:272:44: warning: "HZ" is not defined
include/linux/jiffies.h:272:46: error: division by zero in #if
include/linux/jiffies.h:274:7: warning: "HZ" is not defined
include/linux/jiffies.h: In function 'msecs_to_jiffies':
include/linux/jiffies.h:277: error: 'HZ' undeclared (first use in this function)
include/linux/jiffies.h:285:5: warning: "HZ" is not defined
include/linux/jiffies.h:285:44: warning: "HZ" is not defined
include/linux/jiffies.h:285:46: error: division by zero in #if
include/linux/jiffies.h:287:7: warning: "HZ" is not defined
include/linux/jiffies.h: In function 'usecs_to_jiffies':
include/linux/jiffies.h:290: error: 'HZ' undeclared (first use in this function)
include/linux/jiffies.h: In function 'timespec_to_jiffies':
include/linux/jiffies.h:308: error: 'const struct timespec' has no member named 'tv_sec'
include/linux/jiffies.h:309: error: 'const struct timespec' has no member named 'tv_nsec'
include/linux/jiffies.h:309: error: 'CLOCK_TICK_RATE' undeclared (first use in this function)
include/linux/jiffies.h:309: error: 'HZ' undeclared (first use in this function)
include/linux/jiffies.h:311: error: called object 'u64' is not a function
include/linux/jiffies.h:311: error: called object 'u64' is not a function
include/linux/jiffies.h:312: error: called object 'u64' is not a functionmake[2]: *** [/root/usb-rndis-lite/usbnet.o] Interrupt
make[1]: *** [_module_/root/usb-rndis-lite] Interrupt
make: *** [default] Interrupt