All pastes #282286 Raw Edit

Something

public text v1 · immutable
#282286 ·published 2006-12-17 13:13 UTC
rendered paste body
This file contains any messages produced by compilers while
running configure, to aid debugging if configure makes a mistake.

It was created by configure, which was
generated by GNU Autoconf 2.60.  Invocation command line was

  $ ./configure --prefix=/usr --host=i686-pc-linux-gnu --mandir=/usr/share/man --infodir=/usr/share/info --datadir=/usr/share --sysconfdir=/etc --localstatedir=/var/lib --with-x --enable-gtk --enable-python --enable-mono --enable-dnotify --disable-gcj --disable-selinux --disable-verbose-mode --disable-asserts --enable-glib --with-xml=expat --with-system-pid-file=/var/run/dbus.pid --with-system-socket=/var/run/dbus/system_bus_socket --with-session-socket-dir=/tmp --with-dbus-user=messagebus --localstatedir=/var --disable-doxygen-docs --disable-xml-docs --disable-mono-docs --enable-qt3=/usr/qt/3 --with-qt3-moc=/usr/qt/3/bin/moc --enable-qt --with-qt-moc=/usr/bin/moc --build=i686-pc-linux-gnu

## --------- ##
## Platform. ##
## --------- ##

hostname = localhost
uname -m = i686
uname -r = 2.6.18-gentoo-r2
uname -s = Linux
uname -v = #3 Sat Dec 9 15:07:35 CET 2006

/usr/bin/uname -p = Intel(R) Pentium(R) 4 CPU 2.40GHz
/bin/uname -X     = unknown

/bin/arch              = i686
/usr/bin/arch -k       = unknown
/usr/convex/getsysinfo = unknown
/usr/bin/hostinfo      = unknown
/bin/machine           = unknown
/usr/bin/oslevel       = unknown
/bin/universe          = unknown

PATH: /usr/qt/3/bin
PATH: /usr/local/sbin
PATH: /sbin
PATH: /usr/sbin
PATH: /usr/lib/portage/bin
PATH: /usr/local/bin
PATH: /bin
PATH: /usr/bin
PATH: /opt/bin
PATH: /usr/i686-pc-linux-gnu/gcc-bin/3.4.6
PATH: /opt/sun-jre-bin-1.5.0.06/bin
PATH: /opt/sun-jre-bin-1.5.0.06/javaws
PATH: /usr/kde/3.5/sbin
PATH: /usr/kde/3.5/bin
PATH: /usr/qt/3/bin
PATH: /usr/kde/3.4/sbin
PATH: /usr/kde/3.4/bin


## ----------- ##
## Core tests. ##
## ----------- ##

configure:2165: checking build system type
configure:2183: result: i686-pc-linux-gnu
configure:2205: checking host system type
configure:2220: result: i686-pc-linux-gnu
configure:2242: checking target system type
configure:2257: result: i686-pc-linux-gnu
configure:2300: checking for a BSD-compatible install
configure:2356: result: /bin/install -c
configure:2367: checking whether build environment is sane
configure:2410: result: yes
configure:2475: checking for gawk
configure:2491: found /bin/gawk
configure:2502: result: gawk
configure:2513: checking whether make sets $(MAKE)
configure:2534: result: yes
configure:2734: checking whether to enable maintainer-specific portions of Makefiles
configure:2743: result: no
configure:2789: checking for i686-pc-linux-gnu-gcc
configure:2805: found /usr/bin/i686-pc-linux-gnu-gcc
configure:2816: result: i686-pc-linux-gnu-gcc
configure:3094: checking for C compiler version
configure:3101: i686-pc-linux-gnu-gcc --version >&5
i686-pc-linux-gnu-gcc (GCC) 3.4.6 (Gentoo 3.4.6-r1, ssp-3.4.5-1.0, pie-8.7.9)
Copyright (C) 2006 Free Software Foundation, Inc.
This is free software; see the source for copying conditions.  There is NO
warranty; not even for MERCHANTABILITY or FITNESS FOR A PARTICULAR PURPOSE.

configure:3104: $? = 0
configure:3111: i686-pc-linux-gnu-gcc -v >&5
Reading specs from /usr/lib/gcc/i686-pc-linux-gnu/3.4.6/specs
Configured with: /var/tmp/portage/sys-devel/gcc-3.4.6-r1/work/gcc-3.4.6/configure --prefix=/usr --bindir=/usr/i686-pc-linux-gnu/gcc-bin/3.4.6 --includedir=/usr/lib/gcc/i686-pc-linux-gnu/3.4.6/include --datadir=/usr/share/gcc-data/i686-pc-linux-gnu/3.4.6 --mandir=/usr/share/gcc-data/i686-pc-linux-gnu/3.4.6/man --infodir=/usr/share/gcc-data/i686-pc-linux-gnu/3.4.6/info --with-gxx-include-dir=/usr/lib/gcc/i686-pc-linux-gnu/3.4.6/include/g++-v3 --host=i686-pc-linux-gnu --build=i686-pc-linux-gnu --disable-altivec --enable-nls --without-included-gettext --with-system-zlib --disable-checking --disable-werror --disable-libunwind-exceptions --disable-multilib --disable-libgcj --enable-languages=c,c++,f77 --enable-shared --enable-threads=posix --enable-__cxa_atexit --enable-clocale=gnu
Thread model: posix
gcc version 3.4.6 (Gentoo 3.4.6-r1, ssp-3.4.5-1.0, pie-8.7.9)
configure:3114: $? = 0
configure:3121: i686-pc-linux-gnu-gcc -V >&5
i686-pc-linux-gnu-gcc: `-V' option must have argument
configure:3124: $? = 1
configure:3147: checking for C compiler default output file name
configure:3174: i686-pc-linux-gnu-gcc -O2 -mtune=i686 -pipe -fno-stack-protector-all   conftest.c  >&5
configure:3177: $? = 0
configure:3223: result: a.out
configure:3228: checking whether the C compiler works
configure:3238: ./a.out
configure:3241: $? = 0
configure:3258: result: yes
configure:3265: checking whether we are cross compiling
configure:3267: result: no
configure:3270: checking for suffix of executables
configure:3277: i686-pc-linux-gnu-gcc -o conftest -O2 -mtune=i686 -pipe -fno-stack-protector-all   conftest.c  >&5
configure:3280: $? = 0
configure:3304: result: 
configure:3310: checking for suffix of object files
configure:3336: i686-pc-linux-gnu-gcc -c -O2 -mtune=i686 -pipe -fno-stack-protector-all  conftest.c >&5
configure:3339: $? = 0
configure:3362: result: o
configure:3366: checking whether we are using the GNU C compiler
configure:3395: i686-pc-linux-gnu-gcc -c -O2 -mtune=i686 -pipe -fno-stack-protector-all  conftest.c >&5
configure:3401: $? = 0
configure:3408: test -z "$ac_c_werror_flag" || test ! -s conftest.err
configure:3411: $? = 0
configure:3418: test -s conftest.o
configure:3421: $? = 0
configure:3435: result: yes
configure:3440: checking whether i686-pc-linux-gnu-gcc accepts -g
configure:3470: i686-pc-linux-gnu-gcc -c -g  conftest.c >&5
configure:3476: $? = 0
configure:3483: test -z "$ac_c_werror_flag" || test ! -s conftest.err
configure:3486: $? = 0
configure:3493: test -s conftest.o
configure:3496: $? = 0
configure:3626: result: yes
configure:3643: checking for i686-pc-linux-gnu-gcc option to accept ISO C89
configure:3717: i686-pc-linux-gnu-gcc  -c -O2 -mtune=i686 -pipe -fno-stack-protector-all  conftest.c >&5
configure:3723: $? = 0
configure:3730: test -z "$ac_c_werror_flag" || test ! -s conftest.err
configure:3733: $? = 0
configure:3740: test -s conftest.o
configure:3743: $? = 0
configure:3763: result: none needed
configure:3792: checking for style of include used by make
configure:3820: result: GNU
configure:3848: checking dependency style of i686-pc-linux-gnu-gcc
configure:3938: result: gcc3
configure:3969: checking for i686-pc-linux-gnu-g++
configure:3985: found /usr/bin/i686-pc-linux-gnu-g++
configure:3996: result: i686-pc-linux-gnu-g++
configure:4071: checking for C++ compiler version
configure:4078: i686-pc-linux-gnu-g++ --version >&5
i686-pc-linux-gnu-g++ (GCC) 3.4.6 (Gentoo 3.4.6-r1, ssp-3.4.5-1.0, pie-8.7.9)
Copyright (C) 2006 Free Software Foundation, Inc.
This is free software; see the source for copying conditions.  There is NO
warranty; not even for MERCHANTABILITY or FITNESS FOR A PARTICULAR PURPOSE.

configure:4081: $? = 0
configure:4088: i686-pc-linux-gnu-g++ -v >&5
Reading specs from /usr/lib/gcc/i686-pc-linux-gnu/3.4.6/specs
Configured with: /var/tmp/portage/sys-devel/gcc-3.4.6-r1/work/gcc-3.4.6/configure --prefix=/usr --bindir=/usr/i686-pc-linux-gnu/gcc-bin/3.4.6 --includedir=/usr/lib/gcc/i686-pc-linux-gnu/3.4.6/include --datadir=/usr/share/gcc-data/i686-pc-linux-gnu/3.4.6 --mandir=/usr/share/gcc-data/i686-pc-linux-gnu/3.4.6/man --infodir=/usr/share/gcc-data/i686-pc-linux-gnu/3.4.6/info --with-gxx-include-dir=/usr/lib/gcc/i686-pc-linux-gnu/3.4.6/include/g++-v3 --host=i686-pc-linux-gnu --build=i686-pc-linux-gnu --disable-altivec --enable-nls --without-included-gettext --with-system-zlib --disable-checking --disable-werror --disable-libunwind-exceptions --disable-multilib --disable-libgcj --enable-languages=c,c++,f77 --enable-shared --enable-threads=posix --enable-__cxa_atexit --enable-clocale=gnu
Thread model: posix
gcc version 3.4.6 (Gentoo 3.4.6-r1, ssp-3.4.5-1.0, pie-8.7.9)
configure:4091: $? = 0
configure:4098: i686-pc-linux-gnu-g++ -V >&5
i686-pc-linux-gnu-g++: `-V' option must have argument
configure:4101: $? = 1
configure:4104: checking whether we are using the GNU C++ compiler
configure:4133: i686-pc-linux-gnu-g++ -c -O2 -mtune=i686 -pipe -fno-stack-protector-all  conftest.cpp >&5
configure:4139: $? = 0
configure:4146: test -z "$ac_cxx_werror_flag" || test ! -s conftest.err
configure:4149: $? = 0
configure:4156: test -s conftest.o
configure:4159: $? = 0
configure:4173: result: yes
configure:4178: checking whether i686-pc-linux-gnu-g++ accepts -g
configure:4208: i686-pc-linux-gnu-g++ -c -g  conftest.cpp >&5
configure:4214: $? = 0
configure:4221: test -z "$ac_cxx_werror_flag" || test ! -s conftest.err
configure:4224: $? = 0
configure:4231: test -s conftest.o
configure:4234: $? = 0
configure:4364: result: yes
configure:4389: checking dependency style of i686-pc-linux-gnu-g++
configure:4479: result: gcc3
configure:4497: checking for library containing strerror
configure:4538: i686-pc-linux-gnu-gcc -o conftest -O2 -mtune=i686 -pipe -fno-stack-protector-all   conftest.c  >&5
configure:4544: $? = 0
configure:4551: test -z "$ac_c_werror_flag" || test ! -s conftest.err
configure:4554: $? = 0
configure:4561: test -s conftest
configure:4564: $? = 0
configure:4588: result: none required
configure:4601: checking how to run the C preprocessor
configure:4641: i686-pc-linux-gnu-gcc -E  conftest.c
configure:4647: $? = 0
configure:4685: i686-pc-linux-gnu-gcc -E  conftest.c
conftest.c:11:28: ac_nonexistent.h: No such file or directory
configure:4691: $? = 1
configure: failed program was:
| /* confdefs.h.  */
| #define PACKAGE_NAME ""
| #define PACKAGE_TARNAME ""
| #define PACKAGE_VERSION ""
| #define PACKAGE_STRING ""
| #define PACKAGE_BUGREPORT ""
| #define PACKAGE "dbus"
| #define VERSION "0.62"
| #define GETTEXT_PACKAGE "dbus-1"
| /* end confdefs.h.  */
| #include <ac_nonexistent.h>
configure:4731: result: i686-pc-linux-gnu-gcc -E
configure:4760: i686-pc-linux-gnu-gcc -E  conftest.c
configure:4766: $? = 0
configure:4804: i686-pc-linux-gnu-gcc -E  conftest.c
conftest.c:11:28: ac_nonexistent.h: No such file or directory
configure:4810: $? = 1
configure: failed program was:
| /* confdefs.h.  */
| #define PACKAGE_NAME ""
| #define PACKAGE_TARNAME ""
| #define PACKAGE_VERSION ""
| #define PACKAGE_STRING ""
| #define PACKAGE_BUGREPORT ""
| #define PACKAGE "dbus"
| #define VERSION "0.62"
| #define GETTEXT_PACKAGE "dbus-1"
| /* end confdefs.h.  */
| #include <ac_nonexistent.h>
configure:4855: checking for grep that handles long lines and -e
configure:4929: result: /bin/grep
configure:4934: checking for egrep
configure:5012: result: /bin/grep -E
configure:5017: checking for ANSI C header files
configure:5047: i686-pc-linux-gnu-gcc -c -O2 -mtune=i686 -pipe -fno-stack-protector-all  conftest.c >&5
configure:5053: $? = 0
configure:5060: test -z "$ac_c_werror_flag" || test ! -s conftest.err
configure:5063: $? = 0
configure:5070: test -s conftest.o
configure:5073: $? = 0
configure:5169: i686-pc-linux-gnu-gcc -o conftest -O2 -mtune=i686 -pipe -fno-stack-protector-all   conftest.c  >&5
configure:5172: $? = 0
configure:5178: ./conftest
configure:5181: $? = 0
configure:5198: result: yes
configure:5570: checking for gcj
configure:5600: result: no
configure:5618: checking for gcj
configure:5645: result: gcj
configure:5667: checking dependency style of gcj
configure:5757: result: none
configure:5925: checking for a sed that does not truncate output
configure:5979: result: /bin/sed
configure:5993: checking for ld used by i686-pc-linux-gnu-gcc
configure:6060: result: /usr/i686-pc-linux-gnu/bin/ld
configure:6069: checking if the linker (/usr/i686-pc-linux-gnu/bin/ld) is GNU ld
configure:6084: result: yes
configure:6089: checking for /usr/i686-pc-linux-gnu/bin/ld option to reload object files
configure:6096: result: -r
configure:6114: checking for BSD-compatible nm
configure:6163: result: /usr/bin/nm -B
configure:6167: checking whether ln -s works
configure:6171: result: yes
configure:6178: checking how to recognise dependent libraries
configure:6354: result: pass_all
configure:6612: checking for sys/types.h
configure:6633: i686-pc-linux-gnu-gcc -c -O2 -mtune=i686 -pipe -fno-stack-protector-all -Wall -Wchar-subscripts -Wmissing-declarations -Wmissing-prototypes -Wnested-externs -Wpointer-arith -Wcast-align -Wfloat-equal -Wsign-compare  conftest.c >&5
configure:6639: $? = 0
configure:6646: test -z "$ac_c_werror_flag" || test ! -s conftest.err
configure:6649: $? = 0
configure:6656: test -s conftest.o
configure:6659: $? = 0
configure:6672: result: yes
configure:6612: checking for sys/stat.h
configure:6633: i686-pc-linux-gnu-gcc -c -O2 -mtune=i686 -pipe -fno-stack-protector-all -Wall -Wchar-subscripts -Wmissing-declarations -Wmissing-prototypes -Wnested-externs -Wpointer-arith -Wcast-align -Wfloat-equal -Wsign-compare  conftest.c >&5
configure:6639: $? = 0
configure:6646: test -z "$ac_c_werror_flag" || test ! -s conftest.err
configure:6649: $? = 0
configure:6656: test -s conftest.o
configure:6659: $? = 0
configure:6672: result: yes
configure:6612: checking for stdlib.h
configure:6633: i686-pc-linux-gnu-gcc -c -O2 -mtune=i686 -pipe -fno-stack-protector-all -Wall -Wchar-subscripts -Wmissing-declarations -Wmissing-prototypes -Wnested-externs -Wpointer-arith -Wcast-align -Wfloat-equal -Wsign-compare  conftest.c >&5
configure:6639: $? = 0
configure:6646: test -z "$ac_c_werror_flag" || test ! -s conftest.err
configure:6649: $? = 0
configure:6656: test -s conftest.o
configure:6659: $? = 0
configure:6672: result: yes
configure:6612: checking for string.h
configure:6633: i686-pc-linux-gnu-gcc -c -O2 -mtune=i686 -pipe -fno-stack-protector-all -Wall -Wchar-subscripts -Wmissing-declarations -Wmissing-prototypes -Wnested-externs -Wpointer-arith -Wcast-align -Wfloat-equal -Wsign-compare  conftest.c >&5
configure:6639: $? = 0
configure:6646: test -z "$ac_c_werror_flag" || test ! -s conftest.err
configure:6649: $? = 0
configure:6656: test -s conftest.o
configure:6659: $? = 0
configure:6672: result: yes
configure:6612: checking for memory.h
configure:6633: i686-pc-linux-gnu-gcc -c -O2 -mtune=i686 -pipe -fno-stack-protector-all -Wall -Wchar-subscripts -Wmissing-declarations -Wmissing-prototypes -Wnested-externs -Wpointer-arith -Wcast-align -Wfloat-equal -Wsign-compare  conftest.c >&5
configure:6639: $? = 0
configure:6646: test -z "$ac_c_werror_flag" || test ! -s conftest.err
configure:6649: $? = 0
configure:6656: test -s conftest.o
configure:6659: $? = 0
configure:6672: result: yes
configure:6612: checking for strings.h
configure:6633: i686-pc-linux-gnu-gcc -c -O2 -mtune=i686 -pipe -fno-stack-protector-all -Wall -Wchar-subscripts -Wmissing-declarations -Wmissing-prototypes -Wnested-externs -Wpointer-arith -Wcast-align -Wfloat-equal -Wsign-compare  conftest.c >&5
configure:6639: $? = 0
configure:6646: test -z "$ac_c_werror_flag" || test ! -s conftest.err
configure:6649: $? = 0
configure:6656: test -s conftest.o
configure:6659: $? = 0
configure:6672: result: yes
configure:6612: checking for inttypes.h
configure:6633: i686-pc-linux-gnu-gcc -c -O2 -mtune=i686 -pipe -fno-stack-protector-all -Wall -Wchar-subscripts -Wmissing-declarations -Wmissing-prototypes -Wnested-externs -Wpointer-arith -Wcast-align -Wfloat-equal -Wsign-compare  conftest.c >&5
configure:6639: $? = 0
configure:6646: test -z "$ac_c_werror_flag" || test ! -s conftest.err
configure:6649: $? = 0
configure:6656: test -s conftest.o
configure:6659: $? = 0
configure:6672: result: yes
configure:6612: checking for stdint.h
configure:6633: i686-pc-linux-gnu-gcc -c -O2 -mtune=i686 -pipe -fno-stack-protector-all -Wall -Wchar-subscripts -Wmissing-declarations -Wmissing-prototypes -Wnested-externs -Wpointer-arith -Wcast-align -Wfloat-equal -Wsign-compare  conftest.c >&5
configure:6639: $? = 0
configure:6646: test -z "$ac_c_werror_flag" || test ! -s conftest.err
configure:6649: $? = 0
configure:6656: test -s conftest.o
configure:6659: $? = 0
configure:6672: result: yes
configure:6612: checking for unistd.h
configure:6633: i686-pc-linux-gnu-gcc -c -O2 -mtune=i686 -pipe -fno-stack-protector-all -Wall -Wchar-subscripts -Wmissing-declarations -Wmissing-prototypes -Wnested-externs -Wpointer-arith -Wcast-align -Wfloat-equal -Wsign-compare  conftest.c >&5
configure:6639: $? = 0
configure:6646: test -z "$ac_c_werror_flag" || test ! -s conftest.err
configure:6649: $? = 0
configure:6656: test -s conftest.o
configure:6659: $? = 0
configure:6672: result: yes
configure:6699: checking dlfcn.h usability
configure:6716: i686-pc-linux-gnu-gcc -c -O2 -mtune=i686 -pipe -fno-stack-protector-all -Wall -Wchar-subscripts -Wmissing-declarations -Wmissing-prototypes -Wnested-externs -Wpointer-arith -Wcast-align -Wfloat-equal -Wsign-compare  conftest.c >&5
configure:6722: $? = 0
configure:6729: test -z "$ac_c_werror_flag" || test ! -s conftest.err
configure:6732: $? = 0
configure:6739: test -s conftest.o
configure:6742: $? = 0
configure:6753: result: yes
configure:6757: checking dlfcn.h presence
configure:6772: i686-pc-linux-gnu-gcc -E  conftest.c
configure:6778: $? = 0
configure:6799: result: yes
configure:6827: checking for dlfcn.h
configure:6835: result: yes
configure:6858: checking how to run the C++ preprocessor
configure:6894: i686-pc-linux-gnu-g++ -E  conftest.cpp
configure:6900: $? = 0
configure:6938: i686-pc-linux-gnu-g++ -E  conftest.cpp
conftest.cpp:24:28: ac_nonexistent.h: No such file or directory
configure:6944: $? = 1
configure: failed program was:
| /* confdefs.h.  */
| #define PACKAGE_NAME ""
| #define PACKAGE_TARNAME ""
| #define PACKAGE_VERSION ""
| #define PACKAGE_STRING ""
| #define PACKAGE_BUGREPORT ""
| #define PACKAGE "dbus"
| #define VERSION "0.62"
| #define GETTEXT_PACKAGE "dbus-1"
| #define STDC_HEADERS 1
| #define DBUS_DISABLE_ASSERT 1
| #define G_DISABLE_ASSERT 1
| #define HAVE_SYS_TYPES_H 1
| #define HAVE_SYS_STAT_H 1
| #define HAVE_STDLIB_H 1
| #define HAVE_STRING_H 1
| #define HAVE_MEMORY_H 1
| #define HAVE_STRINGS_H 1
| #define HAVE_INTTYPES_H 1
| #define HAVE_STDINT_H 1
| #define HAVE_UNISTD_H 1
| #define HAVE_DLFCN_H 1
| /* end confdefs.h.  */
| #include <ac_nonexistent.h>
configure:6984: result: i686-pc-linux-gnu-g++ -E
configure:7013: i686-pc-linux-gnu-g++ -E  conftest.cpp
configure:7019: $? = 0
configure:7057: i686-pc-linux-gnu-g++ -E  conftest.cpp
conftest.cpp:24:28: ac_nonexistent.h: No such file or directory
configure:7063: $? = 1
configure: failed program was:
| /* confdefs.h.  */
| #define PACKAGE_NAME ""
| #define PACKAGE_TARNAME ""
| #define PACKAGE_VERSION ""
| #define PACKAGE_STRING ""
| #define PACKAGE_BUGREPORT ""
| #define PACKAGE "dbus"
| #define VERSION "0.62"
| #define GETTEXT_PACKAGE "dbus-1"
| #define STDC_HEADERS 1
| #define DBUS_DISABLE_ASSERT 1
| #define G_DISABLE_ASSERT 1
| #define HAVE_SYS_TYPES_H 1
| #define HAVE_SYS_STAT_H 1
| #define HAVE_STDLIB_H 1
| #define HAVE_STRING_H 1
| #define HAVE_MEMORY_H 1
| #define HAVE_STRINGS_H 1
| #define HAVE_INTTYPES_H 1
| #define HAVE_STDINT_H 1
| #define HAVE_UNISTD_H 1
| #define HAVE_DLFCN_H 1
| /* end confdefs.h.  */
| #include <ac_nonexistent.h>
configure:7119: checking for i686-pc-linux-gnu-g77
configure:7135: found /usr/bin/i686-pc-linux-gnu-g77
configure:7146: result: i686-pc-linux-gnu-g77
configure:7220: checking for Fortran 77 compiler version
configure:7227: i686-pc-linux-gnu-g77 --version >&5
GNU Fortran (GCC) 3.4.6 (Gentoo 3.4.6-r1, ssp-3.4.5-1.0, pie-8.7.9)
Copyright (C) 2006 Free Software Foundation, Inc.

GNU Fortran comes with NO WARRANTY, to the extent permitted by law.
You may redistribute copies of GNU Fortran
under the terms of the GNU General Public License.
For more information about these matters, see the file named COPYING
or type the command `info -f g77 Copying'.
configure:7230: $? = 0
configure:7237: i686-pc-linux-gnu-g77 -v >&5
Reading specs from /usr/lib/gcc/i686-pc-linux-gnu/3.4.6/specs
Configured with: /var/tmp/portage/sys-devel/gcc-3.4.6-r1/work/gcc-3.4.6/configure --prefix=/usr --bindir=/usr/i686-pc-linux-gnu/gcc-bin/3.4.6 --includedir=/usr/lib/gcc/i686-pc-linux-gnu/3.4.6/include --datadir=/usr/share/gcc-data/i686-pc-linux-gnu/3.4.6 --mandir=/usr/share/gcc-data/i686-pc-linux-gnu/3.4.6/man --infodir=/usr/share/gcc-data/i686-pc-linux-gnu/3.4.6/info --with-gxx-include-dir=/usr/lib/gcc/i686-pc-linux-gnu/3.4.6/include/g++-v3 --host=i686-pc-linux-gnu --build=i686-pc-linux-gnu --disable-altivec --enable-nls --without-included-gettext --with-system-zlib --disable-checking --disable-werror --disable-libunwind-exceptions --disable-multilib --disable-libgcj --enable-languages=c,c++,f77 --enable-shared --enable-threads=posix --enable-__cxa_atexit --enable-clocale=gnu
Thread model: posix
gcc version 3.4.6 (Gentoo 3.4.6-r1, ssp-3.4.5-1.0, pie-8.7.9)
configure:7240: $? = 0
configure:7247: i686-pc-linux-gnu-g77 -V >&5
i686-pc-linux-gnu-g77: `-V' option must have argument
configure:7250: $? = 1
configure:7258: checking whether we are using the GNU Fortran 77 compiler
configure:7277: i686-pc-linux-gnu-g77 -c  conftest.F >&5
configure:7283: $? = 0
configure:7290: test -z "$ac_f77_werror_flag" || test ! -s conftest.err
configure:7293: $? = 0
configure:7300: test -s conftest.o
configure:7303: $? = 0
configure:7317: result: yes
configure:7323: checking whether i686-pc-linux-gnu-g77 accepts -g
configure:7340: i686-pc-linux-gnu-g77 -c -g conftest.f >&5
configure:7346: $? = 0
configure:7353: test -z "$ac_f77_werror_flag" || test ! -s conftest.err
configure:7356: $? = 0
configure:7363: test -s conftest.o
configure:7366: $? = 0
configure:7379: result: yes
configure:7409: checking the maximum length of command line arguments
configure:7518: result: 32768
configure:7529: checking command to parse /usr/bin/nm -B output from i686-pc-linux-gnu-gcc object
configure:7634: i686-pc-linux-gnu-gcc -c -O2 -mtune=i686 -pipe -fno-stack-protector-all -Wall -Wchar-subscripts -Wmissing-declarations -Wmissing-prototypes -Wnested-externs -Wpointer-arith -Wcast-align -Wfloat-equal -Wsign-compare  conftest.c >&5
conftest.c:5: warning: no previous prototype for 'nm_test_func'
configure:7637: $? = 0
configure:7641: /usr/bin/nm -B conftest.o \| sed -n -e 's/^.*[ 	]\([ABCDGIRSTW][ABCDGIRSTW]*\)[ 	][ 	]*\([_A-Za-z][_A-Za-z0-9]*\)$/\1 \2 \2/p' \> conftest.nm
configure:7644: $? = 0
configure:7696: i686-pc-linux-gnu-gcc -o conftest -O2 -mtune=i686 -pipe -fno-stack-protector-all -Wall -Wchar-subscripts -Wmissing-declarations -Wmissing-prototypes -Wnested-externs -Wpointer-arith -Wcast-align -Wfloat-equal -Wsign-compare   conftest.c conftstm.o >&5
configure:7699: $? = 0
configure:7737: result: ok
configure:7741: checking for objdir
configure:7756: result: .libs
configure:7808: checking for i686-pc-linux-gnu-ar
configure:7824: found /usr/bin/i686-pc-linux-gnu-ar
configure:7835: result: i686-pc-linux-gnu-ar
configure:7904: checking for i686-pc-linux-gnu-ranlib
configure:7920: found /usr/bin/i686-pc-linux-gnu-ranlib
configure:7931: result: i686-pc-linux-gnu-ranlib
configure:8000: checking for i686-pc-linux-gnu-strip
configure:8016: found /usr/bin/i686-pc-linux-gnu-strip
configure:8027: result: i686-pc-linux-gnu-strip
configure:8304: checking for correct ltmain.sh version
configure:8354: result: yes
configure:8414: checking if i686-pc-linux-gnu-gcc supports -fno-rtti -fno-exceptions
configure:8432: i686-pc-linux-gnu-gcc -c -O2 -mtune=i686 -pipe -fno-stack-protector-all -Wall -Wchar-subscripts -Wmissing-declarations -Wmissing-prototypes -Wnested-externs -Wpointer-arith -Wcast-align -Wfloat-equal -Wsign-compare  -fno-rtti -fno-exceptions conftest.c >&5
cc1: warning: command line option "-fno-rtti" is valid for C++/ObjC++ but not for C
configure:8436: $? = 0
configure:8449: result: no
configure:8464: checking for i686-pc-linux-gnu-gcc option to produce PIC
configure:8674: result: -fPIC
configure:8682: checking if i686-pc-linux-gnu-gcc PIC flag -fPIC works
configure:8700: i686-pc-linux-gnu-gcc -c -O2 -mtune=i686 -pipe -fno-stack-protector-all -Wall -Wchar-subscripts -Wmissing-declarations -Wmissing-prototypes -Wnested-externs -Wpointer-arith -Wcast-align -Wfloat-equal -Wsign-compare  -fPIC -DPIC conftest.c >&5
configure:8704: $? = 0
configure:8717: result: yes
configure:8745: checking if i686-pc-linux-gnu-gcc static flag -static works
configure:8773: result: yes
configure:8783: checking if i686-pc-linux-gnu-gcc supports -c -o file.o
configure:8804: i686-pc-linux-gnu-gcc -c -O2 -mtune=i686 -pipe -fno-stack-protector-all -Wall -Wchar-subscripts -Wmissing-declarations -Wmissing-prototypes -Wnested-externs -Wpointer-arith -Wcast-align -Wfloat-equal -Wsign-compare  -o out/conftest2.o conftest.c >&5
configure:8808: $? = 0
configure:8830: result: yes
configure:8856: checking whether the i686-pc-linux-gnu-gcc linker (/usr/i686-pc-linux-gnu/bin/ld) supports shared libraries
configure:9842: result: yes
configure:9863: checking whether -lc should be explicitly linked in
configure:9868: i686-pc-linux-gnu-gcc -c -O2 -mtune=i686 -pipe -fno-stack-protector-all -Wall -Wchar-subscripts -Wmissing-declarations -Wmissing-prototypes -Wnested-externs -Wpointer-arith -Wcast-align -Wfloat-equal -Wsign-compare  conftest.c >&5
configure:9871: $? = 0
configure:9886: i686-pc-linux-gnu-gcc -shared conftest.o  -v -Wl,-soname -Wl,conftest -o conftest 2\>\&1 \| grep  -lc  \>/dev/null 2\>\&1
configure:9889: $? = 0
configure:9901: result: no
configure:9909: checking dynamic linker characteristics
configure:10534: result: GNU/Linux ld.so
configure:10543: checking how to hardcode library paths into programs
configure:10568: result: immediate
configure:10582: checking whether stripping libraries is possible
configure:10587: result: yes
configure:11500: checking if libtool supports shared libraries
configure:11502: result: yes
configure:11505: checking whether to build shared libraries
configure:11526: result: yes
configure:11529: checking whether to build static libraries
configure:11533: result: yes
configure:11625: creating libtool
configure:12213: checking for ld used by i686-pc-linux-gnu-g++
configure:12280: result: /usr/i686-pc-linux-gnu/bin/ld
configure:12289: checking if the linker (/usr/i686-pc-linux-gnu/bin/ld) is GNU ld
configure:12304: result: yes
configure:12355: checking whether the i686-pc-linux-gnu-g++ linker (/usr/i686-pc-linux-gnu/bin/ld) supports shared libraries
configure:13321: result: yes
configure:13339: i686-pc-linux-gnu-g++ -c -O2 -mtune=i686 -pipe -fno-stack-protector-all  conftest.cpp >&5
configure:13342: $? = 0
configure:13461: checking for i686-pc-linux-gnu-g++ option to produce PIC
configure:13735: result: -fPIC
configure:13743: checking if i686-pc-linux-gnu-g++ PIC flag -fPIC works
configure:13761: i686-pc-linux-gnu-g++ -c -O2 -mtune=i686 -pipe -fno-stack-protector-all  -fPIC -DPIC conftest.cpp >&5
configure:13765: $? = 0
configure:13778: result: yes
configure:13806: checking if i686-pc-linux-gnu-g++ static flag -static works
configure:13834: result: yes
configure:13844: checking if i686-pc-linux-gnu-g++ supports -c -o file.o
configure:13865: i686-pc-linux-gnu-g++ -c -O2 -mtune=i686 -pipe -fno-stack-protector-all  -o out/conftest2.o conftest.cpp >&5
configure:13869: $? = 0
configure:13891: result: yes
configure:13917: checking whether the i686-pc-linux-gnu-g++ linker (/usr/i686-pc-linux-gnu/bin/ld) supports shared libraries
configure:13942: result: yes
configure:14009: checking dynamic linker characteristics
configure:14634: result: GNU/Linux ld.so
configure:14643: checking how to hardcode library paths into programs
configure:14668: result: immediate
configure:15194: checking if libtool supports shared libraries
configure:15196: result: yes
configure:15199: checking whether to build shared libraries
configure:15219: result: yes
configure:15222: checking whether to build static libraries
configure:15226: result: yes
configure:15236: checking for i686-pc-linux-gnu-g77 option to produce PIC
configure:15446: result: -fPIC
configure:15454: checking if i686-pc-linux-gnu-g77 PIC flag -fPIC works
configure:15472: i686-pc-linux-gnu-g77 -c -g -O2 -fPIC conftest.f >&5
configure:15476: $? = 0
configure:15489: result: yes
configure:15517: checking if i686-pc-linux-gnu-g77 static flag -static works
configure:15545: result: yes
configure:15555: checking if i686-pc-linux-gnu-g77 supports -c -o file.o
configure:15576: i686-pc-linux-gnu-g77 -c -g -O2 -o out/conftest2.o conftest.f >&5
configure:15580: $? = 0
configure:15602: result: yes
configure:15628: checking whether the i686-pc-linux-gnu-g77 linker (/usr/i686-pc-linux-gnu/bin/ld) supports shared libraries
configure:16594: result: yes
configure:16661: checking dynamic linker characteristics
configure:17286: result: GNU/Linux ld.so
configure:17295: checking how to hardcode library paths into programs
configure:17320: result: immediate
configure:17825: checking if gcj supports -fno-rtti -fno-exceptions
configure:17860: result: no
configure:17875: checking for gcj option to produce PIC
configure:18085: result: -fPIC
configure:18093: checking if gcj PIC flag -fPIC works
configure:18111: gcj -c -O2 -mtune=i686 -pipe -fno-stack-protector-all -Wall -Wchar-subscripts -Wmissing-declarations -Wmissing-prototypes -Wnested-externs -Wpointer-arith -Wcast-align -Wfloat-equal -Wsign-compare  -fPIC conftest.java >&5
./configure: line 18112: gcj: command not found
configure:18115: $? = 127
configure:18128: result: no
configure:18156: checking if gcj static flag -static works
configure:18184: result: no
configure:18194: checking if gcj supports -c -o file.o
configure:18215: gcj -c -O2 -mtune=i686 -pipe -fno-stack-protector-all -Wall -Wchar-subscripts -Wmissing-declarations -Wmissing-prototypes -Wnested-externs -Wpointer-arith -Wcast-align -Wfloat-equal -Wsign-compare  -o out/conftest2.o conftest.java >&5
./configure: line 18216: gcj: command not found
configure:18219: $? = 127
configure:18241: result: no
configure:18267: checking whether the gcj linker (/usr/i686-pc-linux-gnu/bin/ld) supports shared libraries
configure:19253: result: yes
configure:19320: checking dynamic linker characteristics
configure:19945: result: GNU/Linux ld.so
configure:19954: checking how to hardcode library paths into programs
configure:19979: result: immediate
configure:20959: checking for pkg-config
configure:20977: found /usr/bin/pkg-config
configure:20990: result: /usr/bin/pkg-config
configure:21008: checking for mono >= 0.95
configure:21012: result: yes
configure:21016: checking MONO_DEPENDENCY_CFLAGS
configure:21019: result: -D_REENTRANT -pthread -I/usr/lib/pkgconfig/../../include -I/usr/include/glib-2.0 -I/usr/lib/glib-2.0/include  
configure:21022: checking MONO_DEPENDENCY_LIBS
configure:21025: result: -Wl,--export-dynamic -pthread -L/usr/lib/pkgconfig/../../lib -lmono -lpthread -lm -lgmodule-2.0 -ldl -lgthread-2.0 -lglib-2.0  
configure:21148: checking for mono
configure:21166: found /usr/bin/mono
configure:21179: result: /usr/bin/mono
configure:21189: checking for mcs
configure:21207: found /usr/bin/mcs
configure:21220: result: /usr/bin/mcs
configure:21288: checking for gacutil
configure:21306: found /usr/bin/gacutil
configure:21319: result: /usr/bin/gacutil
configure:21465: checking for monodoc >= 1.1.10
configure:21469: result: yes
configure:21473: checking MONODOC_DEPENDENCY_CFLAGS
configure:21476: result:  
configure:21479: checking MONODOC_DEPENDENCY_LIBS
configure:21482: result: /r:/usr/lib/mono/monodoc/monodoc.dll  
configure:21813: checking for char
configure:21843: i686-pc-linux-gnu-gcc -c -O2 -mtune=i686 -pipe -fno-stack-protector-all -Wall -Wchar-subscripts -Wmissing-declarations -Wmissing-prototypes -Wnested-externs -Wpointer-arith -Wcast-align -Wfloat-equal -Wsign-compare -DDBUS_API_SUBJECT_TO_CHANGE=1  conftest.c >&5
configure:21849: $? = 0
configure:21856: test -z "$ac_c_werror_flag" || test ! -s conftest.err
configure:21859: $? = 0
configure:21866: test -s conftest.o
configure:21869: $? = 0
configure:21881: result: yes
configure:21884: checking size of char
configure:22272: i686-pc-linux-gnu-gcc -o conftest -O2 -mtune=i686 -pipe -fno-stack-protector-all -Wall -Wchar-subscripts -Wmissing-declarations -Wmissing-prototypes -Wnested-externs -Wpointer-arith -Wcast-align -Wfloat-equal -Wsign-compare -DDBUS_API_SUBJECT_TO_CHANGE=1   conftest.c  >&5
configure:22275: $? = 0
configure:22281: ./conftest
configure:22284: $? = 0
configure:22306: result: 1
configure:22313: checking for short
configure:22343: i686-pc-linux-gnu-gcc -c -O2 -mtune=i686 -pipe -fno-stack-protector-all -Wall -Wchar-subscripts -Wmissing-declarations -Wmissing-prototypes -Wnested-externs -Wpointer-arith -Wcast-align -Wfloat-equal -Wsign-compare -DDBUS_API_SUBJECT_TO_CHANGE=1  conftest.c >&5
configure:22349: $? = 0
configure:22356: test -z "$ac_c_werror_flag" || test ! -s conftest.err
configure:22359: $? = 0
configure:22366: test -s conftest.o
configure:22369: $? = 0
configure:22381: result: yes
configure:22384: checking size of short
configure:22772: i686-pc-linux-gnu-gcc -o conftest -O2 -mtune=i686 -pipe -fno-stack-protector-all -Wall -Wchar-subscripts -Wmissing-declarations -Wmissing-prototypes -Wnested-externs -Wpointer-arith -Wcast-align -Wfloat-equal -Wsign-compare -DDBUS_API_SUBJECT_TO_CHANGE=1   conftest.c  >&5
configure:22775: $? = 0
configure:22781: ./conftest
configure:22784: $? = 0
configure:22806: result: 2
configure:22813: checking for long
configure:22843: i686-pc-linux-gnu-gcc -c -O2 -mtune=i686 -pipe -fno-stack-protector-all -Wall -Wchar-subscripts -Wmissing-declarations -Wmissing-prototypes -Wnested-externs -Wpointer-arith -Wcast-align -Wfloat-equal -Wsign-compare -DDBUS_API_SUBJECT_TO_CHANGE=1  conftest.c >&5
configure:22849: $? = 0
configure:22856: test -z "$ac_c_werror_flag" || test ! -s conftest.err
configure:22859: $? = 0
configure:22866: test -s conftest.o
configure:22869: $? = 0
configure:22881: result: yes
configure:22884: checking size of long
configure:23272: i686-pc-linux-gnu-gcc -o conftest -O2 -mtune=i686 -pipe -fno-stack-protector-all -Wall -Wchar-subscripts -Wmissing-declarations -Wmissing-prototypes -Wnested-externs -Wpointer-arith -Wcast-align -Wfloat-equal -Wsign-compare -DDBUS_API_SUBJECT_TO_CHANGE=1   conftest.c  >&5
configure:23275: $? = 0
configure:23281: ./conftest
configure:23284: $? = 0
configure:23306: result: 4
configure:23313: checking for int
configure:23343: i686-pc-linux-gnu-gcc -c -O2 -mtune=i686 -pipe -fno-stack-protector-all -Wall -Wchar-subscripts -Wmissing-declarations -Wmissing-prototypes -Wnested-externs -Wpointer-arith -Wcast-align -Wfloat-equal -Wsign-compare -DDBUS_API_SUBJECT_TO_CHANGE=1  conftest.c >&5
configure:23349: $? = 0
configure:23356: test -z "$ac_c_werror_flag" || test ! -s conftest.err
configure:23359: $? = 0
configure:23366: test -s conftest.o
configure:23369: $? = 0
configure:23381: result: yes
configure:23384: checking size of int
configure:23772: i686-pc-linux-gnu-gcc -o conftest -O2 -mtune=i686 -pipe -fno-stack-protector-all -Wall -Wchar-subscripts -Wmissing-declarations -Wmissing-prototypes -Wnested-externs -Wpointer-arith -Wcast-align -Wfloat-equal -Wsign-compare -DDBUS_API_SUBJECT_TO_CHANGE=1   conftest.c  >&5
configure:23775: $? = 0
configure:23781: ./conftest
configure:23784: $? = 0
configure:23806: result: 4
configure:23813: checking for void *
configure:23843: i686-pc-linux-gnu-gcc -c -O2 -mtune=i686 -pipe -fno-stack-protector-all -Wall -Wchar-subscripts -Wmissing-declarations -Wmissing-prototypes -Wnested-externs -Wpointer-arith -Wcast-align -Wfloat-equal -Wsign-compare -DDBUS_API_SUBJECT_TO_CHANGE=1  conftest.c >&5
configure:23849: $? = 0
configure:23856: test -z "$ac_c_werror_flag" || test ! -s conftest.err
configure:23859: $? = 0
configure:23866: test -s conftest.o
configure:23869: $? = 0
configure:23881: result: yes
configure:23884: checking size of void *
configure:24272: i686-pc-linux-gnu-gcc -o conftest -O2 -mtune=i686 -pipe -fno-stack-protector-all -Wall -Wchar-subscripts -Wmissing-declarations -Wmissing-prototypes -Wnested-externs -Wpointer-arith -Wcast-align -Wfloat-equal -Wsign-compare -DDBUS_API_SUBJECT_TO_CHANGE=1   conftest.c  >&5
configure:24275: $? = 0
configure:24281: ./conftest
configure:24284: $? = 0
configure:24306: result: 4
configure:24313: checking for long long
configure:24343: i686-pc-linux-gnu-gcc -c -O2 -mtune=i686 -pipe -fno-stack-protector-all -Wall -Wchar-subscripts -Wmissing-declarations -Wmissing-prototypes -Wnested-externs -Wpointer-arith -Wcast-align -Wfloat-equal -Wsign-compare -DDBUS_API_SUBJECT_TO_CHANGE=1  conftest.c >&5
configure:24349: $? = 0
configure:24356: test -z "$ac_c_werror_flag" || test ! -s conftest.err
configure:24359: $? = 0
configure:24366: test -s conftest.o
configure:24369: $? = 0
configure:24381: result: yes
configure:24384: checking size of long long
configure:24772: i686-pc-linux-gnu-gcc -o conftest -O2 -mtune=i686 -pipe -fno-stack-protector-all -Wall -Wchar-subscripts -Wmissing-declarations -Wmissing-prototypes -Wnested-externs -Wpointer-arith -Wcast-align -Wfloat-equal -Wsign-compare -DDBUS_API_SUBJECT_TO_CHANGE=1   conftest.c  >&5
configure:24775: $? = 0
configure:24781: ./conftest
configure:24784: $? = 0
configure:24806: result: 8
configure:24813: checking for __int64
configure:24843: i686-pc-linux-gnu-gcc -c -O2 -mtune=i686 -pipe -fno-stack-protector-all -Wall -Wchar-subscripts -Wmissing-declarations -Wmissing-prototypes -Wnested-externs -Wpointer-arith -Wcast-align -Wfloat-equal -Wsign-compare -DDBUS_API_SUBJECT_TO_CHANGE=1  conftest.c >&5
conftest.c:63: error: syntax error before "ac__type_new_"
conftest.c:63: warning: type defaults to `int' in declaration of `ac__type_new_'
conftest.c:63: warning: data definition has no type or storage class
conftest.c: In function `main':
conftest.c:67: error: syntax error before ')' token
configure:24849: $? = 1
configure: failed program was:
| /* confdefs.h.  */
| #define PACKAGE_NAME ""
| #define PACKAGE_TARNAME ""
| #define PACKAGE_VERSION ""
| #define PACKAGE_STRING ""
| #define PACKAGE_BUGREPORT ""
| #define PACKAGE "dbus"
| #define VERSION "0.62"
| #define GETTEXT_PACKAGE "dbus-1"
| #define STDC_HEADERS 1
| #define DBUS_DISABLE_ASSERT 1
| #define G_DISABLE_ASSERT 1
| #define HAVE_SYS_TYPES_H 1
| #define HAVE_SYS_STAT_H 1
| #define HAVE_STDLIB_H 1
| #define HAVE_STRING_H 1
| #define HAVE_MEMORY_H 1
| #define HAVE_STRINGS_H 1
| #define HAVE_INTTYPES_H 1
| #define HAVE_STDINT_H 1
| #define HAVE_UNISTD_H 1
| #define HAVE_DLFCN_H 1
| #define SIZEOF_CHAR 1
| #define SIZEOF_SHORT 2
| #define SIZEOF_LONG 4
| #define SIZEOF_INT 4
| #define SIZEOF_VOID_P 4
| #define SIZEOF_LONG_LONG 8
| /* end confdefs.h.  */
| #include <stdio.h>
| #if HAVE_SYS_TYPES_H
| # include <sys/types.h>
| #endif
| #if HAVE_SYS_STAT_H
| # include <sys/stat.h>
| #endif
| #if STDC_HEADERS
| # include <stdlib.h>
| # include <stddef.h>
| #else
| # if HAVE_STDLIB_H
| #  include <stdlib.h>
| # endif
| #endif
| #if HAVE_STRING_H
| # if !STDC_HEADERS && HAVE_MEMORY_H
| #  include <memory.h>
| # endif
| # include <string.h>
| #endif
| #if HAVE_STRINGS_H
| # include <strings.h>
| #endif
| #if HAVE_INTTYPES_H
| # include <inttypes.h>
| #endif
| #if HAVE_STDINT_H
| # include <stdint.h>
| #endif
| #if HAVE_UNISTD_H
| # include <unistd.h>
| #endif
| typedef __int64 ac__type_new_;
| int
| main ()
| {
| if ((ac__type_new_ *) 0)
|   return 0;
| if (sizeof (ac__type_new_))
|   return 0;
|   ;
|   return 0;
| }
configure:24881: result: no
configure:24884: checking size of __int64
configure:25306: result: 0
configure:25315: checking 64-bit integer type
configure:25353: result: long long
configure:25363: checking 32-bit integer type
configure:25385: result: int
configure:25392: checking 16-bit integer type
configure:25411: result: short
configure:25418: checking whether byte ordering is bigendian
configure:25450: i686-pc-linux-gnu-gcc -c -O2 -mtune=i686 -pipe -fno-stack-protector-all -Wall -Wchar-subscripts -Wmissing-declarations -Wmissing-prototypes -Wnested-externs -Wpointer-arith -Wcast-align -Wfloat-equal -Wsign-compare -DDBUS_API_SUBJECT_TO_CHANGE=1  conftest.c >&5
configure:25456: $? = 0
configure:25463: test -z "$ac_c_werror_flag" || test ! -s conftest.err
configure:25466: $? = 0
configure:25473: test -s conftest.o
configure:25476: $? = 0
configure:25505: i686-pc-linux-gnu-gcc -c -O2 -mtune=i686 -pipe -fno-stack-protector-all -Wall -Wchar-subscripts -Wmissing-declarations -Wmissing-prototypes -Wnested-externs -Wpointer-arith -Wcast-align -Wfloat-equal -Wsign-compare -DDBUS_API_SUBJECT_TO_CHANGE=1  conftest.c >&5
conftest.c: In function `main':
conftest.c:38: error: `not' undeclared (first use in this function)
conftest.c:38: error: (Each undeclared identifier is reported only once
conftest.c:38: error: for each function it appears in.)
conftest.c:38: error: syntax error before "big"
configure:25511: $? = 1
configure: failed program was:
| /* confdefs.h.  */
| #define PACKAGE_NAME ""
| #define PACKAGE_TARNAME ""
| #define PACKAGE_VERSION ""
| #define PACKAGE_STRING ""
| #define PACKAGE_BUGREPORT ""
| #define PACKAGE "dbus"
| #define VERSION "0.62"
| #define GETTEXT_PACKAGE "dbus-1"
| #define STDC_HEADERS 1
| #define DBUS_DISABLE_ASSERT 1
| #define G_DISABLE_ASSERT 1
| #define HAVE_SYS_TYPES_H 1
| #define HAVE_SYS_STAT_H 1
| #define HAVE_STDLIB_H 1
| #define HAVE_STRING_H 1
| #define HAVE_MEMORY_H 1
| #define HAVE_STRINGS_H 1
| #define HAVE_INTTYPES_H 1
| #define HAVE_STDINT_H 1
| #define HAVE_UNISTD_H 1
| #define HAVE_DLFCN_H 1
| #define SIZEOF_CHAR 1
| #define SIZEOF_SHORT 2
| #define SIZEOF_LONG 4
| #define SIZEOF_INT 4
| #define SIZEOF_VOID_P 4
| #define SIZEOF_LONG_LONG 8
| #define SIZEOF___INT64 0
| /* end confdefs.h.  */
| #include <sys/types.h>
| #include <sys/param.h>
| 
| int
| main ()
| {
| #if BYTE_ORDER != BIG_ENDIAN
|  not big endian
| #endif
| 
|   ;
|   return 0;
| }
configure:25685: result: no
configure:25706: checking for an implementation of va_copy()
configure:25733: i686-pc-linux-gnu-gcc -o conftest -O2 -mtune=i686 -pipe -fno-stack-protector-all -Wall -Wchar-subscripts -Wmissing-declarations -Wmissing-prototypes -Wnested-externs -Wpointer-arith -Wcast-align -Wfloat-equal -Wsign-compare -DDBUS_API_SUBJECT_TO_CHANGE=1   conftest.c  >&5
conftest.c:2: warning: no previous prototype for 'f'
conftest.c: In function `f':
conftest.c:7: warning: implicit declaration of function `exit'
conftest.c:7: warning: nested extern declaration of `exit'
configure:25739: $? = 0
configure:25746: test -z "$ac_c_werror_flag" || test ! -s conftest.err
configure:25749: $? = 0
configure:25756: test -s conftest
configure:25759: $? = 0
configure:25773: result: yes
configure:25775: checking for an implementation of __va_copy()
configure:25802: i686-pc-linux-gnu-gcc -o conftest -O2 -mtune=i686 -pipe -fno-stack-protector-all -Wall -Wchar-subscripts -Wmissing-declarations -Wmissing-prototypes -Wnested-externs -Wpointer-arith -Wcast-align -Wfloat-equal -Wsign-compare -DDBUS_API_SUBJECT_TO_CHANGE=1   conftest.c  >&5
conftest.c:2: warning: no previous prototype for 'f'
conftest.c: In function `f':
conftest.c:7: warning: implicit declaration of function `exit'
conftest.c:7: warning: nested extern declaration of `exit'
configure:25808: $? = 0
configure:25815: test -z "$ac_c_werror_flag" || test ! -s conftest.err
configure:25818: $? = 0
configure:25825: test -s conftest
configure:25828: $? = 0
configure:25842: result: yes
configure:25860: checking whether va_lists can be copied by value
configure:25895: i686-pc-linux-gnu-gcc -o conftest -O2 -mtune=i686 -pipe -fno-stack-protector-all -Wall -Wchar-subscripts -Wmissing-declarations -Wmissing-prototypes -Wnested-externs -Wpointer-arith -Wcast-align -Wfloat-equal -Wsign-compare -DDBUS_API_SUBJECT_TO_CHANGE=1   conftest.c  >&5
conftest.c:33: warning: no previous prototype for 'f'
conftest.c: In function `f':
conftest.c:38: warning: implicit declaration of function `exit'
conftest.c:38: warning: nested extern declaration of `exit'
configure:25898: $? = 0
configure:25904: ./conftest
configure:25907: $? = 0
configure:25924: result: yes
configure:25937: checking whether to use inline assembler routines for atomic integers
configure:25951: result: i486
configure:25977: checking for socket in -lsocket
configure:26012: i686-pc-linux-gnu-gcc -o conftest -O2 -mtune=i686 -pipe -fno-stack-protector-all -Wall -Wchar-subscripts -Wmissing-declarations -Wmissing-prototypes -Wnested-externs -Wpointer-arith -Wcast-align -Wfloat-equal -Wsign-compare -DDBUS_API_SUBJECT_TO_CHANGE=1   conftest.c -lsocket   >&5
/usr/lib/gcc/i686-pc-linux-gnu/3.4.6/../../../../i686-pc-linux-gnu/bin/ld: cannot find -lsocket
collect2: ld returned 1 exit status
configure:26018: $? = 1
configure: failed program was:
| /* confdefs.h.  */
| #define PACKAGE_NAME ""
| #define PACKAGE_TARNAME ""
| #define PACKAGE_VERSION ""
| #define PACKAGE_STRING ""
| #define PACKAGE_BUGREPORT ""
| #define PACKAGE "dbus"
| #define VERSION "0.62"
| #define GETTEXT_PACKAGE "dbus-1"
| #define STDC_HEADERS 1
| #define DBUS_DISABLE_ASSERT 1
| #define G_DISABLE_ASSERT 1
| #define HAVE_SYS_TYPES_H 1
| #define HAVE_SYS_STAT_H 1
| #define HAVE_STDLIB_H 1
| #define HAVE_STRING_H 1
| #define HAVE_MEMORY_H 1
| #define HAVE_STRINGS_H 1
| #define HAVE_INTTYPES_H 1
| #define HAVE_STDINT_H 1
| #define HAVE_UNISTD_H 1
| #define HAVE_DLFCN_H 1
| #define SIZEOF_CHAR 1
| #define SIZEOF_SHORT 2
| #define SIZEOF_LONG 4
| #define SIZEOF_INT 4
| #define SIZEOF_VOID_P 4
| #define SIZEOF_LONG_LONG 8
| #define SIZEOF___INT64 0
| #define DBUS_VA_COPY va_copy
| #define DBUS_USE_ATOMIC_INT_486 1
| #define DBUS_HAVE_ATOMIC_INT 1
| /* end confdefs.h.  */
| 
| /* Override any GCC internal prototype to avoid an error.
|    Use char because int might match the return type of a GCC
|    builtin and then its argument prototype would still apply.  */
| #ifdef __cplusplus
| extern "C"
| #endif
| char socket ();
| int
| main ()
| {
| return socket ();
|   ;
|   return 0;
| }
configure:26052: result: no
configure:26064: checking for gethostbyname in -lnsl
configure:26099: i686-pc-linux-gnu-gcc -o conftest -O2 -mtune=i686 -pipe -fno-stack-protector-all -Wall -Wchar-subscripts -Wmissing-declarations -Wmissing-prototypes -Wnested-externs -Wpointer-arith -Wcast-align -Wfloat-equal -Wsign-compare -DDBUS_API_SUBJECT_TO_CHANGE=1   conftest.c -lnsl   >&5
configure:26105: $? = 0
configure:26112: test -z "$ac_c_werror_flag" || test ! -s conftest.err
configure:26115: $? = 0
configure:26122: test -s conftest
configure:26125: $? = 0
configure:26139: result: yes
configure:26163: checking for vsnprintf
configure:26219: i686-pc-linux-gnu-gcc -o conftest -O2 -mtune=i686 -pipe -fno-stack-protector-all -Wall -Wchar-subscripts -Wmissing-declarations -Wmissing-prototypes -Wnested-externs -Wpointer-arith -Wcast-align -Wfloat-equal -Wsign-compare -DDBUS_API_SUBJECT_TO_CHANGE=1   conftest.c -lnsl  >&5
conftest.c:58: warning: conflicting types for built-in function 'vsnprintf'
configure:26225: $? = 0
configure:26232: test -z "$ac_c_werror_flag" || test ! -s conftest.err
configure:26235: $? = 0
configure:26242: test -s conftest
configure:26245: $? = 0
configure:26259: result: yes
configure:26163: checking for vasprintf
configure:26219: i686-pc-linux-gnu-gcc -o conftest -O2 -mtune=i686 -pipe -fno-stack-protector-all -Wall -Wchar-subscripts -Wmissing-declarations -Wmissing-prototypes -Wnested-externs -Wpointer-arith -Wcast-align -Wfloat-equal -Wsign-compare -DDBUS_API_SUBJECT_TO_CHANGE=1   conftest.c -lnsl  >&5
configure:26225: $? = 0
configure:26232: test -z "$ac_c_werror_flag" || test ! -s conftest.err
configure:26235: $? = 0
configure:26242: test -s conftest
configure:26245: $? = 0
configure:26259: result: yes
configure:26163: checking for nanosleep
configure:26219: i686-pc-linux-gnu-gcc -o conftest -O2 -mtune=i686 -pipe -fno-stack-protector-all -Wall -Wchar-subscripts -Wmissing-declarations -Wmissing-prototypes -Wnested-externs -Wpointer-arith -Wcast-align -Wfloat-equal -Wsign-compare -DDBUS_API_SUBJECT_TO_CHANGE=1   conftest.c -lnsl  >&5
configure:26225: $? = 0
configure:26232: test -z "$ac_c_werror_flag" || test ! -s conftest.err
configure:26235: $? = 0
configure:26242: test -s conftest
configure:26245: $? = 0
configure:26259: result: yes
configure:26163: checking for usleep
configure:26219: i686-pc-linux-gnu-gcc -o conftest -O2 -mtune=i686 -pipe -fno-stack-protector-all -Wall -Wchar-subscripts -Wmissing-declarations -Wmissing-prototypes -Wnested-externs -Wpointer-arith -Wcast-align -Wfloat-equal -Wsign-compare -DDBUS_API_SUBJECT_TO_CHANGE=1   conftest.c -lnsl  >&5
configure:26225: $? = 0
configure:26232: test -z "$ac_c_werror_flag" || test ! -s conftest.err
configure:26235: $? = 0
configure:26242: test -s conftest
configure:26245: $? = 0
configure:26259: result: yes
configure:26163: checking for poll
configure:26219: i686-pc-linux-gnu-gcc -o conftest -O2 -mtune=i686 -pipe -fno-stack-protector-all -Wall -Wchar-subscripts -Wmissing-declarations -Wmissing-prototypes -Wnested-externs -Wpointer-arith -Wcast-align -Wfloat-equal -Wsign-compare -DDBUS_API_SUBJECT_TO_CHANGE=1   conftest.c -lnsl  >&5
configure:26225: $? = 0
configure:26232: test -z "$ac_c_werror_flag" || test ! -s conftest.err
configure:26235: $? = 0
configure:26242: test -s conftest
configure:26245: $? = 0
configure:26259: result: yes
configure:26163: checking for setenv
configure:26219: i686-pc-linux-gnu-gcc -o conftest -O2 -mtune=i686 -pipe -fno-stack-protector-all -Wall -Wchar-subscripts -Wmissing-declarations -Wmissing-prototypes -Wnested-externs -Wpointer-arith -Wcast-align -Wfloat-equal -Wsign-compare -DDBUS_API_SUBJECT_TO_CHANGE=1   conftest.c -lnsl  >&5
configure:26225: $? = 0
configure:26232: test -z "$ac_c_werror_flag" || test ! -s conftest.err
configure:26235: $? = 0
configure:26242: test -s conftest
configure:26245: $? = 0
configure:26259: result: yes
configure:26163: checking for unsetenv
configure:26219: i686-pc-linux-gnu-gcc -o conftest -O2 -mtune=i686 -pipe -fno-stack-protector-all -Wall -Wchar-subscripts -Wmissing-declarations -Wmissing-prototypes -Wnested-externs -Wpointer-arith -Wcast-align -Wfloat-equal -Wsign-compare -DDBUS_API_SUBJECT_TO_CHANGE=1   conftest.c -lnsl  >&5
configure:26225: $? = 0
configure:26232: test -z "$ac_c_werror_flag" || test ! -s conftest.err
configure:26235: $? = 0
configure:26242: test -s conftest
configure:26245: $? = 0
configure:26259: result: yes
configure:26163: checking for socketpair
configure:26219: i686-pc-linux-gnu-gcc -o conftest -O2 -mtune=i686 -pipe -fno-stack-protector-all -Wall -Wchar-subscripts -Wmissing-declarations -Wmissing-prototypes -Wnested-externs -Wpointer-arith -Wcast-align -Wfloat-equal -Wsign-compare -DDBUS_API_SUBJECT_TO_CHANGE=1   conftest.c -lnsl  >&5
configure:26225: $? = 0
configure:26232: test -z "$ac_c_werror_flag" || test ! -s conftest.err
configure:26235: $? = 0
configure:26242: test -s conftest
configure:26245: $? = 0
configure:26259: result: yes
configure:26163: checking for getgrouplist
configure:26219: i686-pc-linux-gnu-gcc -o conftest -O2 -mtune=i686 -pipe -fno-stack-protector-all -Wall -Wchar-subscripts -Wmissing-declarations -Wmissing-prototypes -Wnested-externs -Wpointer-arith -Wcast-align -Wfloat-equal -Wsign-compare -DDBUS_API_SUBJECT_TO_CHANGE=1   conftest.c -lnsl  >&5
configure:26225: $? = 0
configure:26232: test -z "$ac_c_werror_flag" || test ! -s conftest.err
configure:26235: $? = 0
configure:26242: test -s conftest
configure:26245: $? = 0
configure:26259: result: yes
configure:26285: checking execinfo.h usability
configure:26302: i686-pc-linux-gnu-gcc -c -O2 -mtune=i686 -pipe -fno-stack-protector-all -Wall -Wchar-subscripts -Wmissing-declarations -Wmissing-prototypes -Wnested-externs -Wpointer-arith -Wcast-align -Wfloat-equal -Wsign-compare -DDBUS_API_SUBJECT_TO_CHANGE=1  conftest.c >&5
configure:26308: $? = 0
configure:26315: test -z "$ac_c_werror_flag" || test ! -s conftest.err
configure:26318: $? = 0
configure:26325: test -s conftest.o
configure:26328: $? = 0
configure:26339: result: yes
configure:26343: checking execinfo.h presence
configure:26358: i686-pc-linux-gnu-gcc -E -DDBUS_API_SUBJECT_TO_CHANGE=1  conftest.c
configure:26364: $? = 0
configure:26385: result: yes
configure:26413: checking for execinfo.h
configure:26421: result: yes
configure:26433: checking for backtrace
configure:26489: i686-pc-linux-gnu-gcc -o conftest -O2 -mtune=i686 -pipe -fno-stack-protector-all -Wall -Wchar-subscripts -Wmissing-declarations -Wmissing-prototypes -Wnested-externs -Wpointer-arith -Wcast-align -Wfloat-equal -Wsign-compare -DDBUS_API_SUBJECT_TO_CHANGE=1   conftest.c -lnsl  >&5
configure:26495: $? = 0
configure:26502: test -z "$ac_c_werror_flag" || test ! -s conftest.err
configure:26505: $? = 0
configure:26512: test -s conftest
configure:26515: $? = 0
configure:26529: result: yes
configure:26544: checking for posix getpwnam_r
configure:26582: i686-pc-linux-gnu-gcc -o conftest -O2 -mtune=i686 -pipe -fno-stack-protector-all -Wall -Wchar-subscripts -Wmissing-declarations -Wmissing-prototypes -Wnested-externs -Wpointer-arith -Wcast-align -Wfloat-equal -Wsign-compare -DDBUS_API_SUBJECT_TO_CHANGE=1   conftest.c -lnsl  >&5
configure:26585: $? = 0
configure:26591: ./conftest
configure:26594: $? = 0
configure:26610: result: yes
configure:26698: checking whether socklen_t is defined
configure:26728: i686-pc-linux-gnu-gcc -c -O2 -mtune=i686 -pipe -fno-stack-protector-all -Wall -Wchar-subscripts -Wmissing-declarations -Wmissing-prototypes -Wnested-externs -Wpointer-arith -Wcast-align -Wfloat-equal -Wsign-compare -DDBUS_API_SUBJECT_TO_CHANGE=1  conftest.c >&5
configure:26734: $? = 0
configure:26741: test -z "$ac_c_werror_flag" || test ! -s conftest.err
configure:26744: $? = 0
configure:26751: test -s conftest.o
configure:26754: $? = 0
configure:26765: result: yes
configure:26791: checking sys/uio.h usability
configure:26808: i686-pc-linux-gnu-gcc -c -O2 -mtune=i686 -pipe -fno-stack-protector-all -Wall -Wchar-subscripts -Wmissing-declarations -Wmissing-prototypes -Wnested-externs -Wpointer-arith -Wcast-align -Wfloat-equal -Wsign-compare -DDBUS_API_SUBJECT_TO_CHANGE=1  conftest.c >&5
configure:26814: $? = 0
configure:26821: test -z "$ac_c_werror_flag" || test ! -s conftest.err
configure:26824: $? = 0
configure:26831: test -s conftest.o
configure:26834: $? = 0
configure:26845: result: yes
configure:26849: checking sys/uio.h presence
configure:26864: i686-pc-linux-gnu-gcc -E -DDBUS_API_SUBJECT_TO_CHANGE=1  conftest.c
configure:26870: $? = 0
configure:26891: result: yes
configure:26919: checking for sys/uio.h
configure:26927: result: yes
configure:26939: checking for writev
configure:26995: i686-pc-linux-gnu-gcc -o conftest -O2 -mtune=i686 -pipe -fno-stack-protector-all -Wall -Wchar-subscripts -Wmissing-declarations -Wmissing-prototypes -Wnested-externs -Wpointer-arith -Wcast-align -Wfloat-equal -Wsign-compare -DDBUS_API_SUBJECT_TO_CHANGE=1   conftest.c -lnsl  >&5
configure:27001: $? = 0
configure:27008: test -z "$ac_c_werror_flag" || test ! -s conftest.err
configure:27011: $? = 0
configure:27018: test -s conftest
configure:27021: $? = 0
configure:27035: result: yes
configure:27050: checking for ISO C99 varargs macros in C
configure:27077: i686-pc-linux-gnu-gcc -c -O2 -mtune=i686 -pipe -fno-stack-protector-all -Wall -Wchar-subscripts -Wmissing-declarations -Wmissing-prototypes -Wnested-externs -Wpointer-arith -Wcast-align -Wfloat-equal -Wsign-compare -DDBUS_API_SUBJECT_TO_CHANGE=1  conftest.c >&5
conftest.c: In function `main':
conftest.c:55: warning: nested extern declaration of `a'
configure:27083: $? = 0
configure:27090: test -z "$ac_c_werror_flag" || test ! -s conftest.err
configure:27093: $? = 0
configure:27100: test -s conftest.o
configure:27103: $? = 0
configure:27114: result: yes
configure:27117: checking for GNUC varargs macros
configure:27144: i686-pc-linux-gnu-gcc -c -O2 -mtune=i686 -pipe -fno-stack-protector-all -Wall -Wchar-subscripts -Wmissing-declarations -Wmissing-prototypes -Wnested-externs -Wpointer-arith -Wcast-align -Wfloat-equal -Wsign-compare -DDBUS_API_SUBJECT_TO_CHANGE=1  conftest.c >&5
conftest.c: In function `main':
conftest.c:55: warning: nested extern declaration of `a'
configure:27150: $? = 0
configure:27157: test -z "$ac_c_werror_flag" || test ! -s conftest.err
configure:27160: $? = 0
configure:27167: test -s conftest.o
configure:27170: $? = 0
configure:27181: result: yes
configure:27199: checking for struct cmsgcred
configure:27229: i686-pc-linux-gnu-gcc -c -O2 -mtune=i686 -pipe -fno-stack-protector-all -Wall -Wchar-subscripts -Wmissing-declarations -Wmissing-prototypes -Wnested-externs -Wpointer-arith -Wcast-align -Wfloat-equal -Wsign-compare -DDBUS_API_SUBJECT_TO_CHANGE=1  conftest.c >&5
conftest.c: In function `main':
conftest.c:60: error: storage size of 'cred' isn't known
conftest.c:60: warning: unused variable `cred'
configure:27235: $? = 1
configure: failed program was:
| /* confdefs.h.  */
| #define PACKAGE_NAME ""
| #define PACKAGE_TARNAME ""
| #define PACKAGE_VERSION ""
| #define PACKAGE_STRING ""
| #define PACKAGE_BUGREPORT ""
| #define PACKAGE "dbus"
| #define VERSION "0.62"
| #define GETTEXT_PACKAGE "dbus-1"
| #define STDC_HEADERS 1
| #define DBUS_DISABLE_ASSERT 1
| #define G_DISABLE_ASSERT 1
| #define HAVE_SYS_TYPES_H 1
| #define HAVE_SYS_STAT_H 1
| #define HAVE_STDLIB_H 1
| #define HAVE_STRING_H 1
| #define HAVE_MEMORY_H 1
| #define HAVE_STRINGS_H 1
| #define HAVE_INTTYPES_H 1
| #define HAVE_STDINT_H 1
| #define HAVE_UNISTD_H 1
| #define HAVE_DLFCN_H 1
| #define SIZEOF_CHAR 1
| #define SIZEOF_SHORT 2
| #define SIZEOF_LONG 4
| #define SIZEOF_INT 4
| #define SIZEOF_VOID_P 4
| #define SIZEOF_LONG_LONG 8
| #define SIZEOF___INT64 0
| #define DBUS_VA_COPY va_copy
| #define DBUS_USE_ATOMIC_INT_486 1
| #define DBUS_HAVE_ATOMIC_INT 1
| #define HAVE_LIBNSL 1
| #define HAVE_VSNPRINTF 1
| #define HAVE_VASPRINTF 1
| #define HAVE_NANOSLEEP 1
| #define HAVE_USLEEP 1
| #define HAVE_POLL 1
| #define HAVE_SETENV 1
| #define HAVE_UNSETENV 1
| #define HAVE_SOCKETPAIR 1
| #define HAVE_GETGROUPLIST 1
| #define HAVE_EXECINFO_H 1
| #define HAVE_BACKTRACE 1
| #define HAVE_POSIX_GETPWNAM_R 1
| #define HAVE_SOCKLEN_T 1
| #define HAVE_SYS_UIO_H 1
| #define HAVE_WRITEV 1
| #define HAVE_ISO_VARARGS 1
| #define HAVE_GNUC_VARARGS 1
| /* end confdefs.h.  */
| 
| #include <sys/types.h>
| #include <sys/socket.h>
| 
| int
| main ()
| {
| 
| struct cmsgcred cred;
| 
| cred.cmcred_pid = 0;
| 
|   ;
|   return 0;
| }
configure:27266: result: no
configure:27282: checking for getpeerucred
configure:27338: i686-pc-linux-gnu-gcc -o conftest -O2 -mtune=i686 -pipe -fno-stack-protector-all -Wall -Wchar-subscripts -Wmissing-declarations -Wmissing-prototypes -Wnested-externs -Wpointer-arith -Wcast-align -Wfloat-equal -Wsign-compare -DDBUS_API_SUBJECT_TO_CHANGE=1   conftest.c -lnsl  >&5
/var/tmp/portage/sys-apps/dbus-0.62-r1/temp/ccdqXVhE.o: In function `main':
conftest.c:(.text+0xd): undefined reference to `getpeerucred'
collect2: ld returned 1 exit status
configure:27344: $? = 1
configure: failed program was:
| /* confdefs.h.  */
| #define PACKAGE_NAME ""
| #define PACKAGE_TARNAME ""
| #define PACKAGE_VERSION ""
| #define PACKAGE_STRING ""
| #define PACKAGE_BUGREPORT ""
| #define PACKAGE "dbus"
| #define VERSION "0.62"
| #define GETTEXT_PACKAGE "dbus-1"
| #define STDC_HEADERS 1
| #define DBUS_DISABLE_ASSERT 1
| #define G_DISABLE_ASSERT 1
| #define HAVE_SYS_TYPES_H 1
| #define HAVE_SYS_STAT_H 1
| #define HAVE_STDLIB_H 1
| #define HAVE_STRING_H 1
| #define HAVE_MEMORY_H 1
| #define HAVE_STRINGS_H 1
| #define HAVE_INTTYPES_H 1
| #define HAVE_STDINT_H 1
| #define HAVE_UNISTD_H 1
| #define HAVE_DLFCN_H 1
| #define SIZEOF_CHAR 1
| #define SIZEOF_SHORT 2
| #define SIZEOF_LONG 4
| #define SIZEOF_INT 4
| #define SIZEOF_VOID_P 4
| #define SIZEOF_LONG_LONG 8
| #define SIZEOF___INT64 0
| #define DBUS_VA_COPY va_copy
| #define DBUS_USE_ATOMIC_INT_486 1
| #define DBUS_HAVE_ATOMIC_INT 1
| #define HAVE_LIBNSL 1
| #define HAVE_VSNPRINTF 1
| #define HAVE_VASPRINTF 1
| #define HAVE_NANOSLEEP 1
| #define HAVE_USLEEP 1
| #define HAVE_POLL 1
| #define HAVE_SETENV 1
| #define HAVE_UNSETENV 1
| #define HAVE_SOCKETPAIR 1
| #define HAVE_GETGROUPLIST 1
| #define HAVE_EXECINFO_H 1
| #define HAVE_BACKTRACE 1
| #define HAVE_POSIX_GETPWNAM_R 1
| #define HAVE_SOCKLEN_T 1
| #define HAVE_SYS_UIO_H 1
| #define HAVE_WRITEV 1
| #define HAVE_ISO_VARARGS 1
| #define HAVE_GNUC_VARARGS 1
| /* end confdefs.h.  */
| /* Define getpeerucred to an innocuous variant, in case <limits.h> declares getpeerucred.
|    For example, HP-UX 11i <limits.h> declares gettimeofday.  */
| #define getpeerucred innocuous_getpeerucred
| 
| /* System header to define __stub macros and hopefully few prototypes,
|     which can conflict with char getpeerucred (); below.
|     Prefer <limits.h> to <assert.h> if __STDC__ is defined, since
|     <limits.h> exists even on freestanding compilers.  */
| 
| #ifdef __STDC__
| # include <limits.h>
| #else
| # include <assert.h>
| #endif
| 
| #undef getpeerucred
| 
| /* Override any GCC internal prototype to avoid an error.
|    Use char because int might match the return type of a GCC
|    builtin and then its argument prototype would still apply.  */
| #ifdef __cplusplus
| extern "C"
| #endif
| char getpeerucred ();
| /* The GNU C library defines this for functions which it implements
|     to always fail with ENOSYS.  Some functions are actually named
|     something starting with __ and the normal name is an alias.  */
| #if defined __stub_getpeerucred || defined __stub___getpeerucred
| choke me
| #endif
| 
| int
| main ()
| {
| return getpeerucred ();
|   ;
|   return 0;
| }
configure:27378: result: no
configure:27282: checking for getpeereid
configure:27338: i686-pc-linux-gnu-gcc -o conftest -O2 -mtune=i686 -pipe -fno-stack-protector-all -Wall -Wchar-subscripts -Wmissing-declarations -Wmissing-prototypes -Wnested-externs -Wpointer-arith -Wcast-align -Wfloat-equal -Wsign-compare -DDBUS_API_SUBJECT_TO_CHANGE=1   conftest.c -lnsl  >&5
/var/tmp/portage/sys-apps/dbus-0.62-r1/temp/ccUVJ3hN.o: In function `main':
conftest.c:(.text+0xd): undefined reference to `getpeereid'
collect2: ld returned 1 exit status
configure:27344: $? = 1
configure: failed program was:
| /* confdefs.h.  */
| #define PACKAGE_NAME ""
| #define PACKAGE_TARNAME ""
| #define PACKAGE_VERSION ""
| #define PACKAGE_STRING ""
| #define PACKAGE_BUGREPORT ""
| #define PACKAGE "dbus"
| #define VERSION "0.62"
| #define GETTEXT_PACKAGE "dbus-1"
| #define STDC_HEADERS 1
| #define DBUS_DISABLE_ASSERT 1
| #define G_DISABLE_ASSERT 1
| #define HAVE_SYS_TYPES_H 1
| #define HAVE_SYS_STAT_H 1
| #define HAVE_STDLIB_H 1
| #define HAVE_STRING_H 1
| #define HAVE_MEMORY_H 1
| #define HAVE_STRINGS_H 1
| #define HAVE_INTTYPES_H 1
| #define HAVE_STDINT_H 1
| #define HAVE_UNISTD_H 1
| #define HAVE_DLFCN_H 1
| #define SIZEOF_CHAR 1
| #define SIZEOF_SHORT 2
| #define SIZEOF_LONG 4
| #define SIZEOF_INT 4
| #define SIZEOF_VOID_P 4
| #define SIZEOF_LONG_LONG 8
| #define SIZEOF___INT64 0
| #define DBUS_VA_COPY va_copy
| #define DBUS_USE_ATOMIC_INT_486 1
| #define DBUS_HAVE_ATOMIC_INT 1
| #define HAVE_LIBNSL 1
| #define HAVE_VSNPRINTF 1
| #define HAVE_VASPRINTF 1
| #define HAVE_NANOSLEEP 1
| #define HAVE_USLEEP 1
| #define HAVE_POLL 1
| #define HAVE_SETENV 1
| #define HAVE_UNSETENV 1
| #define HAVE_SOCKETPAIR 1
| #define HAVE_GETGROUPLIST 1
| #define HAVE_EXECINFO_H 1
| #define HAVE_BACKTRACE 1
| #define HAVE_POSIX_GETPWNAM_R 1
| #define HAVE_SOCKLEN_T 1
| #define HAVE_SYS_UIO_H 1
| #define HAVE_WRITEV 1
| #define HAVE_ISO_VARARGS 1
| #define HAVE_GNUC_VARARGS 1
| /* end confdefs.h.  */
| /* Define getpeereid to an innocuous variant, in case <limits.h> declares getpeereid.
|    For example, HP-UX 11i <limits.h> declares gettimeofday.  */
| #define getpeereid innocuous_getpeereid
| 
| /* System header to define __stub macros and hopefully few prototypes,
|     which can conflict with char getpeereid (); below.
|     Prefer <limits.h> to <assert.h> if __STDC__ is defined, since
|     <limits.h> exists even on freestanding compilers.  */
| 
| #ifdef __STDC__
| # include <limits.h>
| #else
| # include <assert.h>
| #endif
| 
| #undef getpeereid
| 
| /* Override any GCC internal prototype to avoid an error.
|    Use char because int might match the return type of a GCC
|    builtin and then its argument prototype would still apply.  */
| #ifdef __cplusplus
| extern "C"
| #endif
| char getpeereid ();
| /* The GNU C library defines this for functions which it implements
|     to always fail with ENOSYS.  Some functions are actually named
|     something starting with __ and the normal name is an alias.  */
| #if defined __stub_getpeereid || defined __stub___getpeereid
| choke me
| #endif
| 
| int
| main ()
| {
| return getpeereid ();
|   ;
|   return 0;
| }
configure:27378: result: no
configure:27391: checking abstract socket namespace
configure:27460: i686-pc-linux-gnu-gcc -o conftest -O2 -mtune=i686 -pipe -fno-stack-protector-all -Wall -Wchar-subscripts -Wmissing-declarations -Wmissing-prototypes -Wnested-externs -Wpointer-arith -Wcast-align -Wfloat-equal -Wsign-compare -DDBUS_API_SUBJECT_TO_CHANGE=1   conftest.c -lnsl  >&5
configure:27463: $? = 0
configure:27469: ./conftest
configure:27472: $? = 0
configure:27493: result: yes
configure:27543: checking locale.h usability
configure:27560: i686-pc-linux-gnu-gcc -c -O2 -mtune=i686 -pipe -fno-stack-protector-all -Wall -Wchar-subscripts -Wmissing-declarations -Wmissing-prototypes -Wnested-externs -Wpointer-arith -Wcast-align -Wfloat-equal -Wsign-compare -DDBUS_API_SUBJECT_TO_CHANGE=1  conftest.c >&5
configure:27566: $? = 0
configure:27573: test -z "$ac_c_werror_flag" || test ! -s conftest.err
configure:27576: $? = 0
configure:27583: test -s conftest.o
configure:27586: $? = 0
configure:27597: result: yes
configure:27601: checking locale.h presence
configure:27616: i686-pc-linux-gnu-gcc -E -DDBUS_API_SUBJECT_TO_CHANGE=1  conftest.c
configure:27622: $? = 0
configure:27643: result: yes
configure:27671: checking for locale.h
configure:27679: result: yes
configure:27693: checking for LC_MESSAGES
configure:27719: i686-pc-linux-gnu-gcc -o conftest -O2 -mtune=i686 -pipe -fno-stack-protector-all -Wall -Wchar-subscripts -Wmissing-declarations -Wmissing-prototypes -Wnested-externs -Wpointer-arith -Wcast-align -Wfloat-equal -Wsign-compare -DDBUS_API_SUBJECT_TO_CHANGE=1   conftest.c -lnsl  >&5
configure:27725: $? = 0
configure:27732: test -z "$ac_c_werror_flag" || test ! -s conftest.err
configure:27735: $? = 0
configure:27742: test -s conftest
configure:27745: $? = 0
configure:27758: result: yes
configure:27787: checking libintl.h usability
configure:27804: i686-pc-linux-gnu-gcc -c -O2 -mtune=i686 -pipe -fno-stack-protector-all -Wall -Wchar-subscripts -Wmissing-declarations -Wmissing-prototypes -Wnested-externs -Wpointer-arith -Wcast-align -Wfloat-equal -Wsign-compare -DDBUS_API_SUBJECT_TO_CHANGE=1  conftest.c >&5
configure:27810: $? = 0
configure:27817: test -z "$ac_c_werror_flag" || test ! -s conftest.err
configure:27820: $? = 0
configure:27827: test -s conftest.o
configure:27830: $? = 0
configure:27841: result: yes
configure:27845: checking libintl.h presence
configure:27860: i686-pc-linux-gnu-gcc -E -DDBUS_API_SUBJECT_TO_CHANGE=1  conftest.c
configure:27866: $? = 0
configure:27887: result: yes
configure:27915: checking for libintl.h
configure:27922: result: yes
configure:27933: checking for ngettext in libc
configure:27961: i686-pc-linux-gnu-gcc -o conftest -O2 -mtune=i686 -pipe -fno-stack-protector-all -Wall -Wchar-subscripts -Wmissing-declarations -Wmissing-prototypes -Wnested-externs -Wpointer-arith -Wcast-align -Wfloat-equal -Wsign-compare -DDBUS_API_SUBJECT_TO_CHANGE=1   conftest.c -lnsl  >&5
configure:27967: $? = 0
configure:27974: test -z "$ac_c_werror_flag" || test ! -s conftest.err
configure:27977: $? = 0
configure:27984: test -s conftest
configure:27987: $? = 0
configure:28001: result: yes
configure:28005: checking for dgettext in libc
configure:28033: i686-pc-linux-gnu-gcc -o conftest -O2 -mtune=i686 -pipe -fno-stack-protector-all -Wall -Wchar-subscripts -Wmissing-declarations -Wmissing-prototypes -Wnested-externs -Wpointer-arith -Wcast-align -Wfloat-equal -Wsign-compare -DDBUS_API_SUBJECT_TO_CHANGE=1   conftest.c -lnsl  >&5
configure:28039: $? = 0
configure:28046: test -z "$ac_c_werror_flag" || test ! -s conftest.err
configure:28049: $? = 0
configure:28056: test -s conftest
configure:28059: $? = 0
configure:28073: result: yes
configure:28082: checking for bind_textdomain_codeset
configure:28138: i686-pc-linux-gnu-gcc -o conftest -O2 -mtune=i686 -pipe -fno-stack-protector-all -Wall -Wchar-subscripts -Wmissing-declarations -Wmissing-prototypes -Wnested-externs -Wpointer-arith -Wcast-align -Wfloat-equal -Wsign-compare -DDBUS_API_SUBJECT_TO_CHANGE=1   conftest.c -lnsl  >&5
configure:28144: $? = 0
configure:28151: test -z "$ac_c_werror_flag" || test ! -s conftest.err
configure:28154: $? = 0
configure:28161: test -s conftest
configure:28164: $? = 0
configure:28178: result: yes
configure:28761: checking for msgfmt
configure:28788: result: /usr/bin/msgfmt
configure:28801: checking for dcgettext
configure:28857: i686-pc-linux-gnu-gcc -o conftest -O2 -mtune=i686 -pipe -fno-stack-protector-all -Wall -Wchar-subscripts -Wmissing-declarations -Wmissing-prototypes -Wnested-externs -Wpointer-arith -Wcast-align -Wfloat-equal -Wsign-compare -DDBUS_API_SUBJECT_TO_CHANGE=1   conftest.c -lnsl   >&5
conftest.c:80: warning: conflicting types for built-in function 'dcgettext'
configure:28863: $? = 0
configure:28870: test -z "$ac_c_werror_flag" || test ! -s conftest.err
configure:28873: $? = 0
configure:28880: test -s conftest
configure:28883: $? = 0
configure:28897: result: yes
configure:28909: checking for gmsgfmt
configure:28927: found /usr/bin/gmsgfmt
configure:28940: result: /usr/bin/gmsgfmt
configure:28950: checking for xgettext
configure:28977: result: /usr/bin/xgettext
configure:29006: i686-pc-linux-gnu-gcc -o conftest -O2 -mtune=i686 -pipe -fno-stack-protector-all -Wall -Wchar-subscripts -Wmissing-declarations -Wmissing-prototypes -Wnested-externs -Wpointer-arith -Wcast-align -Wfloat-equal -Wsign-compare -DDBUS_API_SUBJECT_TO_CHANGE=1   conftest.c -lnsl   >&5
conftest.c: In function `main':
conftest.c:62: warning: nested extern declaration of `_nl_msg_cat_cntr'
configure:29012: $? = 0
configure:29019: test -z "$ac_c_werror_flag" || test ! -s conftest.err
configure:29022: $? = 0
configure:29029: test -s conftest
configure:29032: $? = 0
configure:29291: checking for XML_ParserCreate_MM in -lexpat
configure:29326: i686-pc-linux-gnu-gcc -o conftest -O2 -mtune=i686 -pipe -fno-stack-protector-all -Wall -Wchar-subscripts -Wmissing-declarations -Wmissing-prototypes -Wnested-externs -Wpointer-arith -Wcast-align -Wfloat-equal -Wsign-compare -DDBUS_API_SUBJECT_TO_CHANGE=1   conftest.c -lexpat  -lnsl  >&5
configure:29332: $? = 0
configure:29339: test -z "$ac_c_werror_flag" || test ! -s conftest.err
configure:29342: $? = 0
configure:29349: test -s conftest
configure:29352: $? = 0
configure:29366: result: yes
configure:29384: checking expat.h usability
configure:29401: i686-pc-linux-gnu-gcc -c -O2 -mtune=i686 -pipe -fno-stack-protector-all -Wall -Wchar-subscripts -Wmissing-declarations -Wmissing-prototypes -Wnested-externs -Wpointer-arith -Wcast-align -Wfloat-equal -Wsign-compare -DDBUS_API_SUBJECT_TO_CHANGE=1  conftest.c >&5
configure:29407: $? = 0
configure:29414: test -z "$ac_c_werror_flag" || test ! -s conftest.err
configure:29417: $? = 0
configure:29424: test -s conftest.o
configure:29427: $? = 0
configure:29438: result: yes
configure:29442: checking expat.h presence
configure:29457: i686-pc-linux-gnu-gcc -E -DDBUS_API_SUBJECT_TO_CHANGE=1  conftest.c
configure:29463: $? = 0
configure:29484: result: yes
configure:29512: checking for expat.h
configure:29520: result: yes
configure:29595: checking for libxml-2.0
configure:29599: result: yes
configure:29603: checking LIBXML_CFLAGS
configure:29606: result: -I/usr/include/libxml2  
configure:29609: checking LIBXML_LIBS
configure:29612: result: -lxml2 -lz -lm  
configure:30015: checking for gobject-2.0 >= 2.4
configure:30019: result: yes
configure:30023: checking DBUS_GLIB_CFLAGS
configure:30026: result: -I/usr/include/glib-2.0 -I/usr/lib/glib-2.0/include  
configure:30029: checking DBUS_GLIB_LIBS
configure:30032: result: -lgobject-2.0 -lglib-2.0  
configure:30112: checking for gthread-2.0 >= 2.4
configure:30116: result: yes
configure:30120: checking DBUS_GLIB_THREADS_CFLAGS
configure:30123: result: -pthread -I/usr/include/glib-2.0 -I/usr/lib/glib-2.0/include  
configure:30126: checking DBUS_GLIB_THREADS_LIBS
configure:30129: result: -pthread -lgthread-2.0 -lglib-2.0  
configure:30270: checking for gtk+-2.0 >= 2.4
configure:30274: result: yes
configure:30278: checking DBUS_GTK_CFLAGS
configure:30281: result: -I/usr/include/gtk-2.0 -I/usr/lib/gtk-2.0/include -I/usr/include/atk-1.0 -I/usr/include/cairo -I/usr/include/pango-1.0 -I/usr/include/glib-2.0 -I/usr/lib/glib-2.0/include  
configure:30284: checking DBUS_GTK_LIBS
configure:30287: result: -lgtk-x11-2.0 -lgdk-x11-2.0 -latk-1.0 -lgdk_pixbuf-2.0 -lm -lpangocairo-1.0 -lpango-1.0 -lcairo -lgobject-2.0 -lgmodule-2.0 -ldl -lglib-2.0  
configure:30367: checking for gtk+-2.0 >= 2.4 gthread-2.0
configure:30371: result: yes
configure:30375: checking DBUS_GTK_THREADS_CFLAGS
configure:30378: result: -pthread -I/usr/include/gtk-2.0 -I/usr/lib/gtk-2.0/include -I/usr/include/atk-1.0 -I/usr/include/cairo -I/usr/include/pango-1.0 -I/usr/include/glib-2.0 -I/usr/lib/glib-2.0/include  
configure:30381: checking DBUS_GTK_THREADS_LIBS
configure:30384: result: -pthread -lgtk-x11-2.0 -lgdk-x11-2.0 -latk-1.0 -lgdk_pixbuf-2.0 -lm -lpangocairo-1.0 -lpango-1.0 -lcairo -lgobject-2.0 -lgmodule-2.0 -ldl -lgthread-2.0 -lglib-2.0  
configure:30493: checking for qglobal.h
configure:30508: result: found
configure:30548: checking if we want to link to Qt debugging libraries
configure:30556: result: release
configure:30629: checking for QtCore >= 4.1.3 QtXml >= 4.1.3
configure:30698: error: Qt integration explicitly required, and Qt libraries not found

## ---------------- ##
## Cache variables. ##
## ---------------- ##

ac_cv_build=i686-pc-linux-gnu
ac_cv_c_bigendian=no
ac_cv_c_compiler_gnu=yes
ac_cv_cxx_compiler_gnu=yes
ac_cv_env_CCC_set=
ac_cv_env_CCC_value=
ac_cv_env_CC_set=
ac_cv_env_CC_value=
ac_cv_env_CFLAGS_set=set
ac_cv_env_CFLAGS_value='-O2 -mtune=i686 -pipe -fno-stack-protector-all'
ac_cv_env_CPPFLAGS_set=
ac_cv_env_CPPFLAGS_value=
ac_cv_env_CPP_set=
ac_cv_env_CPP_value=
ac_cv_env_CXXCPP_set=
ac_cv_env_CXXCPP_value=
ac_cv_env_CXXFLAGS_set=set
ac_cv_env_CXXFLAGS_value='-O2 -mtune=i686 -pipe -fno-stack-protector-all'
ac_cv_env_CXX_set=
ac_cv_env_CXX_value=
ac_cv_env_F77_set=
ac_cv_env_F77_value=
ac_cv_env_FFLAGS_set=
ac_cv_env_FFLAGS_value=
ac_cv_env_LDFLAGS_set=
ac_cv_env_LDFLAGS_value=
ac_cv_env_XMKMF_set=
ac_cv_env_XMKMF_value=
ac_cv_env_build_alias_set=set
ac_cv_env_build_alias_value=i686-pc-linux-gnu
ac_cv_env_host_alias_set=set
ac_cv_env_host_alias_value=i686-pc-linux-gnu
ac_cv_env_target_alias_set=
ac_cv_env_target_alias_value=
ac_cv_f77_compiler_gnu=yes
ac_cv_func_backtrace=yes
ac_cv_func_bind_textdomain_codeset=yes
ac_cv_func_dcgettext=yes
ac_cv_func_getgrouplist=yes
ac_cv_func_getpeereid=no
ac_cv_func_getpeerucred=no
ac_cv_func_nanosleep=yes
ac_cv_func_poll=yes
ac_cv_func_posix_getpwnam_r=yes
ac_cv_func_setenv=yes
ac_cv_func_socketpair=yes
ac_cv_func_unsetenv=yes
ac_cv_func_usleep=yes
ac_cv_func_vasprintf=yes
ac_cv_func_vsnprintf=yes
ac_cv_func_writev=yes
ac_cv_header_dlfcn_h=yes
ac_cv_header_execinfo_h=yes
ac_cv_header_expat_h=yes
ac_cv_header_inttypes_h=yes
ac_cv_header_libintl_h=yes
ac_cv_header_locale_h=yes
ac_cv_header_memory_h=yes
ac_cv_header_stdc=yes
ac_cv_header_stdint_h=yes
ac_cv_header_stdlib_h=yes
ac_cv_header_string_h=yes
ac_cv_header_strings_h=yes
ac_cv_header_sys_stat_h=yes
ac_cv_header_sys_types_h=yes
ac_cv_header_sys_uio_h=yes
ac_cv_header_unistd_h=yes
ac_cv_host=i686-pc-linux-gnu
ac_cv_lib_expat_XML_ParserCreate_MM=yes
ac_cv_lib_nsl_gethostbyname=yes
ac_cv_lib_socket_socket=no
ac_cv_objext=o
ac_cv_path_CSC=/usr/bin/mcs
ac_cv_path_EGREP='/bin/grep -E'
ac_cv_path_GACUTIL=/usr/bin/gacutil
ac_cv_path_GMSGFMT=/usr/bin/gmsgfmt
ac_cv_path_GREP=/bin/grep
ac_cv_path_MSGFMT=/usr/bin/msgfmt
ac_cv_path_PKG_CONFIG=/usr/bin/pkg-config
ac_cv_path_RUNTIME=/usr/bin/mono
ac_cv_path_XGETTEXT=/usr/bin/xgettext
ac_cv_path_install='/bin/install -c'
ac_cv_prog_AR=i686-pc-linux-gnu-ar
ac_cv_prog_AWK=gawk
ac_cv_prog_CC=i686-pc-linux-gnu-gcc
ac_cv_prog_CPP='i686-pc-linux-gnu-gcc -E'
ac_cv_prog_CXX=i686-pc-linux-gnu-g++
ac_cv_prog_CXXCPP='i686-pc-linux-gnu-g++ -E'
ac_cv_prog_F77=i686-pc-linux-gnu-g77
ac_cv_prog_GCJ=gcj
ac_cv_prog_RANLIB=i686-pc-linux-gnu-ranlib
ac_cv_prog_STRIP=i686-pc-linux-gnu-strip
ac_cv_prog_cc_c89=
ac_cv_prog_cc_g=yes
ac_cv_prog_cxx_g=yes
ac_cv_prog_f77_g=yes
ac_cv_prog_make_make_set=yes
ac_cv_search_strerror='none required'
ac_cv_sizeof___int64=0
ac_cv_sizeof_char=1
ac_cv_sizeof_int=4
ac_cv_sizeof_long=4
ac_cv_sizeof_long_long=8
ac_cv_sizeof_short=2
ac_cv_sizeof_void_p=4
ac_cv_target=i686-pc-linux-gnu
ac_cv_type___int64=no
ac_cv_type_char=yes
ac_cv_type_int=yes
ac_cv_type_long=yes
ac_cv_type_long_long=yes
ac_cv_type_short=yes
ac_cv_type_void_p=yes
am_cv_CC_dependencies_compiler_type=gcc3
am_cv_CXX_dependencies_compiler_type=gcc3
am_cv_GCJ_dependencies_compiler_type=none
am_cv_val_LC_MESSAGES=yes
dbus_cv___va_copy=yes
dbus_cv_va_copy=yes
dbus_cv_va_val_copy=yes
gt_cv_func_dgettext_libc=yes
gt_cv_func_dgettext_libintl=no
gt_cv_func_ngettext_libc=yes
gt_cv_have_gettext=yes
lt_cv_deplibs_check_method=pass_all
lt_cv_file_magic_cmd='$MAGIC_CMD'
lt_cv_file_magic_test_file=
lt_cv_ld_reload_flag=-r
lt_cv_objdir=.libs
lt_cv_path_LD=/usr/i686-pc-linux-gnu/bin/ld
lt_cv_path_LDCXX=/usr/i686-pc-linux-gnu/bin/ld
lt_cv_path_NM='/usr/bin/nm -B'
lt_cv_path_SED=/bin/sed
lt_cv_prog_compiler_c_o=yes
lt_cv_prog_compiler_c_o_CXX=yes
lt_cv_prog_compiler_c_o_F77=yes
lt_cv_prog_compiler_c_o_GCJ=no
lt_cv_prog_compiler_rtti_exceptions=no
lt_cv_prog_gnu_ld=yes
lt_cv_prog_gnu_ldcxx=yes
lt_cv_sys_global_symbol_pipe='sed -n -e '\''s/^.*[ 	]\([ABCDGIRSTW][ABCDGIRSTW]*\)[ 	][ 	]*\([_A-Za-z][_A-Za-z0-9]*\)$/\1 \2 \2/p'\'''
lt_cv_sys_global_symbol_to_c_name_address='sed -n -e '\''s/^: \([^ ]*\) $/  {\"\1\", (lt_ptr) 0},/p'\'' -e '\''s/^[BCDEGRST] \([^ ]*\) \([^ ]*\)$/  {"\2", (lt_ptr) \&\2},/p'\'''
lt_cv_sys_global_symbol_to_cdecl='sed -n -e '\''s/^. .* \(.*\)$/extern int \1;/p'\'''
lt_cv_sys_max_cmd_len=32768
lt_lt_cv_prog_compiler_c_o='"yes"'
lt_lt_cv_prog_compiler_c_o_CXX='"yes"'
lt_lt_cv_prog_compiler_c_o_F77='"yes"'
lt_lt_cv_prog_compiler_c_o_GCJ='"no"'
lt_lt_cv_sys_global_symbol_pipe='"sed -n -e '\''s/^.*[ 	]\\([ABCDGIRSTW][ABCDGIRSTW]*\\)[ 	][ 	]*\\([_A-Za-z][_A-Za-z0-9]*\\)\$/\\1 \\2 \\2/p'\''"'
lt_lt_cv_sys_global_symbol_to_c_name_address='"sed -n -e '\''s/^: \\([^ ]*\\) \$/  {\\\"\\1\\\", (lt_ptr) 0},/p'\'' -e '\''s/^[BCDEGRST] \\([^ ]*\\) \\([^ ]*\\)\$/  {\"\\2\", (lt_ptr) \\&\\2},/p'\''"'
lt_lt_cv_sys_global_symbol_to_cdecl='"sed -n -e '\''s/^. .* \\(.*\\)\$/extern int \\1;/p'\''"'

## ----------------- ##
## Output variables. ##
## ----------------- ##

ABSOLUTE_TOP_BUILDDIR=''
ACLOCAL='${SHELL} /var/tmp/portage/sys-apps/dbus-0.62-r1/work/dbus-0.62/missing --run aclocal-1.9 '
AMDEPBACKSLASH='\'
AMDEP_FALSE='#'
AMDEP_TRUE=''
AMTAR='${SHELL} /var/tmp/portage/sys-apps/dbus-0.62-r1/work/dbus-0.62/missing --run tar'
AR='i686-pc-linux-gnu-ar'
AUTOCONF='${SHELL} /var/tmp/portage/sys-apps/dbus-0.62-r1/work/dbus-0.62/missing --run autoconf'
AUTOHEADER='${SHELL} /var/tmp/portage/sys-apps/dbus-0.62-r1/work/dbus-0.62/missing --run autoheader'
AUTOMAKE='${SHELL} /var/tmp/portage/sys-apps/dbus-0.62-r1/work/dbus-0.62/missing --run automake-1.9'
AWK='gawk'
CATALOGS=''
CATOBJEXT='.gmo'
CC='i686-pc-linux-gnu-gcc'
CCDEPMODE='depmode=gcc3'
CFLAGS='-O2 -mtune=i686 -pipe -fno-stack-protector-all -Wall -Wchar-subscripts -Wmissing-declarations -Wmissing-prototypes -Wnested-externs -Wpointer-arith -Wcast-align -Wfloat-equal -Wsign-compare'
CPP='i686-pc-linux-gnu-gcc -E'
CPPFLAGS='-DDBUS_API_SUBJECT_TO_CHANGE=1 '
CSC='/usr/bin/mcs'
CXX='i686-pc-linux-gnu-g++'
CXXCPP='i686-pc-linux-gnu-g++ -E'
CXXDEPMODE='depmode=gcc3'
CXXFLAGS='-O2 -mtune=i686 -pipe -fno-stack-protector-all'
CYGPATH_W='echo'
DATADIRNAME='share'
DBUS_BUILD_TESTS_FALSE=''
DBUS_BUILD_TESTS_TRUE='#'
DBUS_BUS_CFLAGS=''
DBUS_BUS_LIBS='-lexpat  '
DBUS_CLIENT_CFLAGS=''
DBUS_CLIENT_LIBS=''
DBUS_CONSOLE_AUTH_DIR=''
DBUS_CONSOLE_OWNER_FILE=''
DBUS_DOXYGEN_DOCS_ENABLED_FALSE=''
DBUS_DOXYGEN_DOCS_ENABLED_TRUE=''
DBUS_GCOV_ENABLED_FALSE=''
DBUS_GCOV_ENABLED_TRUE='#'
DBUS_GLIB_CFLAGS='-I/usr/include/glib-2.0 -I/usr/lib/glib-2.0/include  '
DBUS_GLIB_LIBS='-lgobject-2.0 -lglib-2.0  '
DBUS_GLIB_THREADS_CFLAGS='-pthread -I/usr/include/glib-2.0 -I/usr/lib/glib-2.0/include  '
DBUS_GLIB_THREADS_LIBS='-pthread -lgthread-2.0 -lglib-2.0  '
DBUS_GLIB_TOOL_CFLAGS=''
DBUS_GLIB_TOOL_LIBS='-lexpat '
DBUS_GTK_CFLAGS='-I/usr/include/gtk-2.0 -I/usr/lib/gtk-2.0/include -I/usr/include/atk-1.0 -I/usr/include/cairo -I/usr/include/pango-1.0 -I/usr/include/glib-2.0 -I/usr/lib/glib-2.0/include  '
DBUS_GTK_LIBS='-lgtk-x11-2.0 -lgdk-x11-2.0 -latk-1.0 -lgdk_pixbuf-2.0 -lm -lpangocairo-1.0 -lpango-1.0 -lcairo -lgobject-2.0 -lgmodule-2.0 -ldl -lglib-2.0  '
DBUS_GTK_THREADS_CFLAGS='-pthread -I/usr/include/gtk-2.0 -I/usr/lib/gtk-2.0/include -I/usr/include/atk-1.0 -I/usr/include/cairo -I/usr/include/pango-1.0 -I/usr/include/glib-2.0 -I/usr/lib/glib-2.0/include  '
DBUS_GTK_THREADS_LIBS='-pthread -lgtk-x11-2.0 -lgdk-x11-2.0 -latk-1.0 -lgdk_pixbuf-2.0 -lm -lpangocairo-1.0 -lpango-1.0 -lcairo -lgobject-2.0 -lgmodule-2.0 -ldl -lgthread-2.0 -lglib-2.0  '
DBUS_HAVE_INT64='1'
DBUS_INIT_SCRIPTS_RED_HAT_FALSE=''
DBUS_INIT_SCRIPTS_RED_HAT_TRUE=''
DBUS_INIT_SCRIPTS_SLACKWARE_FALSE=''
DBUS_INIT_SCRIPTS_SLACKWARE_TRUE=''
DBUS_INT16_TYPE='short'
DBUS_INT32_TYPE='int'
DBUS_INT64_CONSTANT='(val##LL)'
DBUS_INT64_TYPE='long long'
DBUS_PATH_OR_ABSTRACT='abstract'
DBUS_QT3_CXXFLAGS='-I/usr/qt/3/include'
DBUS_QT3_LIBS=''
DBUS_QTESTLIB_CFLAGS=''
DBUS_QTESTLIB_LIBS=''
DBUS_QT_CFLAGS=''
DBUS_QT_GUI_CFLAGS=''
DBUS_QT_GUI_LIBS=''
DBUS_QT_LIBS=''
DBUS_SESSION_SOCKET_DIR=''
DBUS_SYSTEM_BUS_DEFAULT_ADDRESS=''
DBUS_SYSTEM_PID_FILE=''
DBUS_SYSTEM_SOCKET=''
DBUS_TEST_CFLAGS=''
DBUS_TEST_LIBS=''
DBUS_UINT64_CONSTANT='(val##ULL)'
DBUS_USER=''
DBUS_USE_CSC_FALSE='#'
DBUS_USE_CSC_TRUE=''
DBUS_USE_EXPAT_FALSE='#'
DBUS_USE_EXPAT_TRUE=''
DBUS_USE_GCJ_FALSE=''
DBUS_USE_GCJ_TRUE='#'
DBUS_USE_LIBXML_FALSE=''
DBUS_USE_LIBXML_TRUE='#'
DBUS_XML_DOCS_ENABLED_FALSE=''
DBUS_XML_DOCS_ENABLED_TRUE=''
DBUS_X_CFLAGS=''
DBUS_X_LIBS=''
DEFS=''
DEPDIR='.deps'
DOXYGEN=''
ECHO='echo'
ECHO_C=''
ECHO_N='-n'
ECHO_T=''
EGREP='/bin/grep -E'
ENABLE_MONODOC_FALSE=''
ENABLE_MONODOC_TRUE='#'
EXEEXT=''
EXPANDED_BINDIR=''
EXPANDED_DATADIR=''
EXPANDED_LIBDIR=''
EXPANDED_LOCALSTATEDIR=''
EXPANDED_SYSCONFDIR=''
F77='i686-pc-linux-gnu-g77'
FFLAGS='-g -O2'
GACUTIL='/usr/bin/gacutil'
GCJ='gcj'
GCJDEPMODE='depmode=none'
GCJFLAGS='-g -O2'
GETTEXT_PACKAGE='dbus-1'
GLIB_GENMARSHAL='glib-genmarshal'
GMOFILES=''
GMSGFMT='/usr/bin/gmsgfmt'
GREP='/bin/grep'
HAVE_CONSOLE_OWNER_FILE_FALSE=''
HAVE_CONSOLE_OWNER_FILE_TRUE='#'
HAVE_GLIB_FALSE='#'
HAVE_GLIB_THREADS_FALSE='#'
HAVE_GLIB_THREADS_TRUE=''
HAVE_GLIB_TRUE=''
HAVE_GTK_FALSE='#'
HAVE_GTK_TRUE=''
HAVE_PYTHON_FALSE=''
HAVE_PYTHON_TRUE=''
HAVE_QT3_FALSE='#'
HAVE_QT3_TRUE=''
HAVE_QTESTLIB_FALSE=''
HAVE_QTESTLIB_TRUE=''
HAVE_QT_FALSE=''
HAVE_QT_GUI_FALSE=''
HAVE_QT_GUI_TRUE=''
HAVE_QT_TRUE=''
HAVE_SELINUX_FALSE=''
HAVE_SELINUX_TRUE='#'
INSTALL_DATA='${INSTALL} -m 644'
INSTALL_PROGRAM='${INSTALL}'
INSTALL_SCRIPT='${INSTALL}'
INSTALL_STRIP_PROGRAM='${SHELL} $(install_sh) -c -s'
INSTOBJEXT='.mo'
INTLLIBS=''
JAR=''
LDFLAGS=''
LIBOBJS=''
LIBS='-lnsl '
LIBTOOL='$(SHELL) $(top_builddir)/libtool'
LIBXML_CFLAGS='-I/usr/include/libxml2  '
LIBXML_LIBS='-lxml2 -lz -lm  '
LIB_PREFIX='.so'
LIB_SUFFIX=''
LN_S='ln -s'
LTLIBOBJS=''
LT_AGE='0'
LT_CURRENT='2'
LT_REVISION='0'
MAINT='#'
MAINTAINER_MODE_FALSE=''
MAINTAINER_MODE_TRUE='#'
MAKEINFO='${SHELL} /var/tmp/portage/sys-apps/dbus-0.62-r1/work/dbus-0.62/missing --run makeinfo'
MDASSEMBLER=''
MKINSTALLDIRS='./mkinstalldirs'
MONODOCER=''
MONODOC_DEPENDENCY_CFLAGS=' '
MONODOC_DEPENDENCY_LIBS='/r:/usr/lib/mono/monodoc/monodoc.dll  '
MONODOC_REQUIRED_VERSION='1.1.10'
MONODOC_SOURCESDIR='/usr/lib/monodoc/sources'
MONO_DEPENDENCY_CFLAGS='-D_REENTRANT -pthread -I/usr/lib/pkgconfig/../../include -I/usr/include/glib-2.0 -I/usr/lib/glib-2.0/include  '
MONO_DEPENDENCY_LIBS='-Wl,--export-dynamic -pthread -L/usr/lib/pkgconfig/../../lib -lmono -lpthread -lm -lgmodule-2.0 -ldl -lgthread-2.0 -lglib-2.0  '
MONO_REQUIRED_VERSION='0.95'
MSGFMT='/usr/bin/msgfmt'
OBJEXT='o'
PACKAGE='dbus'
PACKAGE_BUGREPORT=''
PACKAGE_NAME=''
PACKAGE_STRING=''
PACKAGE_TARNAME=''
PACKAGE_VERSION=''
PATH_SEPARATOR=':'
PKG_CONFIG='/usr/bin/pkg-config'
POFILES=''
POSUB='po'
PO_IN_DATADIR_FALSE=''
PO_IN_DATADIR_TRUE=''
PYREX=''
PYTHON=''
PYTHON_EXEC_PREFIX=''
PYTHON_INCLUDES=''
PYTHON_PLATFORM=''
PYTHON_PREFIX=''
PYTHON_VERSION=''
QT3_MOC='/usr/qt/3/bin/moc'
QT_CORE='QtCore'
QT_MOC=''
QT_UIC=''
QT_XML='QtXml'
RANLIB='i686-pc-linux-gnu-ranlib'
RUNTIME='/usr/bin/mono'
SET_MAKE=''
SHELL='/bin/sh'
STRIP='i686-pc-linux-gnu-strip'
TEST_EXIT_BINARY=''
TEST_GLIB_SERVICE_BINARY=''
TEST_PYTHON_SERVICE_BINARY=''
TEST_SEGFAULT_BINARY=''
TEST_SERVICE_BINARY=''
TEST_SERVICE_DIR=''
TEST_SHELL_SERVICE_BINARY=''
TEST_SLEEP_FOREVER_BINARY=''
TEST_SOCKET_DIR=''
USE_NLS='yes'
VERSION='0.62'
XGETTEXT='/usr/bin/xgettext'
XMKMF=''
XMLTO=''
X_CFLAGS=''
X_EXTRA_LIBS=''
X_LIBS=''
X_PRE_LIBS=''
ac_ct_CC=''
ac_ct_CXX=''
ac_ct_F77=''
am__fastdepCC_FALSE='#'
am__fastdepCC_TRUE=''
am__fastdepCXX_FALSE='#'
am__fastdepCXX_TRUE=''
am__fastdepGCJ_FALSE=''
am__fastdepGCJ_TRUE='#'
am__include='include'
am__leading_dot='.'
am__quote=''
am__tar='${AMTAR} chof - "$$tardir"'
am__untar='${AMTAR} xf -'
bindir='${exec_prefix}/bin'
build='i686-pc-linux-gnu'
build_alias='i686-pc-linux-gnu'
build_cpu='i686'
build_os='linux-gnu'
build_vendor='pc'
datadir='/usr/share'
datarootdir='${prefix}/share'
docdir='${datarootdir}/doc/${PACKAGE}'
dvidir='${docdir}'
exec_prefix='NONE'
host='i686-pc-linux-gnu'
host_alias='i686-pc-linux-gnu'
host_cpu='i686'
host_os='linux-gnu'
host_vendor='pc'
htmldir='${docdir}'
includedir='${prefix}/include'
infodir='/usr/share/info'
install_sh='/var/tmp/portage/sys-apps/dbus-0.62-r1/work/dbus-0.62/install-sh'
libdir='${exec_prefix}/lib'
libexecdir='${exec_prefix}/libexec'
localedir='${datarootdir}/locale'
localstatedir='/var'
mandir='/usr/share/man'
mkdir_p='mkdir -p --'
oldincludedir='/usr/include'
pdfdir='${docdir}'
pkgpyexecdir=''
pkgpythondir=''
prefix='/usr'
program_transform_name='s,x,x,'
psdir='${docdir}'
pyexecdir=''
pythondir=''
sbindir='${exec_prefix}/sbin'
sharedstatedir='${prefix}/com'
sysconfdir='/etc'
target='i686-pc-linux-gnu'
target_alias=''
target_cpu='i686'
target_os='linux-gnu'
target_vendor='pc'

## ----------- ##
## confdefs.h. ##
## ----------- ##

#define PACKAGE_NAME ""
#define PACKAGE_TARNAME ""
#define PACKAGE_VERSION ""
#define PACKAGE_STRING ""
#define PACKAGE_BUGREPORT ""
#define PACKAGE "dbus"
#define VERSION "0.62"
#define GETTEXT_PACKAGE "dbus-1"
#define STDC_HEADERS 1
#define DBUS_DISABLE_ASSERT 1
#define G_DISABLE_ASSERT 1
#define HAVE_SYS_TYPES_H 1
#define HAVE_SYS_STAT_H 1
#define HAVE_STDLIB_H 1
#define HAVE_STRING_H 1
#define HAVE_MEMORY_H 1
#define HAVE_STRINGS_H 1
#define HAVE_INTTYPES_H 1
#define HAVE_STDINT_H 1
#define HAVE_UNISTD_H 1
#define HAVE_DLFCN_H 1
#define SIZEOF_CHAR 1
#define SIZEOF_SHORT 2
#define SIZEOF_LONG 4
#define SIZEOF_INT 4
#define SIZEOF_VOID_P 4
#define SIZEOF_LONG_LONG 8
#define SIZEOF___INT64 0
#define DBUS_VA_COPY va_copy
#define DBUS_USE_ATOMIC_INT_486 1
#define DBUS_HAVE_ATOMIC_INT 1
#define HAVE_LIBNSL 1
#define HAVE_VSNPRINTF 1
#define HAVE_VASPRINTF 1
#define HAVE_NANOSLEEP 1
#define HAVE_USLEEP 1
#define HAVE_POLL 1
#define HAVE_SETENV 1
#define HAVE_UNSETENV 1
#define HAVE_SOCKETPAIR 1
#define HAVE_GETGROUPLIST 1
#define HAVE_EXECINFO_H 1
#define HAVE_BACKTRACE 1
#define HAVE_POSIX_GETPWNAM_R 1
#define HAVE_SOCKLEN_T 1
#define HAVE_SYS_UIO_H 1
#define HAVE_WRITEV 1
#define HAVE_ISO_VARARGS 1
#define HAVE_GNUC_VARARGS 1
#define HAVE_ABSTRACT_SOCKETS 1
#define HAVE_LOCALE_H 1
#define HAVE_LC_MESSAGES 1
#define HAVE_BIND_TEXTDOMAIN_CODESET 1
#define HAVE_GETTEXT 1
#define HAVE_DCGETTEXT 1
#define ENABLE_NLS 1
#define HAVE_EXPAT_H 1
#define DBUS_BUS_ENABLE_DNOTIFY_ON_LINUX 1

configure: exit 1