All pastes #281878 Raw Edit

Untitled

public text v1 · immutable
#281878 ·published 2006-12-17 03:38 UTC
rendered paste body
Compiler: Default compiler
Building Makefile: "D:\darkwar\Makefile.win"
Executing  make...
make.exe -f "D:\darkwar\Makefile.win" all
gcc.exe -c cvar.c -o cvar.o -I"d:/Dev-Cpp/include"  -I"./game"  -I"./fs"  -I"../darkwar"     -fexpensive-optimizations -O3

gcc.exe -c console.c -o console.o -I"d:/Dev-Cpp/include"  -I"./game"  -I"./fs"  -I"../darkwar"     -fexpensive-optimizations -O3

console.c:3:26: SDL_keyboard.h: No such file or directory
console.c:4:24: SDL_keysym.h: No such file or directory
console.c: In function `Console_Toggle':

console.c:144: error: `SDL_DEFAULT_REPEAT_INTERVAL' undeclared (first use in this function)

console.c:144: error: (Each undeclared identifier is reported only once

console.c:144: error: for each function it appears in.)

console.c:146: error: `SDL_DEFAULT_REPEAT_DELAY' undeclared (first use in this function)

console.c: In function `Console_KeyEvent':

console.c:603: error: `SDLK_ESCAPE' undeclared (first use in this function)

console.c:606: error: `SDLK_BACKSPACE' undeclared (first use in this function)

console.c:609: error: `SDLK_DELETE' undeclared (first use in this function)

console.c:612: error: `SDLK_RETURN' undeclared (first use in this function)

console.c:613: error: `KMOD_CTRL' undeclared (first use in this function)

console.c:618: error: `SDLK_TAB' undeclared (first use in this function)

console.c:627: error: `SDLK_HOME' undeclared (first use in this function)

console.c:630: error: `SDLK_END' undeclared (first use in this function)

console.c:633: error: `SDLK_PAGEUP' undeclared (first use in this function)

console.c:636: error: `SDLK_PAGEDOWN' undeclared (first use in this function)

console.c:639: error: `SDLK_UP' undeclared (first use in this function)

console.c:642: error: `SDLK_DOWN' undeclared (first use in this function)

console.c:645: error: `SDLK_LEFT' undeclared (first use in this function)

console.c:648: error: `SDLK_RIGHT' undeclared (first use in this function)

make.exe: *** [console.o] Error 1

Execution terminated