All pastes #280608 Raw Edit

Mine

public text v1 · immutable
#280608 ·published 2006-12-16 01:07 UTC
rendered paste body
[root@asterisk1 zaptel-1.4.0-beta2]# make
make[1]: Entering directory `/usr/src/zaptel-1.4.0-beta2'
gcc     gendigits.c  -lm -o gendigits
./gendigits > tones.h
gcc     makefw.c   -o makefw
./makefw tormenta2.rbt tor2fw > tor2fw.h
Loaded 69900 bytes from file
./makefw pciradio.rbt radfw > radfw.h
Loaded 42096 bytes from file
make -C /lib/modules/2.6.9-34.0.2.EL/build SUBDIRS=/usr/src/zaptel-1.4.0-beta2 m                                              odules
make[2]: Entering directory `/usr/src/kernels/2.6.9-34.0.2.EL-i686'
  CC [M]  /usr/src/zaptel-1.4.0-beta2/wcfxo.o
  CC [M]  /usr/src/zaptel-1.4.0-beta2/wct1xxp.o
  CC [M]  /usr/src/zaptel-1.4.0-beta2/wcusb.o
  CC [M]  /usr/src/zaptel-1.4.0-beta2/zaptel.o
/usr/src/zaptel-1.4.0-beta2/zaptel.c:426: error: syntax error before "zone_lock"
/usr/src/zaptel-1.4.0-beta2/zaptel.c:426: warning: type defaults to `int' in dec                                              laration of `zone_lock'
/usr/src/zaptel-1.4.0-beta2/zaptel.c:426: error: incompatible types in initializ                                              ation
/usr/src/zaptel-1.4.0-beta2/zaptel.c:426: error: initializer element is not cons                                              tant
/usr/src/zaptel-1.4.0-beta2/zaptel.c:426: warning: data definition has no type o                                              r storage class
/usr/src/zaptel-1.4.0-beta2/zaptel.c:427: error: syntax error before "chan_lock"
/usr/src/zaptel-1.4.0-beta2/zaptel.c:427: warning: type defaults to `int' in dec                                              laration of `chan_lock'
/usr/src/zaptel-1.4.0-beta2/zaptel.c:427: error: incompatible types in initializ                                              ation
/usr/src/zaptel-1.4.0-beta2/zaptel.c:427: error: initializer element is not cons                                              tant
/usr/src/zaptel-1.4.0-beta2/zaptel.c:427: warning: data definition has no type o                                              r storage class
/usr/src/zaptel-1.4.0-beta2/zaptel.c:226: warning: 'fcstab' defined but not used
make[3]: *** [/usr/src/zaptel-1.4.0-beta2/zaptel.o] Error 1
make[2]: *** [_module_/usr/src/zaptel-1.4.0-beta2] Error 2
make[2]: Leaving directory `/usr/src/kernels/2.6.9-34.0.2.EL-i686'
make[1]: *** [linux26] Error 2
make[1]: Leaving directory `/usr/src/zaptel-1.4.0-beta2'
make: *** [all] Error 2
[root@asterisk1 zaptel-1.4.0-beta2]#