All pastes #279512 Raw Edit

Someone

public text v1 · immutable
·published 2006-12-15 02:39 UTC
rendered paste body
make[4]: Entering directory `/root/travis/kamikaze/package/alsa'
make -C /root/travis/kamikaze/build_i386/linux-2.6-x86/alsa-driver-1.0.11 ARCH="i386" CROSS_COMPILE="i386-linux-uclibc-" c_opts="" CP="cp -fpR" all
make[5]: Entering directory `/root/travis/kamikaze/build_i386/linux-2.6-x86/alsa-driver-1.0.11'
make[6]: Entering directory `/root/travis/kamikaze/build_i386/linux-2.6-x86/alsa-driver-1.0.11/acore'
copying file alsa-kernel/core/sound.c
patching file sound.c
Hunk #1 succeeded at 64 with fuzz 2 (offset 1 line).
Hunk #3 succeeded at 285 with fuzz 2 (offset 1 line).
Hunk #4 succeeded at 326 with fuzz 1.
Hunk #5 succeeded at 422 (offset 1 line).
Hunk #7 succeeded at 474 (offset 1 line).
copying file alsa-kernel/core/rawmidi.c
patching file rawmidi.c
Hunk #1 succeeded at 1297 (offset 30 lines).
Hunk #2 succeeded at 1350 with fuzz 1.
copying file alsa-kernel/core/timer.c
patching file timer.c
Hunk #1 succeeded at 1018 with fuzz 1 (offset 23 lines).
Hunk #2 succeeded at 1912 (offset 121 lines).
Hunk #3 succeeded at 1859 with fuzz 2 (offset 14 lines).
copying file alsa-kernel/core/hwdep.c
patching file hwdep.c
Hunk #1 succeeded at 308 (offset 5 lines).
copying file alsa-kernel/core/memalloc.c
patching file memalloc.c
i386-linux-uclibc-gcc  -D__KERNEL__ -DMODULE=1 -I/root/travis/kamikaze/build_i386/linux-2.6-x86/alsa-driver-1.0.11/include  -I/root/travis/kamikaze/build_i386/linux-2.6-x86/linux-2.6.19/include -I/root/travis/kamikaze/build_i386/linux-2.6-x86/linux-2.6.19/include -I/root/travis/kamikaze/build_i386/linux-2.6-x86/linux-2.6.19/include/asm-i386/mach-default  -Wall -Wstrict-prototypes -fomit-frame-pointer -Wno-trigraphs -O2 -fno-strict-aliasing -fno-common -pipe -DALSA_BUILD -nostdinc -iwithprefix include   -DEXPORT_SYMTAB -c hwdep.c
In file included from hwdep.c:22:
/root/travis/kamikaze/build_i386/linux-2.6-x86/alsa-driver-1.0.11/include/sound/driver.h:29:26: error: linux/config.h: No such file or directory
In file included from /root/travis/kamikaze/build_i386/linux-2.6-x86/linux-2.6.19/include/asm/thread_info.h:16,
                 from /root/travis/kamikaze/build_i386/linux-2.6-x86/linux-2.6.19/include/linux/thread_info.h:21,
                 from /root/travis/kamikaze/build_i386/linux-2.6-x86/linux-2.6.19/include/linux/preempt.h:9,
                 from /root/travis/kamikaze/build_i386/linux-2.6-x86/linux-2.6.19/include/linux/spinlock.h:49,
                 from /root/travis/kamikaze/build_i386/linux-2.6-x86/linux-2.6.19/include/linux/capability.h:45,
                 from /root/travis/kamikaze/build_i386/linux-2.6-x86/linux-2.6.19/include/linux/sched.h:46,
                 from /root/travis/kamikaze/build_i386/linux-2.6-x86/linux-2.6.19/include/linux/module.h:9,
                 from /root/travis/kamikaze/build_i386/linux-2.6-x86/alsa-driver-1.0.11/include/adriver.h:45,
                 from /root/travis/kamikaze/build_i386/linux-2.6-x86/alsa-driver-1.0.11/include/sound/driver.h:47,
                 from hwdep.c:22:
/root/travis/kamikaze/build_i386/linux-2.6-x86/linux-2.6.19/include/asm/processor.h:80: error: 'CONFIG_X86_L1_CACHE_SHIFT' undeclared here (not in a function)
/root/travis/kamikaze/build_i386/linux-2.6-x86/linux-2.6.19/include/asm/processor.h:80: error: requested alignment is not a constant
/root/travis/kamikaze/build_i386/linux-2.6-x86/linux-2.6.19/include/asm/processor.h: In function 'cpuid_count':
/root/travis/kamikaze/build_i386/linux-2.6-x86/linux-2.6.19/include/asm/processor.h:176: warning: pointer targets in passing argument 1 of '__cpuid' differ in signedness
/root/travis/kamikaze/build_i386/linux-2.6-x86/linux-2.6.19/include/asm/processor.h:176: warning: pointer targets in passing argument 2 of '__cpuid' differ in signedness
/root/travis/kamikaze/build_i386/linux-2.6-x86/linux-2.6.19/include/asm/processor.h:176: warning: pointer targets in passing argument 3 of '__cpuid' differ in signedness
/root/travis/kamikaze/build_i386/linux-2.6-x86/linux-2.6.19/include/asm/processor.h:176: warning: pointer targets in passing argument 4 of '__cpuid' differ in signedness
In file included from /root/travis/kamikaze/build_i386/linux-2.6-x86/linux-2.6.19/include/linux/sched.h:51,
                 from /root/travis/kamikaze/build_i386/linux-2.6-x86/linux-2.6.19/include/linux/module.h:9,
                 from /root/travis/kamikaze/build_i386/linux-2.6-x86/alsa-driver-1.0.11/include/adriver.h:45,
                 from /root/travis/kamikaze/build_i386/linux-2.6-x86/alsa-driver-1.0.11/include/sound/driver.h:47,
                 from hwdep.c:22:
/root/travis/kamikaze/build_i386/linux-2.6-x86/linux-2.6.19/include/linux/jiffies.h:33:3: error: #error You lose.
/root/travis/kamikaze/build_i386/linux-2.6-x86/linux-2.6.19/include/linux/jiffies.h:225:31: error: division by zero in #if
/root/travis/kamikaze/build_i386/linux-2.6-x86/linux-2.6.19/include/linux/jiffies.h:225:31: error: division by zero in #if
/root/travis/kamikaze/build_i386/linux-2.6-x86/linux-2.6.19/include/linux/jiffies.h:225:31: error: division by zero in #if
/root/travis/kamikaze/build_i386/linux-2.6-x86/linux-2.6.19/include/linux/jiffies.h:225:31: error: division by zero in #if
/root/travis/kamikaze/build_i386/linux-2.6-x86/linux-2.6.19/include/linux/jiffies.h:225:31: error: division by zero in #if
/root/travis/kamikaze/build_i386/linux-2.6-x86/linux-2.6.19/include/linux/jiffies.h:225:31: error: division by zero in #if
/root/travis/kamikaze/build_i386/linux-2.6-x86/linux-2.6.19/include/linux/jiffies.h:225:31: error: division by zero in #if
/root/travis/kamikaze/build_i386/linux-2.6-x86/linux-2.6.19/include/linux/jiffies.h:225:31: error: division by zero in #if
/root/travis/kamikaze/build_i386/linux-2.6-x86/linux-2.6.19/include/linux/jiffies.h:225:31: error: division by zero in #if
/root/travis/kamikaze/build_i386/linux-2.6-x86/linux-2.6.19/include/linux/jiffies.h:225:31: error: division by zero in #if
/root/travis/kamikaze/build_i386/linux-2.6-x86/linux-2.6.19/include/linux/jiffies.h:225:31: error: division by zero in #if
/root/travis/kamikaze/build_i386/linux-2.6-x86/linux-2.6.19/include/linux/jiffies.h:225:31: error: division by zero in #if
/root/travis/kamikaze/build_i386/linux-2.6-x86/linux-2.6.19/include/linux/jiffies.h:225:31: error: division by zero in #if
/root/travis/kamikaze/build_i386/linux-2.6-x86/linux-2.6.19/include/linux/jiffies.h:225:31: error: division by zero in #if
/root/travis/kamikaze/build_i386/linux-2.6-x86/linux-2.6.19/include/linux/jiffies.h:225:31: error: division by zero in #if
/root/travis/kamikaze/build_i386/linux-2.6-x86/linux-2.6.19/include/linux/jiffies.h:225:31: error: division by zero in #if
/root/travis/kamikaze/build_i386/linux-2.6-x86/linux-2.6.19/include/linux/jiffies.h:269:46: error: division by zero in #if
In file included from /root/travis/kamikaze/build_i386/linux-2.6-x86/linux-2.6.19/include/linux/sched.h:51,
                 from /root/travis/kamikaze/build_i386/linux-2.6-x86/linux-2.6.19/include/linux/module.h:9,
                 from /root/travis/kamikaze/build_i386/linux-2.6-x86/alsa-driver-1.0.11/include/adriver.h:45,
                 from /root/travis/kamikaze/build_i386/linux-2.6-x86/alsa-driver-1.0.11/include/sound/driver.h:47,
                 from hwdep.c:22:
/root/travis/kamikaze/build_i386/linux-2.6-x86/linux-2.6.19/include/linux/jiffies.h: In function 'jiffies_to_msecs':
/root/travis/kamikaze/build_i386/linux-2.6-x86/linux-2.6.19/include/linux/jiffies.h:274: error: 'CONFIG_HZ' undeclared (first use in this function)
/root/travis/kamikaze/build_i386/linux-2.6-x86/linux-2.6.19/include/linux/jiffies.h:274: error: (Each undeclared identifier is reported only once
/root/travis/kamikaze/build_i386/linux-2.6-x86/linux-2.6.19/include/linux/jiffies.h:274: error: for each function it appears in.)
/root/travis/kamikaze/build_i386/linux-2.6-x86/linux-2.6.19/include/linux/jiffies.h:280:46: error: division by zero in #if
/root/travis/kamikaze/build_i386/linux-2.6-x86/linux-2.6.19/include/linux/jiffies.h: In function 'jiffies_to_usecs':
/root/travis/kamikaze/build_i386/linux-2.6-x86/linux-2.6.19/include/linux/jiffies.h:285: error: 'CONFIG_HZ' undeclared (first use in this function)
/root/travis/kamikaze/build_i386/linux-2.6-x86/linux-2.6.19/include/linux/jiffies.h:293:46: error: division by zero in #if
/root/travis/kamikaze/build_i386/linux-2.6-x86/linux-2.6.19/include/linux/jiffies.h: In function 'msecs_to_jiffies':
/root/travis/kamikaze/build_i386/linux-2.6-x86/linux-2.6.19/include/linux/jiffies.h:298: error: 'CONFIG_HZ' undeclared (first use in this function)
/root/travis/kamikaze/build_i386/linux-2.6-x86/linux-2.6.19/include/linux/jiffies.h:306:46: error: division by zero in #if
/root/travis/kamikaze/build_i386/linux-2.6-x86/linux-2.6.19/include/linux/jiffies.h: In function 'usecs_to_jiffies':
/root/travis/kamikaze/build_i386/linux-2.6-x86/linux-2.6.19/include/linux/jiffies.h:311: error: 'CONFIG_HZ' undeclared (first use in this function)
/root/travis/kamikaze/build_i386/linux-2.6-x86/linux-2.6.19/include/linux/jiffies.h: In function 'timespec_to_jiffies':
/root/travis/kamikaze/build_i386/linux-2.6-x86/linux-2.6.19/include/linux/jiffies.h:330: error: 'CONFIG_HZ' undeclared (first use in this function)
/root/travis/kamikaze/build_i386/linux-2.6-x86/linux-2.6.19/include/linux/jiffies.h:336: error: 'SHIFT_HZ' undeclared (first use in this function)
/root/travis/kamikaze/build_i386/linux-2.6-x86/linux-2.6.19/include/linux/jiffies.h: In function 'jiffies_to_timespec':
/root/travis/kamikaze/build_i386/linux-2.6-x86/linux-2.6.19/include/linux/jiffies.h:349: error: 'CONFIG_HZ' undeclared (first use in this function)
/root/travis/kamikaze/build_i386/linux-2.6-x86/linux-2.6.19/include/linux/jiffies.h: In function 'timeval_to_jiffies':
/root/travis/kamikaze/build_i386/linux-2.6-x86/linux-2.6.19/include/linux/jiffies.h:371: error: 'CONFIG_HZ' undeclared (first use in this function)
/root/travis/kamikaze/build_i386/linux-2.6-x86/linux-2.6.19/include/linux/jiffies.h:375: error: 'SHIFT_HZ' undeclared (first use in this function)
/root/travis/kamikaze/build_i386/linux-2.6-x86/linux-2.6.19/include/linux/jiffies.h: In function 'jiffies_to_timeval':
/root/travis/kamikaze/build_i386/linux-2.6-x86/linux-2.6.19/include/linux/jiffies.h:387: error: 'CONFIG_HZ' undeclared (first use in this function)
/root/travis/kamikaze/build_i386/linux-2.6-x86/linux-2.6.19/include/linux/jiffies.h:400:6: error: division by zero in #if
/root/travis/kamikaze/build_i386/linux-2.6-x86/linux-2.6.19/include/linux/jiffies.h:400:6: error: division by zero in #if
/root/travis/kamikaze/build_i386/linux-2.6-x86/linux-2.6.19/include/linux/jiffies.h:400:6: error: division by zero in #if
/root/travis/kamikaze/build_i386/linux-2.6-x86/linux-2.6.19/include/linux/jiffies.h:400:6: error: division by zero in #if
/root/travis/kamikaze/build_i386/linux-2.6-x86/linux-2.6.19/include/linux/jiffies.h:400:6: error: division by zero in #if
/root/travis/kamikaze/build_i386/linux-2.6-x86/linux-2.6.19/include/linux/jiffies.h:400:6: error: division by zero in #if
/root/travis/kamikaze/build_i386/linux-2.6-x86/linux-2.6.19/include/linux/jiffies.h:400:6: error: division by zero in #if
/root/travis/kamikaze/build_i386/linux-2.6-x86/linux-2.6.19/include/linux/jiffies.h:400:6: error: division by zero in #if
/root/travis/kamikaze/build_i386/linux-2.6-x86/linux-2.6.19/include/linux/jiffies.h:400:6: error: division by zero in #if
/root/travis/kamikaze/build_i386/linux-2.6-x86/linux-2.6.19/include/linux/jiffies.h:400:6: error: division by zero in #if
/root/travis/kamikaze/build_i386/linux-2.6-x86/linux-2.6.19/include/linux/jiffies.h:400:6: error: division by zero in #if
/root/travis/kamikaze/build_i386/linux-2.6-x86/linux-2.6.19/include/linux/jiffies.h:400:6: error: division by zero in #if
/root/travis/kamikaze/build_i386/linux-2.6-x86/linux-2.6.19/include/linux/jiffies.h:400:6: error: division by zero in #if
/root/travis/kamikaze/build_i386/linux-2.6-x86/linux-2.6.19/include/linux/jiffies.h:400:6: error: division by zero in #if
/root/travis/kamikaze/build_i386/linux-2.6-x86/linux-2.6.19/include/linux/jiffies.h:400:6: error: division by zero in #if
/root/travis/kamikaze/build_i386/linux-2.6-x86/linux-2.6.19/include/linux/jiffies.h:400:6: error: division by zero in #if
/root/travis/kamikaze/build_i386/linux-2.6-x86/linux-2.6.19/include/linux/jiffies.h: In function 'jiffies_to_clock_t':
/root/travis/kamikaze/build_i386/linux-2.6-x86/linux-2.6.19/include/linux/jiffies.h:401: error: 'CONFIG_HZ' undeclared (first use in this function)
/root/travis/kamikaze/build_i386/linux-2.6-x86/linux-2.6.19/include/linux/jiffies.h: In function 'clock_t_to_jiffies':
/root/travis/kamikaze/build_i386/linux-2.6-x86/linux-2.6.19/include/linux/jiffies.h:412: error: 'CONFIG_HZ' undeclared (first use in this function)
/root/travis/kamikaze/build_i386/linux-2.6-x86/linux-2.6.19/include/linux/jiffies.h:431:6: error: division by zero in #if
/root/travis/kamikaze/build_i386/linux-2.6-x86/linux-2.6.19/include/linux/jiffies.h:431:6: error: division by zero in #if
/root/travis/kamikaze/build_i386/linux-2.6-x86/linux-2.6.19/include/linux/jiffies.h:431:6: error: division by zero in #if
/root/travis/kamikaze/build_i386/linux-2.6-x86/linux-2.6.19/include/linux/jiffies.h:431:6: error: division by zero in #if
/root/travis/kamikaze/build_i386/linux-2.6-x86/linux-2.6.19/include/linux/jiffies.h:431:6: error: division by zero in #if
/root/travis/kamikaze/build_i386/linux-2.6-x86/linux-2.6.19/include/linux/jiffies.h:431:6: error: division by zero in #if
/root/travis/kamikaze/build_i386/linux-2.6-x86/linux-2.6.19/include/linux/jiffies.h:431:6: error: division by zero in #if
/root/travis/kamikaze/build_i386/linux-2.6-x86/linux-2.6.19/include/linux/jiffies.h:431:6: error: division by zero in #if
/root/travis/kamikaze/build_i386/linux-2.6-x86/linux-2.6.19/include/linux/jiffies.h:431:6: error: division by zero in #if
/root/travis/kamikaze/build_i386/linux-2.6-x86/linux-2.6.19/include/linux/jiffies.h:431:6: error: division by zero in #if
/root/travis/kamikaze/build_i386/linux-2.6-x86/linux-2.6.19/include/linux/jiffies.h:431:6: error: division by zero in #if
/root/travis/kamikaze/build_i386/linux-2.6-x86/linux-2.6.19/include/linux/jiffies.h:431:6: error: division by zero in #if
/root/travis/kamikaze/build_i386/linux-2.6-x86/linux-2.6.19/include/linux/jiffies.h:431:6: error: division by zero in #if
/root/travis/kamikaze/build_i386/linux-2.6-x86/linux-2.6.19/include/linux/jiffies.h:431:6: error: division by zero in #if
/root/travis/kamikaze/build_i386/linux-2.6-x86/linux-2.6.19/include/linux/jiffies.h:431:6: error: division by zero in #if
/root/travis/kamikaze/build_i386/linux-2.6-x86/linux-2.6.19/include/linux/jiffies.h:431:6: error: division by zero in #if
/root/travis/kamikaze/build_i386/linux-2.6-x86/linux-2.6.19/include/linux/jiffies.h: In function 'jiffies_64_to_clock_t':
/root/travis/kamikaze/build_i386/linux-2.6-x86/linux-2.6.19/include/linux/jiffies.h:432: error: 'CONFIG_HZ' undeclared (first use in this function)
In file included from /root/travis/kamikaze/build_i386/linux-2.6-x86/linux-2.6.19/include/linux/module.h:9,
                 from /root/travis/kamikaze/build_i386/linux-2.6-x86/alsa-driver-1.0.11/include/adriver.h:45,
                 from /root/travis/kamikaze/build_i386/linux-2.6-x86/alsa-driver-1.0.11/include/sound/driver.h:47,
                 from hwdep.c:22:
/root/travis/kamikaze/build_i386/linux-2.6-x86/linux-2.6.19/include/linux/sched.h: In function 'dequeue_signal_lock':
/root/travis/kamikaze/build_i386/linux-2.6-x86/linux-2.6.19/include/linux/sched.h:1268: warning: implicit declaration of function 'local_irq_save'
/root/travis/kamikaze/build_i386/linux-2.6-x86/linux-2.6.19/include/linux/sched.h:1270: warning: implicit declaration of function 'local_irq_restore'
In file included from /root/travis/kamikaze/build_i386/linux-2.6-x86/linux-2.6.19/include/linux/module.h:22,
                 from /root/travis/kamikaze/build_i386/linux-2.6-x86/alsa-driver-1.0.11/include/adriver.h:45,
                 from /root/travis/kamikaze/build_i386/linux-2.6-x86/alsa-driver-1.0.11/include/sound/driver.h:47,
                 from hwdep.c:22:
/root/travis/kamikaze/build_i386/linux-2.6-x86/linux-2.6.19/include/asm/module.h:60:2: error: #error unknown processor family
In file included from /root/travis/kamikaze/build_i386/linux-2.6-x86/linux-2.6.19/include/asm/hardirq.h:5,
                 from /root/travis/kamikaze/build_i386/linux-2.6-x86/linux-2.6.19/include/linux/hardirq.h:7,
                 from /root/travis/kamikaze/build_i386/linux-2.6-x86/linux-2.6.19/include/linux/interrupt.h:11,
                 from /root/travis/kamikaze/build_i386/linux-2.6-x86/linux-2.6.19/include/linux/usb.h:15,
                 from /root/travis/kamikaze/build_i386/linux-2.6-x86/alsa-driver-1.0.11/include/adriver.h:456,
                 from /root/travis/kamikaze/build_i386/linux-2.6-x86/alsa-driver-1.0.11/include/sound/driver.h:47,
                 from hwdep.c:22:
/root/travis/kamikaze/build_i386/linux-2.6-x86/linux-2.6.19/include/linux/irq.h: At top level:
/root/travis/kamikaze/build_i386/linux-2.6-x86/linux-2.6.19/include/linux/irq.h:172: error: requested alignment is not a constant
In file included from /root/travis/kamikaze/build_i386/linux-2.6-x86/linux-2.6.19/include/linux/hardirq.h:7,
                 from /root/travis/kamikaze/build_i386/linux-2.6-x86/linux-2.6.19/include/linux/interrupt.h:11,
                 from /root/travis/kamikaze/build_i386/linux-2.6-x86/linux-2.6.19/include/linux/usb.h:15,
                 from /root/travis/kamikaze/build_i386/linux-2.6-x86/alsa-driver-1.0.11/include/adriver.h:456,
                 from /root/travis/kamikaze/build_i386/linux-2.6-x86/alsa-driver-1.0.11/include/sound/driver.h:47,
                 from hwdep.c:22:
/root/travis/kamikaze/build_i386/linux-2.6-x86/linux-2.6.19/include/asm/hardirq.h:12: error: requested alignment is not a constant
In file included from /root/travis/kamikaze/build_i386/linux-2.6-x86/linux-2.6.19/include/linux/usb.h:15,
                 from /root/travis/kamikaze/build_i386/linux-2.6-x86/alsa-driver-1.0.11/include/adriver.h:456,
                 from /root/travis/kamikaze/build_i386/linux-2.6-x86/alsa-driver-1.0.11/include/sound/driver.h:47,
                 from hwdep.c:22:
/root/travis/kamikaze/build_i386/linux-2.6-x86/linux-2.6.19/include/linux/interrupt.h: In function 'cli':
/root/travis/kamikaze/build_i386/linux-2.6-x86/linux-2.6.19/include/linux/interrupt.h:197: warning: implicit declaration of function 'local_irq_disable'
/root/travis/kamikaze/build_i386/linux-2.6-x86/linux-2.6.19/include/linux/interrupt.h: In function 'sti':
/root/travis/kamikaze/build_i386/linux-2.6-x86/linux-2.6.19/include/linux/interrupt.h:201: warning: implicit declaration of function 'local_irq_enable'
/root/travis/kamikaze/build_i386/linux-2.6-x86/linux-2.6.19/include/linux/interrupt.h: In function 'save_flags':
/root/travis/kamikaze/build_i386/linux-2.6-x86/linux-2.6.19/include/linux/interrupt.h:205: warning: implicit declaration of function 'local_save_flags'
In file included from /root/travis/kamikaze/build_i386/linux-2.6-x86/alsa-driver-1.0.11/include/sound/driver.h:47,
                 from hwdep.c:22:
/root/travis/kamikaze/build_i386/linux-2.6-x86/alsa-driver-1.0.11/include/adriver.h: At top level:
/root/travis/kamikaze/build_i386/linux-2.6-x86/alsa-driver-1.0.11/include/adriver.h:697: error: redefinition of 'jiffies_to_msecs'
/root/travis/kamikaze/build_i386/linux-2.6-x86/linux-2.6.19/include/linux/jiffies.h:268: error: previous definition of 'jiffies_to_msecs' was here
In file included from /root/travis/kamikaze/build_i386/linux-2.6-x86/alsa-driver-1.0.11/include/sound/driver.h:47,
                 from hwdep.c:22:
/root/travis/kamikaze/build_i386/linux-2.6-x86/alsa-driver-1.0.11/include/adriver.h:699:31: error: division by zero in #if
/root/travis/kamikaze/build_i386/linux-2.6-x86/alsa-driver-1.0.11/include/adriver.h: In function 'jiffies_to_msecs':
/root/travis/kamikaze/build_i386/linux-2.6-x86/alsa-driver-1.0.11/include/adriver.h:704: error: 'CONFIG_HZ' undeclared (first use in this function)
/root/travis/kamikaze/build_i386/linux-2.6-x86/alsa-driver-1.0.11/include/adriver.h: At top level:
/root/travis/kamikaze/build_i386/linux-2.6-x86/alsa-driver-1.0.11/include/adriver.h:716: error: redefinition of 'msecs_to_jiffies'
/root/travis/kamikaze/build_i386/linux-2.6-x86/linux-2.6.19/include/linux/jiffies.h:290: error: previous definition of 'msecs_to_jiffies' was here
/root/travis/kamikaze/build_i386/linux-2.6-x86/alsa-driver-1.0.11/include/adriver.h:720:31: error: division by zero in #if
/root/travis/kamikaze/build_i386/linux-2.6-x86/alsa-driver-1.0.11/include/adriver.h: In function 'msecs_to_jiffies':
/root/travis/kamikaze/build_i386/linux-2.6-x86/alsa-driver-1.0.11/include/adriver.h:725: error: 'CONFIG_HZ' undeclared (first use in this function)
In file included from /root/travis/kamikaze/build_i386/linux-2.6-x86/linux-2.6.19/include/linux/poll.h:11,
                 from /root/travis/kamikaze/build_i386/linux-2.6-x86/alsa-driver-1.0.11/include/sound/hwdep.h:26,
                 from hwdep.c:32:
/root/travis/kamikaze/build_i386/linux-2.6-x86/linux-2.6.19/include/linux/mm.h: In function 'lowmem_page_address':
/root/travis/kamikaze/build_i386/linux-2.6-x86/linux-2.6.19/include/linux/mm.h:501: warning: implicit declaration of function '__page_to_pfn'
/root/travis/kamikaze/build_i386/linux-2.6-x86/linux-2.6.19/include/linux/mm.h:501: error: 'CONFIG_PAGE_OFFSET' undeclared (first use in this function)
hwdep.c: In function 'snd_hwdep_info':
hwdep.c:189: warning: pointer targets in passing argument 1 of 'snd_compat_strlcpy' differ in signedness
hwdep.c:190: warning: pointer targets in passing argument 1 of 'snd_compat_strlcpy' differ in signedness
make[6]: *** [hwdep.o] Error 1
make[6]: Leaving directory `/root/travis/kamikaze/build_i386/linux-2.6-x86/alsa-driver-1.0.11/acore'
make[5]: *** [compile] Error 1
make[5]: Leaving directory `/root/travis/kamikaze/build_i386/linux-2.6-x86/alsa-driver-1.0.11'
make[4]: *** [/root/travis/kamikaze/build_i386/linux-2.6-x86/alsa-driver-1.0.11/.built] Error 2
make[4]: Leaving directory `/root/travis/kamikaze/package/alsa'
make[3]: *** [alsa-compile] Error 2
make[3]: Leaving directory `/root/travis/kamikaze/package'
make[2]: *** [compile] Error 2
make[2]: Leaving directory `/root/travis/kamikaze/package'
make[1]: *** [package/compile] Error 2
make[1]: Leaving directory `/root/travis/kamikaze'