rendered paste body% make clean
arabica(ha891380)[16] /usagers/ha891380/TP3-INF3135 % make
gcc -c -ggdb -Wall biblio.c
biblio.c: In function `biblio_rappeler_tous_les_livres':
biblio.c:341: error: parse error before ';' token
make: [biblio.o] Error 1 (ignored)
gcc -c -ggdb -Wall emprunts.c
gcc -c -ggdb -Wall gererBD.c
gcc -c -ggdb -Wall sequences.c
gcc -c -ggdb -Wall gererArguments.c
gcc -c -ggdb -Wall gererErreurs.c
gcc -c -ggdb -Wall communications.c
gcc -c -ggdb -Wall outils.c
outils.c: In function `secureStrcat':
outils.c:70: error: void value not ignored as it ought to be
outils.c:70: error: void value not ignored as it ought to be
make: [outils.o] Error 1 (ignored)
gcc -c -ggdb -Wall MiniCUnit.c
gcc -ggdb -Wall -o biblio biblio.o emprunts.o gererBD.o sequences.o gererArguments.o gererErreurs.o communications.o outils.o MiniCUnit.o
gcc: biblio.o: No such file or directory
gcc: outils.o: No such file or directory
make: [biblio] Error 1 (ignored)
gcc -c -ggdb -Wall testGererBD.c
gcc -ggdb -Wall -o testGererBD testGererBD.o emprunts.o gererBD.o sequences.o gererArguments.o gererErreurs.o communications.o outils.o MiniCUnit.o
gcc: outils.o: No such file or directory
make: [testGererBD] Error 1 (ignored)
gcc -c -ggdb -Wall testEmprunts.c
gcc -ggdb -Wall -o testEmprunts testEmprunts.o emprunts.o gererBD.o sequences.o gererArguments.o gererErreurs.o communications.o outils.o MiniCUnit.o
gcc: outils.o: No such file or directory
make: [testEmprunts] Error 1 (ignored)
gcc -c -ggdb -Wall testGererArguments.c
gcc -ggdb -Wall -o testGererArguments testGererArguments.o emprunts.o gererBD.o sequences.o gererArguments.o gererErreurs.o communications.o outils.o MiniCUnit.o
gcc: outils.o: No such file or directory
make: [testGererArguments] Error 1 (ignored)
gcc -c -ggdb -Wall testGererErreurs.c
gcc -ggdb -Wall -o testGererErreurs testGererErreurs.o emprunts.o gererBD.o sequences.o gererArguments.o gererErreurs.o communications.o outils.o MiniCUnit.o
gcc: outils.o: No such file or directory
make: [testGererErreurs] Error 1 (ignored)
gcc -c -ggdb -Wall testCommunications.c
gcc -ggdb -Wall -o testCommunications testCommunications.o emprunts.o gererBD.o sequences.o gererArguments.o gererErreurs.o communications.o outils.o MiniCUnit.o
gcc: outils.o: No such file or directory
make: [testCommunications] Error 1 (ignored)
gcc -c -ggdb -Wall testOutils.c
gcc -ggdb -Wall -o testOutils testOutils.o emprunts.o gererBD.o sequences.o gererArguments.o gererErreurs.o communications.o outils.o MiniCUnit.o
gcc: outils.o: No such file or directory
make: [testOutils] Error 1 (ignored)
arabica(ha891380)[17] /usagers/ha891380/TP3-INF3135 %