arabica(ha891380)[5] /usagers/ha891380/TP3-INF3135
% make clean
arabica(ha891380)[6] /usagers/ha891380/TP3-INF3135 % make
gcc -c -ggdb -Wall biblio.c
biblio.c: In function `biblio_rappeler_tous_les_livres':
biblio.c:336: error: too many arguments to function `getEmprunteur'
biblio.c:336: error: parse error before ';' token
biblio.c:338: error: parse error before ')' token
biblio.c:331: warning: unused variable `envoiReussi'
biblio.c:346: error: `envoiReussi' undeclared (first use in this function)
biblio.c:346: error: (Each undeclared identifier is reported only once
biblio.c:346: error: for each function it appears in.)
biblio.c:338: warning: statement with no effect
biblio.c: At top level:
biblio.c:368: error: parse error before string constant
biblio.c:369: warning: type defaults to `int' in declaration of `ajouterDansMessage2'
biblio.c:369: error: conflicting types for 'ajouterDansMessage2'
communications.h:43: error: previous declaration of 'ajouterDansMessage2' was here
biblio.c:369: error: conflicting types for 'ajouterDansMessage2'
communications.h:43: error: previous declaration of 'ajouterDansMessage2' was here
biblio.c:369: warning: data definition has no type or storage class
make: [biblio.o] Error 1 (ignored)
gcc -c -ggdb -Wall emprunts.c
gcc -c -ggdb -Wall gererBD.c
gcc -c -ggdb -Wall sequences.c
gcc -c -ggdb -Wall gererArguments.c
gcc -c -ggdb -Wall gererErreurs.c
gcc -c -ggdb -Wall communications.c
gcc -c -ggdb -Wall outils.c
In file included from outils.c:25:
MiniCUnit.c: In function `assertChainesConcatenerDerniere':
MiniCUnit.c:143: error: invalid type argument of `unary *'
outils.c: In function `secureStrcat':
outils.c:70: warning: passing arg 1 of `assertChainesVide' makes pointer from integer without a cast
outils.c:70: error: void value not ignored as it ought to be
outils.c:70: warning: passing arg 1 of `assertChainesVide' makes pointer from integer without a cast
outils.c:70: error: void value not ignored as it ought to be
make: [outils.o] Error 1 (ignored)
gcc -c -ggdb -Wall MiniCUnit.c
MiniCUnit.c: In function `assertChainesConcatenerDerniere':
MiniCUnit.c:143: error: invalid type argument of `unary *'
make: [MiniCUnit.o] Error 1 (ignored)
gcc -ggdb -Wall -o biblio biblio.o emprunts.o gererBD.o sequences.o gererArguments.o gererErreurs.o communications.o outils.o MiniCUnit.o
gcc: biblio.o: No such file or directory
gcc: outils.o: No such file or directory
gcc: MiniCUnit.o: No such file or directory
make: [biblio] Error 1 (ignored)
gcc -c -ggdb -Wall testGererBD.c
gcc -ggdb -Wall -o testGererBD testGererBD.o emprunts.o gererBD.o sequences.o gererArguments.o gererErreurs.o communications.o outils.o MiniCUnit.o
gcc: outils.o: No such file or directory
gcc: MiniCUnit.o: No such file or directory
make: [testGererBD] Error 1 (ignored)
gcc -c -ggdb -Wall testEmprunts.c
gcc -ggdb -Wall -o testEmprunts testEmprunts.o emprunts.o gererBD.o sequences.o gererArguments.o gererErreurs.o communications.o outils.o MiniCUnit.o
gcc: outils.o: No such file or directory
gcc: MiniCUnit.o: No such file or directory
make: [testEmprunts] Error 1 (ignored)
gcc -c -ggdb -Wall testGererArguments.c
gcc -ggdb -Wall -o testGererArguments testGererArguments.o emprunts.o gererBD.o sequences.o gererArguments.o gererErreurs.o communications.o outils.o MiniCUnit.o
gcc: outils.o: No such file or directory
gcc: MiniCUnit.o: No such file or directory
make: [testGererArguments] Error 1 (ignored)
gcc -c -ggdb -Wall testGererErreurs.c
gcc -ggdb -Wall -o testGererErreurs testGererErreurs.o emprunts.o gererBD.o sequences.o gererArguments.o gererErreurs.o communications.o outils.o MiniCUnit.o
gcc: outils.o: No such file or directory
gcc: MiniCUnit.o: No such file or directory
make: [testGererErreurs] Error 1 (ignored)
gcc -c -ggdb -Wall testCommunications.c
gcc -ggdb -Wall -o testCommunications testCommunications.o emprunts.o gererBD.o sequences.o gererArguments.o gererErreurs.o communications.o outils.o MiniCUnit.o
gcc: outils.o: No such file or directory
gcc: MiniCUnit.o: No such file or directory
make: [testCommunications] Error 1 (ignored)
gcc -c -ggdb -Wall testOutils.c
gcc -ggdb -Wall -o testOutils testOutils.o emprunts.o gererBD.o sequences.o gererArguments.o gererErreurs.o communications.o outils.o MiniCUnit.o
gcc: outils.o: No such file or directory
gcc: MiniCUnit.o: No such file or directory
make: [testOutils] Error 1 (ignored)
arabica(ha891380)[7] /usagers/ha891380/TP3-INF3135 %