All pastes #27910 Raw Edit

Mine

public text v1 · immutable
#27910 ·published 2005-11-07 21:14 UTC
rendered paste body
In file included from ApplicationFactory_impl.cpp:33:
../include/ossie/ApplicationFactory_impl.h:54:27: CosEventComm.hh: No such file or directory
In file included from ApplicationFactory_impl.cpp:33:
../include/ossie/ApplicationFactory_impl.h:59: error: `POA_CosEventComm' is not
   a class or namespace
../include/ossie/ApplicationFactory_impl.h:60: error: `PushConsumer' is not a
   class or namespace
../include/ossie/ApplicationFactory_impl.h:60: error: invalid base-class
   specification
../include/ossie/ApplicationFactory_impl.h:68: error: syntax error before `::'
   token
ApplicationFactory_impl.cpp: In constructor `
   ApplicationFactory_impl::ApplicationFactory_impl(const char*)':
ApplicationFactory_impl.cpp:102: error: `_this' undeclared (first use this
   function)
ApplicationFactory_impl.cpp:102: error: (Each undeclared identifier is reported
   only once for each function it appears in.)
ApplicationFactory_impl.cpp: At global scope:
ApplicationFactory_impl.cpp:679: error: syntax error before `::' token
ApplicationFactory_impl.cpp:680: error: declaration of `virtual void
   ApplicationFactoryEventHandler::push(const CORBA::Any&)' throws different
   exceptions
../include/ossie/ApplicationFactory_impl.h:68: error: than previous declaration
   `virtual void ApplicationFactoryEventHandler::push(const CORBA::Any&) throw
   (CORBA::SystemException)'
make[1]: *** [ApplicationFactory_impl.lo] Error 1
make[1]: Leaving directory `/home/ricej/ossie/ossie_src/ossie-0.0.4-10OCT2005/framework'
make: *** [all-recursive] Error 1