brhist.c:63:21: curses.h: No such file or directory
brhist.c:65:20: term.h: No such file or directory
brhist.c: In function `brhist_init':
brhist.c:180: warning: implicit declaration of function `tgetent'
brhist.c:187: warning: implicit declaration of function `tgetnum'
brhist.c:195: warning: implicit declaration of function `tgetstr'
brhist.c:195: warning: assignment makes pointer from integer without a cast
brhist.c:200: warning: assignment makes pointer from integer without a cast
brhist.c:205: warning: assignment makes pointer from integer without a cast
brhist.c:210: warning: assignment makes pointer from integer without a cast
make[2]: *** [brhist.o] Error 1
make[2]: Leaving directory `/home/workspace/latest-from-cvs/lame-3.97/frontend'
make[1]: *** [all-recursive] Error 1
make[1]: Leaving directory `/home/workspace/latest-from-cvs/lame-3.97'
make: *** [all] Error 2
after installing ncurses-devel
brhist.c: In function `brhist_disp':
brhist.c:432: error: syntax error before '->' token
brhist.c:459: error: invalid type argument of `->'
brhist.c:465: error: invalid type argument of `->'
make[2]: *** [brhist.o] Error 1
make[2]: Leaving directory `/home/vikrant/workspace/latest-from-cvs/lame-3.97/frontend'
make[1]: *** [all-recursive] Error 1
make[1]: Leaving directory `/home/vikrant/workspace/latest-from-cvs/lame-3.97'
make: *** [all] Error 2