All pastes #277264 Raw Edit

Anonyme

public text v1 · immutable
·published 2006-12-13 01:32 UTC
rendered paste body
nsgmls:/var/tmp/portage/gnome-power-manager-2.16.2/work/gnome-power-manager-2.16.2/man/gnome-power-manager.sgml:113:10:E: element "TITLE" undefined
nsgmls:/var/tmp/portage/gnome-power-manager-2.16.2/work/gnome-power-manager-2.16.2/man/gnome-power-manager.sgml:115:9:E: element "PARA" undefined
nsgmls:/var/tmp/portage/gnome-power-manager-2.16.2/work/gnome-power-manager-2.16.2/man/gnome-power-manager.sgml:115:63:E: element "EMAIL" undefined
nsgmls:/var/tmp/portage/gnome-power-manager-2.16.2/work/gnome-power-manager-2.16.2/man/gnome-power-manager.sgml:116:22:E: element "PRODUCTNAME" undefined
nsgmls:/var/tmp/portage/gnome-power-manager-2.16.2/work/gnome-power-manager-2.16.2/man/gnome-power-manager.sgml:116:84:E: element "EMAIL" undefined
make[2]: *** [gnome-power-manager.1] Error 8
make[2]: Leaving directory `/var/tmp/portage/gnome-power-manager-2.16.2/work/gnome-power-manager-2.16.2/man'
make[1]: *** [all-recursive] Error 1
make[1]: Leaving directory `/var/tmp/portage/gnome-power-manager-2.16.2/work/gnome-power-manager-2.16.2'
make: *** [all] Error 2

!!! ERROR: gnome-extra/gnome-power-manager-2.16.2 failed.
Call stack:
  ebuild.sh, line 1546:   Called dyn_compile
  ebuild.sh, line 937:   Called src_compile
  ebuild.sh, line 1255:   Called gnome2_src_compile
  gnome2.eclass, line 78:   Called die

!!! compile failure
!!! If you need support, post the topmost build error, and the call stack if relevant.