Using [/home/Administrator/work/osaf/chandler/chandler] as the chandler/ directory
- + - + - + - + - + - + - + - + - + - + - + - + - + - + - +
Started Tue Dec 12 11:29:39 USEST 2006
Setting up script environment
Running functional tests
Running C:\cygwin\home\Administrator\work\osaf\chandler\chandler\tools\cats\Functional\FunctionalTestSuite.py
+++Starting Suite ChandlerFunctionalTestSuite :: StartTime 16:33:45.43
++++++Starting Test ""TestCreateAccounts"" :: StartTime 16:33:45.98
++++++Ending Test ""TestCreateAccounts"" :: EndTime 16:33:49.44 :: Total Time 3.46 seconds
++++++Starting Test ""TestAllDayEvent"" :: StartTime 16:33:49.44
++++++Ending Test ""TestAllDayEvent"" :: EndTime 16:33:51.50 :: Total Time 2.06 seconds
++++++Starting Test ""TestNewCollection"" :: StartTime 16:33:51.53
++++++Ending Test ""TestNewCollection"" :: EndTime 16:33:56.71 :: Total Time 5.18 seconds
++++++Starting Test ""TestNewEvent"" :: StartTime 16:33:56.77
++++++Ending Test ""TestNewEvent"" :: EndTime 16:34:3.53 :: Total Time 6.76 seconds
++++++Starting Test ""TestNewMail"" :: StartTime 16:34:3.55
++++++Ending Test ""TestNewMail"" :: EndTime 16:34:20.55 :: Total Time 17.00 seconds
++++++Starting Test ""TestNewTask"" :: StartTime 16:34:20.61
++++++Ending Test ""TestNewTask"" :: EndTime 16:34:22.09 :: Total Time 1.48 seconds
++++++Starting Test ""TestNewNote"" :: StartTime 16:34:22.11
++++++Ending Test ""TestNewNote"" :: EndTime 16:34:23.57 :: Total Time 1.45 seconds
++++++Starting Test ""TestTriageSectioning"" :: StartTime 16:34:23.58
++++++Ending Test ""TestTriageSectioning"" :: EndTime 16:34:26.82 :: Total Time 3.24 seconds
++++++Starting Test ""TestTableSelection"" :: StartTime 16:34:26.84
++++++Ending Test ""TestTableSelection"" :: EndTime 16:34:38.28 :: Total Time 11.44 seconds
++++++Starting Test ""TestStamping"" :: StartTime 16:34:38.31
++++++Ending Test ""TestStamping"" :: EndTime 16:34:41.14 :: Total Time 2.83 seconds
++++++Starting Test ""TestSharing"" :: StartTime 16:34:41.15
++++++Ending Test ""TestSharing"" :: EndTime 16:35:29.68 :: Total Time 48.53 seconds
++++++Starting Test ""TestMoveToTrash"" :: StartTime 16:35:29.73
++++++Ending Test ""TestMoveToTrash"" :: EndTime 16:35:36.57 :: Total Time 6.84 seconds
++++++Starting Test ""TestDeleteCollection"" :: StartTime 16:35:36.58
++++++Ending Test ""TestDeleteCollection"" :: EndTime 16:35:39.13 :: Total Time 2.55 seconds
++++++Starting Test ""TestMulti"" :: StartTime 16:35:39.16
++++++Ending Test ""TestMulti"" :: EndTime 16:35:59.21 :: Total Time 20.05 seconds
++++++Starting Test ""TestCalView"" :: StartTime 16:35:59.23
++++++Ending Test ""TestCalView"" :: EndTime 16:36:3.92 :: Total Time 4.69 seconds
++++++Starting Test ""TestReminderProcessing"" :: StartTime 16:36:3.96
++++++Ending Test ""TestReminderProcessing"" :: EndTime 16:36:22.36 :: Total Time 18.41 seconds
++++++Starting Test ""TestRecurrenceImporting"" :: StartTime 16:36:22.40
++++++Ending Test ""TestRecurrenceImporting"" :: EndTime 16:36:33.34 :: Total Time 10.95 seconds
++++++Starting Test ""TestRecurringEvent"" :: StartTime 16:36:33.36
++++++Ending Test ""TestRecurringEvent"" :: EndTime 16:36:48.81 :: Total Time 15.45 seconds
++++++Starting Test ""TestSwitchingViews"" :: StartTime 16:36:48.84
++++++Ending Test ""TestSwitchingViews"" :: EndTime 16:36:51.26 :: Total Time 2.42 seconds
++++++Starting Test ""TestExporting"" :: StartTime 16:36:51.28
++++++Ending Test ""TestExporting"" :: EndTime 16:36:52.33 :: Total Time 1.05 seconds
++++++Starting Test ""TestFlickr"" :: StartTime 16:36:52.35
++++++Ending Test ""TestFlickr"" :: EndTime 16:37:6.11 :: Total Time 13.76 seconds
++++++Starting Test ""TestImporting"" :: StartTime 16:37:6.14
++++++Ending Test ""TestImporting"" :: EndTime 16:37:6.37 :: Total Time 0.23 seconds
++++++Starting Test ""TestImportOverwrite"" :: StartTime 16:37:6.39
++++++Ending Test ""TestImportOverwrite"" :: EndTime 16:37:32.85 :: Total Time 26.46 seconds
++++++Starting Test ""TestCertstoreView"" :: StartTime 16:37:32.99
++++++Ending Test ""TestCertstoreView"" :: EndTime 16:37:45.30 :: Total Time 12.31 seconds
++++++Starting Test ""TestEventStacking"" :: StartTime 16:37:45.43
++++++Ending Test ""TestEventStacking"" :: EndTime 16:38:8.31 :: Total Time 22.88 seconds
++++++Starting Test ""TestRemoveFromTrashOnImport"" :: StartTime 16:38:8.41
++++++Ending Test ""TestRemoveFromTrashOnImport"" :: EndTime 16:38:15.57 :: Total Time 7.15 seconds
++++++Starting Test ""TestEnableTimezones"" :: StartTime 16:38:16.02
++++++Ending Test ""TestEnableTimezones"" :: EndTime 16:38:22.23 :: Total Time 6.22 seconds
++++++Starting Test ""TestSwitchTimezone"" :: StartTime 16:38:22.48
++++++Ending Test ""TestSwitchTimezone"" :: EndTime 16:38:25.97 :: Total Time 3.50 seconds
++++++Starting Test ""TestBlocks"" :: StartTime 16:38:26.10
++++++Ending Test ""TestBlocks"" :: EndTime 16:39:29.57 :: Total Time 63.48 seconds
+++Ending Suite ""ChandlerFunctionalTestSuite"" :: EndTime 16:41:3.82 :: Total Time 438.39 seconds
*** Test Report ***
$Suites run=1, pass=1, fail=0 :: Tests run=29, pass=29, fail=0 :: Tests skipped=None :: Actions run=399, pass=399, fail=0 :: Reports run=590, pass=590, fail=0
*********** TEST RESULTS ************
*************************************
TestCreateAccounts____________ passed
TestAllDayEvent_______________ passed
TestNewCollection_____________ passed
TestNewEvent__________________ passed
TestNewMail___________________ passed
TestNewTask___________________ passed
TestNewNote___________________ passed
TestTriageSectioning__________ passed
TestTableSelection____________ passed
TestStamping__________________ passed
TestSharing___________________ passed
TestMoveToTrash_______________ passed
TestDeleteCollection__________ passed
TestMulti_____________________ passed
TestCalView___________________ passed
TestReminderProcessing________ passed
TestRecurrenceImporting_______ passed
TestRecurringEvent____________ passed
TestSwitchingViews____________ passed
TestExporting_________________ passed
TestFlickr____________________ passed
TestImporting_________________ passed
TestImportOverwrite___________ passed
TestCertstoreView_____________ passed
TestEventStacking_____________ passed
TestRemoveFromTrashOnImport___ passed
TestEnableTimezones___________ passed
TestSwitchTimezone____________ passed
TestBlocks____________________ passed
*************************************
#TINDERBOX# Testname = ChandlerFunctionalTestSuite
#TINDERBOX# Time elapsed = 438.39 (seconds)
#TINDERBOX# Status = PASSED
[2260635 refs]
- - - - - - - - - - - - - - - - - - - - - - - - - -
C:\cygwin\home\Administrator\work\osaf\chandler\chandler\tools\cats\Functional\FunctionalTestSuite.py [#TINDERBOX# Status = PASSED
]
Running C:\cygwin\home\Administrator\work\osaf\chandler\chandler\tools\cats\Functional\FunctionalTestSuite.py
+++Starting Suite ChandlerFunctionalTestSuite :: StartTime 16:45:21.88
++++++Starting Test ""TestCreateAccounts"" :: StartTime 16:45:21.93
++++++Ending Test ""TestCreateAccounts"" :: EndTime 16:45:22.45 :: Total Time 0.52 seconds
++++++Starting Test ""TestAllDayEvent"" :: StartTime 16:45:22.48
++++++Ending Test ""TestAllDayEvent"" :: EndTime 16:45:23.57 :: Total Time 1.09 seconds
++++++Starting Test ""TestNewCollection"" :: StartTime 16:45:23.58
++++++Ending Test ""TestNewCollection"" :: EndTime 16:45:26.43 :: Total Time 2.85 seconds
++++++Starting Test ""TestNewEvent"" :: StartTime 16:45:26.44
++++++Ending Test ""TestNewEvent"" :: EndTime 16:45:29.80 :: Total Time 3.35 seconds
++++++Starting Test ""TestNewMail"" :: StartTime 16:45:29.81
++++++Ending Test ""TestNewMail"" :: EndTime 16:45:35.17 :: Total Time 5.36 seconds
++++++Starting Test ""TestNewTask"" :: StartTime 16:45:35.17
++++++Ending Test ""TestNewTask"" :: EndTime 16:45:36.06 :: Total Time 0.89 seconds
++++++Starting Test ""TestNewNote"" :: StartTime 16:45:36.07
++++++Ending Test ""TestNewNote"" :: EndTime 16:45:36.95 :: Total Time 0.88 seconds
++++++Starting Test ""TestTriageSectioning"" :: StartTime 16:45:36.96
++++++Ending Test ""TestTriageSectioning"" :: EndTime 16:45:38.68 :: Total Time 1.72 seconds
++++++Starting Test ""TestTableSelection"" :: StartTime 16:45:38.70
++++++Ending Test ""TestTableSelection"" :: EndTime 16:45:45.20 :: Total Time 6.50 seconds
++++++Starting Test ""TestStamping"" :: StartTime 16:45:45.22
++++++Ending Test ""TestStamping"" :: EndTime 16:45:46.78 :: Total Time 1.56 seconds
++++++Starting Test ""TestSharing"" :: StartTime 16:45:46.79
++++++Ending Test ""TestSharing"" :: EndTime 16:46:16.80 :: Total Time 30.00 seconds
++++++Starting Test ""TestMoveToTrash"" :: StartTime 16:46:16.82
++++++Ending Test ""TestMoveToTrash"" :: EndTime 16:46:21.05 :: Total Time 4.24 seconds
++++++Starting Test ""TestDeleteCollection"" :: StartTime 16:46:21.09
++++++Ending Test ""TestDeleteCollection"" :: EndTime 16:46:22.56 :: Total Time 1.46 seconds
++++++Starting Test ""TestMulti"" :: StartTime 16:46:22.59
++++++Ending Test ""TestMulti"" :: EndTime 16:46:30.89 :: Total Time 8.31 seconds
++++++Starting Test ""TestCalView"" :: StartTime 16:46:30.89
++++++Ending Test ""TestCalView"" :: EndTime 16:46:33.05 :: Total Time 2.16 seconds
++++++Starting Test ""TestReminderProcessing"" :: StartTime 16:46:33.07
++++++Ending Test ""TestReminderProcessing"" :: EndTime 16:46:51.20 :: Total Time 18.13 seconds
++++++Starting Test ""TestRecurrenceImporting"" :: StartTime 16:46:51.23
++++++Ending Test ""TestRecurrenceImporting"" :: EndTime 16:46:54.66 :: Total Time 3.44 seconds
++++++Starting Test ""TestRecurringEvent"" :: StartTime 16:46:54.70
++++++Ending Test ""TestRecurringEvent"" :: EndTime 16:47:3.51 :: Total Time 8.81 seconds
+++Ending Suite ""ChandlerFunctionalTestSuite"" :: EndTime 16:47:4.62 :: Total Time 102.74 seconds
*** Test Report ***
Suite ""ChandlerFunctionalTestSuite"" Failed :: Total Time ""0:01:42.735000"" :: Comment ""None""
Test ""TestRecurringEvent"" Failed :: Total Time ""0:00:08.813000"" :: Comment ""None :: [16:46:57.03] Object state :: [16:46:58.91] Object state :: [16:47:0.95] Object state :: [16:47:3.51] Object state
None""
Action ""Check_DetailView"" Failed :: Total Time ""0:00:00"" :: Comment ""None""
Report ""CheckEditableBlock"" Failed :: Comment ""(On recurrence end Checking) || detail view value = ? ; expected value = 3/1/2006""
Action ""Recurring event change window is still open at end of test"" Failed :: Total Time ""0:00:00"" :: Comment ""Action created by framework for report call""
Report ""Action created by framework for report call"" Failed :: Comment ""None""
$Suites run=1, pass=0, fail=1 :: Tests run=18, pass=17, fail=1 :: Tests skipped=11 :: Actions run=297, pass=295, fail=2 :: Reports run=415, pass=413, fail=2
*********** TEST RESULTS ************
*************************************
TestCreateAccounts____________ passed
TestAllDayEvent_______________ passed
TestNewCollection_____________ passed
TestNewEvent__________________ passed
TestNewMail___________________ passed
TestNewTask___________________ passed
TestNewNote___________________ passed
TestTriageSectioning__________ passed
TestTableSelection____________ passed
TestStamping__________________ passed
TestSharing___________________ passed
TestMoveToTrash_______________ passed
TestDeleteCollection__________ passed
TestMulti_____________________ passed
TestCalView___________________ passed
TestReminderProcessing________ passed
TestRecurrenceImporting_______ passed
TestRecurringEvent____________*FAILED*
** 11 tests skipped after failure **
*************************************
#TINDERBOX# Testname = ChandlerFunctionalTestSuite
#TINDERBOX# Time elapsed = 102.74 (seconds)
#TINDERBOX# Status = FAILED
- - - - - - - - - - - - - - - - - - - - - - - - - -
C:\cygwin\home\Administrator\work\osaf\chandler\chandler\tools\cats\Functional\FunctionalTestSuite.py []
- + - + - + - + - + - + - + - + - + - + - + - + - + - + - +
The following tests failed
(release)C:\cygwin\home\Administrator\work\osaf\chandler\chandler\tools\cats\Functional\FunctionalTestSuite.py
Using [/home/Administrator/work/osaf/chandler/chandler] as the chandler/ directory
- + - + - + - + - + - + - + - + - + - + - + - + - + - + - +
Started Tue Dec 12 12:07:13 USEST 2006
Setting up script environment
Running debug mode only
Running functional tests
Running C:\cygwin\home\Administrator\work\osaf\chandler\chandler\tools\cats\Functional\FunctionalTestSuite.py
+++Starting Suite ChandlerFunctionalTestSuite :: StartTime 17:7:51.75
++++++Starting Test ""TestCreateAccounts"" :: StartTime 17:7:51.81
++++++Ending Test ""TestCreateAccounts"" :: EndTime 17:7:52.56 :: Total Time 0.75 seconds
++++++Starting Test ""TestAllDayEvent"" :: StartTime 17:7:52.57
++++++Ending Test ""TestAllDayEvent"" :: EndTime 17:7:54.38 :: Total Time 1.81 seconds
++++++Starting Test ""TestNewCollection"" :: StartTime 17:7:54.42
++++++Ending Test ""TestNewCollection"" :: EndTime 17:7:59.72 :: Total Time 5.30 seconds
++++++Starting Test ""TestNewEvent"" :: StartTime 17:7:59.74
++++++Ending Test ""TestNewEvent"" :: EndTime 17:8:6.44 :: Total Time 6.70 seconds
++++++Starting Test ""TestNewMail"" :: StartTime 17:8:6.45
++++++Ending Test ""TestNewMail"" :: EndTime 17:8:15.92 :: Total Time 9.47 seconds
++++++Starting Test ""TestNewTask"" :: StartTime 17:8:15.96
++++++Ending Test ""TestNewTask"" :: EndTime 17:8:17.51 :: Total Time 1.54 seconds
++++++Starting Test ""TestNewNote"" :: StartTime 17:8:17.53
++++++Ending Test ""TestNewNote"" :: EndTime 17:8:19.03 :: Total Time 1.50 seconds
++++++Starting Test ""TestTriageSectioning"" :: StartTime 17:8:19.04
++++++Ending Test ""TestTriageSectioning"" :: EndTime 17:8:22.26 :: Total Time 3.22 seconds
++++++Starting Test ""TestTableSelection"" :: StartTime 17:8:22.26
++++++Ending Test ""TestTableSelection"" :: EndTime 17:8:45.68 :: Total Time 23.42 seconds
++++++Starting Test ""TestStamping"" :: StartTime 17:8:45.71
++++++Ending Test ""TestStamping"" :: EndTime 17:8:48.74 :: Total Time 3.03 seconds
++++++Starting Test ""TestSharing"" :: StartTime 17:8:48.74
++++++Ending Test ""TestSharing"" :: EndTime 17:9:30.22 :: Total Time 41.47 seconds
++++++Starting Test ""TestMoveToTrash"" :: StartTime 17:9:30.25
++++++Ending Test ""TestMoveToTrash"" :: EndTime 17:9:37.54 :: Total Time 7.29 seconds
++++++Starting Test ""TestDeleteCollection"" :: StartTime 17:9:37.54
++++++Ending Test ""TestDeleteCollection"" :: EndTime 17:9:42.72 :: Total Time 5.18 seconds
++++++Starting Test ""TestMulti"" :: StartTime 17:9:42.72
++++++Ending Test ""TestMulti"" :: EndTime 17:10:24.40 :: Total Time 41.68 seconds
++++++Starting Test ""TestCalView"" :: StartTime 17:10:24.44
++++++Ending Test ""TestCalView"" :: EndTime 17:10:28.40 :: Total Time 3.97 seconds
++++++Starting Test ""TestReminderProcessing"" :: StartTime 17:10:28.42
++++++Ending Test ""TestReminderProcessing"" :: EndTime 17:10:46.35 :: Total Time 17.93 seconds
++++++Starting Test ""TestRecurrenceImporting"" :: StartTime 17:10:46.38
++++++Ending Test ""TestRecurrenceImporting"" :: EndTime 17:10:53.79 :: Total Time 7.41 seconds
++++++Starting Test ""TestRecurringEvent"" :: StartTime 17:10:53.81
++++++Ending Test ""TestRecurringEvent"" :: EndTime 17:11:10.44 :: Total Time 16.62 seconds
++++++Starting Test ""TestSwitchingViews"" :: StartTime 17:11:10.45
++++++Ending Test ""TestSwitchingViews"" :: EndTime 17:11:13.10 :: Total Time 2.65 seconds
++++++Starting Test ""TestExporting"" :: StartTime 17:11:13.16
++++++Ending Test ""TestExporting"" :: EndTime 17:11:15.67 :: Total Time 2.51 seconds
++++++Starting Test ""TestFlickr"" :: StartTime 17:11:15.68
++++++Ending Test ""TestFlickr"" :: EndTime 17:11:47.12 :: Total Time 31.44 seconds
++++++Starting Test ""TestImporting"" :: StartTime 17:11:47.17
++++++Ending Test ""TestImporting"" :: EndTime 17:11:47.54 :: Total Time 0.37 seconds
++++++Starting Test ""TestImportOverwrite"" :: StartTime 17:11:47.57
++++++Ending Test ""TestImportOverwrite"" :: EndTime 17:11:55.63 :: Total Time 8.06 seconds
++++++Starting Test ""TestCertstoreView"" :: StartTime 17:11:55.66
++++++Ending Test ""TestCertstoreView"" :: EndTime 17:12:0.84 :: Total Time 5.19 seconds
++++++Starting Test ""TestEventStacking"" :: StartTime 17:12:0.86
++++++Ending Test ""TestEventStacking"" :: EndTime 17:12:24.45 :: Total Time 23.58 seconds
++++++Starting Test ""TestRemoveFromTrashOnImport"" :: StartTime 17:12:24.48
++++++Ending Test ""TestRemoveFromTrashOnImport"" :: EndTime 17:12:30.20 :: Total Time 5.73 seconds
++++++Starting Test ""TestEnableTimezones"" :: StartTime 17:12:30.25
++++++Ending Test ""TestEnableTimezones"" :: EndTime 17:12:34.16 :: Total Time 3.92 seconds
++++++Starting Test ""TestSwitchTimezone"" :: StartTime 17:12:34.33
++++++Ending Test ""TestSwitchTimezone"" :: EndTime 17:12:47.18 :: Total Time 12.85 seconds
++++++Starting Test ""TestBlocks"" :: StartTime 17:12:47.21
++++++Ending Test ""TestBlocks"" :: EndTime 17:13:8.27 :: Total Time 21.06 seconds
+++Ending Suite ""ChandlerFunctionalTestSuite"" :: EndTime 17:13:15.79 :: Total Time 324.05 seconds
*** Test Report ***
$Suites run=1, pass=1, fail=0 :: Tests run=29, pass=29, fail=0 :: Tests skipped=None :: Actions run=399, pass=399, fail=0 :: Reports run=590, pass=590, fail=0
*********** TEST RESULTS ************
*************************************
TestCreateAccounts____________ passed
TestAllDayEvent_______________ passed
TestNewCollection_____________ passed
TestNewEvent__________________ passed
TestNewMail___________________ passed
TestNewTask___________________ passed
TestNewNote___________________ passed
TestTriageSectioning__________ passed
TestTableSelection____________ passed
TestStamping__________________ passed
TestSharing___________________ passed
TestMoveToTrash_______________ passed
TestDeleteCollection__________ passed
TestMulti_____________________ passed
TestCalView___________________ passed
TestReminderProcessing________ passed
TestRecurrenceImporting_______ passed
TestRecurringEvent____________ passed
TestSwitchingViews____________ passed
TestExporting_________________ passed
TestFlickr____________________ passed
TestImporting_________________ passed
TestImportOverwrite___________ passed
TestCertstoreView_____________ passed
TestEventStacking_____________ passed
TestRemoveFromTrashOnImport___ passed
TestEnableTimezones___________ passed
TestSwitchTimezone____________ passed
TestBlocks____________________ passed
*************************************
#TINDERBOX# Testname = ChandlerFunctionalTestSuite
#TINDERBOX# Time elapsed = 324.05 (seconds)
#TINDERBOX# Status = PASSED
[2276601 refs]
- - - - - - - - - - - - - - - - - - - - - - - - - -
C:\cygwin\home\Administrator\work\osaf\chandler\chandler\tools\cats\Functional\FunctionalTestSuite.py [#TINDERBOX# Status = PASSED
]
- + - + - + - + - + - + - + - + - + - + - + - + - + - + - +
All tests passed
Using [/home/Administrator/work/osaf/chandler/chandler] as the chandler/ directory
- + - + - + - + - + - + - + - + - + - + - + - + - + - + - +
Started Tue Dec 12 12:14:30 USEST 2006
Setting up script environment
Running release mode only
Running functional tests
Running C:\cygwin\home\Administrator\work\osaf\chandler\chandler\tools\cats\Functional\FunctionalTestSuite.py
+++Starting Suite ChandlerFunctionalTestSuite :: StartTime 17:14:58.78
++++++Starting Test ""TestCreateAccounts"" :: StartTime 17:14:58.82
++++++Ending Test ""TestCreateAccounts"" :: EndTime 17:14:59.54 :: Total Time 0.72 seconds
++++++Starting Test ""TestAllDayEvent"" :: StartTime 17:14:59.54
++++++Ending Test ""TestAllDayEvent"" :: EndTime 17:15:0.61 :: Total Time 1.07 seconds
++++++Starting Test ""TestNewCollection"" :: StartTime 17:15:0.62
++++++Ending Test ""TestNewCollection"" :: EndTime 17:15:3.46 :: Total Time 2.83 seconds
++++++Starting Test ""TestNewEvent"" :: StartTime 17:15:3.48
++++++Ending Test ""TestNewEvent"" :: EndTime 17:15:6.98 :: Total Time 3.50 seconds
++++++Starting Test ""TestNewMail"" :: StartTime 17:15:6.99
++++++Ending Test ""TestNewMail"" :: EndTime 17:15:12.22 :: Total Time 5.23 seconds
++++++Starting Test ""TestNewTask"" :: StartTime 17:15:12.22
++++++Ending Test ""TestNewTask"" :: EndTime 17:15:13.13 :: Total Time 0.91 seconds
++++++Starting Test ""TestNewNote"" :: StartTime 17:15:13.15
++++++Ending Test ""TestNewNote"" :: EndTime 17:15:14.05 :: Total Time 0.90 seconds
++++++Starting Test ""TestTriageSectioning"" :: StartTime 17:15:14.06
++++++Ending Test ""TestTriageSectioning"" :: EndTime 17:15:15.83 :: Total Time 1.77 seconds
++++++Starting Test ""TestTableSelection"" :: StartTime 17:15:15.84
++++++Ending Test ""TestTableSelection"" :: EndTime 17:15:22.56 :: Total Time 6.72 seconds
++++++Starting Test ""TestStamping"" :: StartTime 17:15:22.58
++++++Ending Test ""TestStamping"" :: EndTime 17:15:24.19 :: Total Time 1.60 seconds
++++++Starting Test ""TestSharing"" :: StartTime 17:15:24.19
++++++Ending Test ""TestSharing"" :: EndTime 17:15:45.32 :: Total Time 21.13 seconds
++++++Starting Test ""TestMoveToTrash"" :: StartTime 17:15:45.33
++++++Ending Test ""TestMoveToTrash"" :: EndTime 17:15:52.95 :: Total Time 7.62 seconds
++++++Starting Test ""TestDeleteCollection"" :: StartTime 17:15:53.02
++++++Ending Test ""TestDeleteCollection"" :: EndTime 17:15:55.70 :: Total Time 2.68 seconds
++++++Starting Test ""TestMulti"" :: StartTime 17:15:55.76
++++++Ending Test ""TestMulti"" :: EndTime 17:16:11.79 :: Total Time 16.03 seconds
++++++Starting Test ""TestCalView"" :: StartTime 17:16:11.83
++++++Ending Test ""TestCalView"" :: EndTime 17:16:15.23 :: Total Time 3.40 seconds
++++++Starting Test ""TestReminderProcessing"" :: StartTime 17:16:15.38
++++++Ending Test ""TestReminderProcessing"" :: EndTime 17:16:32.20 :: Total Time 16.82 seconds
++++++Starting Test ""TestRecurrenceImporting"" :: StartTime 17:16:32.25
++++++Ending Test ""TestRecurrenceImporting"" :: EndTime 17:16:35.77 :: Total Time 3.52 seconds
++++++Starting Test ""TestRecurringEvent"" :: StartTime 17:16:35.77
Traceback (most recent call last):
File "C:\cygwin\home\Administrator\work\osaf\chandler\chandler\parcels\osaf\framework\blocks\ControlBlocks.py", line 1537, in onLoseFocusFromWidget
self.saveValue()
File "C:\cygwin\home\Administrator\work\osaf\chandler\chandler\parcels\osaf\framework\blocks\ControlBlocks.py", line 1549, in saveValue
editor.EndControlEdit(self.item, self.attributeName, widget)
File "C:\cygwin\home\Administrator\work\osaf\chandler\chandler\parcels\osaf\framework\attributeEditors\AttributeEditors.py", line 1251, in EndControlEdit
self.SetAttributeValue (item, attributeName, value)
File "C:\cygwin\home\Administrator\work\osaf\chandler\chandler\parcels\osaf\views\detail\detail.py", line 1665, in SetAttributeValue
assert False, "Hey - Setting 'ends' on an event without a recurrence rule?"
AssertionError: Hey - Setting 'ends' on an event without a recurrence rule?
Traceback (most recent call last):
File "C:\cygwin\home\Administrator\work\osaf\chandler\chandler\parcels\osaf\framework\attributeEditors\AttributeEditors.py", line 720, in OnEditLoseFocus
NotifyBlockToSaveValue(self)
File "C:\cygwin\home\Administrator\work\osaf\chandler\chandler\parcels\osaf\framework\attributeEditors\AttributeEditors.py", line 712, in NotifyBlockToSaveValue
saveMethod()
File "C:\cygwin\home\Administrator\work\osaf\chandler\chandler\parcels\osaf\framework\blocks\ControlBlocks.py", line 1549, in saveValue
editor.EndControlEdit(self.item, self.attributeName, widget)
File "C:\cygwin\home\Administrator\work\osaf\chandler\chandler\parcels\osaf\framework\attributeEditors\AttributeEditors.py", line 1251, in EndControlEdit
self.SetAttributeValue (item, attributeName, value)
File "C:\cygwin\home\Administrator\work\osaf\chandler\chandler\parcels\osaf\views\detail\detail.py", line 1665, in SetAttributeValue
assert False, "Hey - Setting 'ends' on an event without a recurrence rule?"
AssertionError: Hey - Setting 'ends' on an event without a recurrence rule?
Traceback (most recent call last):
File "C:\cygwin\home\Administrator\work\osaf\chandler\chandler\parcels\osaf\framework\blocks\ControlBlocks.py", line 1511, in onClickFromWidget
Block.finishEdits(oldFocus) # finish any edits in progress
File "C:\cygwin\home\Administrator\work\osaf\chandler\chandler\parcels\osaf\framework\blocks\Block.py", line 704, in finishEdits
saveValueMethod(onBlock)
File "C:\cygwin\home\Administrator\work\osaf\chandler\chandler\parcels\osaf\framework\blocks\ControlBlocks.py", line 1549, in saveValue
editor.EndControlEdit(self.item, self.attributeName, widget)
File "C:\cygwin\home\Administrator\work\osaf\chandler\chandler\parcels\osaf\framework\attributeEditors\AttributeEditors.py", line 1251, in EndControlEdit
self.SetAttributeValue (item, attributeName, value)
File "C:\cygwin\home\Administrator\work\osaf\chandler\chandler\parcels\osaf\views\detail\detail.py", line 1665, in SetAttributeValue
assert False, "Hey - Setting 'ends' on an event without a recurrence rule?"
AssertionError: Hey - Setting 'ends' on an event without a recurrence rule?
Traceback (most recent call last):
File "C:\cygwin\home\Administrator\work\osaf\chandler\chandler\parcels\osaf\framework\blocks\ControlBlocks.py", line 1537, in onLoseFocusFromWidget
self.saveValue()
File "C:\cygwin\home\Administrator\work\osaf\chandler\chandler\parcels\osaf\framework\blocks\ControlBlocks.py", line 1549, in saveValue
editor.EndControlEdit(self.item, self.attributeName, widget)
File "C:\cygwin\home\Administrator\work\osaf\chandler\chandler\parcels\osaf\framework\attributeEditors\AttributeEditors.py", line 1251, in EndControlEdit
self.SetAttributeValue (item, attributeName, value)
File "C:\cygwin\home\Administrator\work\osaf\chandler\chandler\parcels\osaf\views\detail\detail.py", line 1665, in SetAttributeValue
assert False, "Hey - Setting 'ends' on an event without a recurrence rule?"
AssertionError: Hey - Setting 'ends' on an event without a recurrence rule?
Traceback (most recent call last):
File "C:\cygwin++++++Ending Test ""TestRecurringEvent"" :: EndTime 17:16:43.91 :: Total Time 8.14 seconds
+++Ending Suite ""ChandlerFunctionalTestSuite"" :: EndTime 17:16:44.82 :: Total Time 106.04 seconds
*** Test Report ***
Suite ""ChandlerFunctionalTestSuite"" Failed :: Total Time ""0:01:46.040000"" :: Comment ""None""
Test ""TestRecurringEvent"" Failed :: Total Time ""0:00:08.142000"" :: Comment ""None :: [17:16:38.57] Object state :: [17:16:39.81] Object state :: [17:16:42.22] Object state :: [17:16:43.91] Object state
None""
Action ""Check_DetailView"" Failed :: Total Time ""0:00:00"" :: Comment ""None""
Report ""CheckEditableBlock"" Failed :: Comment ""(On recurrence end Checking) || detail view value = ? ; expected value = 3/25/2006""
Action ""Event creation"" Failed :: Total Time ""0:00:00.471000"" :: Comment ""None""
Report ""stderr output detected
Traceback (most recent call last):
File "C:\cygwin\home\Administrator\work\osaf\chandler\chandler\parcels\osaf\framework\blocks\ControlBlocks.py", line 1537, in onLoseFocusFromWidget
self.saveValue()
File "C:\cygwin\home\Administrator\work\osaf\chandler\chandler\parcels\osaf\framework\blocks\ControlBlocks.py", line 1549, in saveValue
editor.EndControlEdit(self.item, self.attributeName, widget)
File "C:\cygwin\home\Administrator\work\osaf\chandler\chandler\parcels\osaf\framework\attributeEditors\AttributeEditors.py", line 1251, in EndControlEdit
self.SetAttributeValue (item, attributeName, value)
File "C:\cygwin\home\Administrator\work\osaf\chandler\chandler\parcels\osaf\views\detail\detail.py", line 1665, in SetAttributeValue
assert False, "Hey - Setting 'ends' on an event without a recurrence rule?"
AssertionError: Hey - Setting 'ends' on an event without a recurrence rule?
Traceback (most recent call last):
File "C:\cygwin\home\Administrator\work\osaf\chandler\chandler\parcels\osaf\framework\attributeEditors\AttributeEditors.py", line 720, in OnEditLoseFocus
NotifyBlockToSaveValue(self)
File "C:\cygwin\home\Administrator\work\osaf\chandler\chandler\parcels\osaf\framework\attributeEditors\AttributeEditors.py", line 712, in NotifyBlockToSaveValue
saveMethod()
File "C:\cygwin\home\Administrator\work\osaf\chandler\chandler\parcels\osaf\framework\blocks\ControlBlocks.py", line 1549, in saveValue
editor.EndControlEdit(self.item, self.attributeName, widget)
File "C:\cygwin\home\Administrator\work\osaf\chandler\chandler\parcels\osaf\framework\attributeEditors\AttributeEditors.py", line 1251, in EndControlEdit
self.SetAttributeValue (item, attributeName, value)
File "C:\cygwin\home\Administrator\work\osaf\chandler\chandler\parcels\osaf\views\detail\detail.py", line 1665, in SetAttributeValue
assert False, "Hey - Setting 'ends' on an event without a recurrence rule?"
AssertionError: Hey - Setting 'ends' on an event without a recurrence rule?
"" Failed :: Comment ""None""
Action ""Multiple Attribute Setting"" Failed :: Total Time ""0:00:01.933000"" :: Comment ""None""
Report ""stderr output detected
Traceback (most recent call last):
File "C:\cygwin\home\Administrator\work\osaf\chandler\chandler\parcels\osaf\framework\blocks\ControlBlocks.py", line 1511, in onClickFromWidget
Block.finishEdits(oldFocus) # finish any edits in progress
File "C:\cygwin\home\Administrator\work\osaf\chandler\chandler\parcels\osaf\framework\blocks\Block.py", line 704, in finishEdits
saveValueMethod(onBlock)
File "C:\cygwin\home\Administrator\work\osaf\chandler\chandler\parcels\osaf\framework\blocks\ControlBlocks.py", line 1549, in saveValue
editor.EndControlEdit(self.item, self.attributeName, widget)
File "C:\cygwin\home\Administrator\work\osaf\chandler\chandler\parcels\osaf\framework\attributeEditors\AttributeEditors.py", line 1251, in EndControlEdit
self.SetAttributeValue (item, attributeName, value)
File "C:\cygwin\home\Administrator\work\osaf\chandler\chandler\parcels\osaf\views\detail\detail.py", line 1665, in SetAttributeValue
assert False, "Hey - Setting 'ends' on an event without a recurrence rule?"
AssertionError: Hey - Setting 'ends' on an event without a recurrence rule?
Traceback (most recent call last):
File "C:\cygwin\home\Administrator\work\osaf\chandler\chandler\parcels\osaf\framework\blocks\ControlBlocks.py", line 1537, in onLoseFocusFromWidget
self.saveValue()
File "C:\cygwin\home\Administrator\work\osaf\chandler\chandler\parcels\osaf\framework\blocks\ControlBlocks.py", line 1549, in saveValue
editor.EndControlEdit(self.item, self.attributeName, widget)
File "C:\cygwin\home\Administrator\work\osaf\chandler\chandler\parcels\osaf\framework\attributeEditors\AttributeEditors.py", line 1251, in EndControlEdit
self.SetAttributeValue (item, attributeName, value)
File "C:\cygwin\home\Administrator\work\osaf\chandler\chandler\parcels\osaf\views\detail\detail.py", line 1665, in SetAttributeValue
assert False, "Hey - Setting 'ends' on an event without a recurrence rule?"
AssertionError: Hey - Setting 'ends' on an event without a recurrence rule?
Traceback (most recent call last):
File "C:\cygwin\home\Administrator\work\osaf\chandler\chandler\parcels\osaf\framework\attributeEditors\AttributeEditors.py", line 720, in OnEditLoseFocus
NotifyBlockToSaveValue(self)
File "C:\cygwin\home\Administrator\work\osaf\chandler\chandler\parcels\osaf\framework\attributeEditors\AttributeEditors.py", line 712, in NotifyBlockToSaveValue
saveMethod()
File "C:\cygwin\home\Administrator\work\osaf\chandler\chandler\parcels\osaf\framework\blocks\ControlBlocks.py", line 1549, in saveValue
editor.EndControlEdit(self.item, self.attributeName, widget)
File "C:\cygwin\home\Administrator\work\osaf\chandler\chandler\parcels\osaf\framework\attributeEditors\AttributeEditors.py", line 1251, in EndControlEdit
self.SetAttributeValue (item, attributeName, value)
File "C:\cygwin\home\Administrator\work\osaf\chandler\chandler\parcels\osaf\views\detail\detail.py", line 1665, in SetAttributeValue
assert False, "Hey - Setting 'ends' on an event without a recurrence rule?"
AssertionError: Hey - Setting 'ends' on an event without a recurrence rule?
Traceback (most recent call last):
File "C:\cygwin\home\Administrator\work\osaf\chandler\chandler\parcels\osaf\framework\blocks\ControlBlocks.py", line 1537, in onLoseFocusFromWidget
self.saveValue()
File "C:\cygwin\home\Administrator\work\osaf\chandler\chandler\parcels\osaf\framework\blocks\ControlBlocks.py", line 1549, in saveValue
editor.EndControlEdit(self.item, self.attributeName, widget)
File "C:\cygwin\home\Administrator\work\osaf\chandler\chandler\parcels\osaf\framework\attributeEditors\AttributeEditors.py", line 1251, in EndControlEdit
self.SetAttributeValue (item, attributeName, value)
File "C:\cygwin\home\Administrator\work\osaf\chandler\chandler\parcels\osaf\views\detail\detail.py", line 1665, in SetAttributeValue
assert False, "Hey - Setting 'ends' on an event without a recurrence rule?"
AssertionError: Hey - Setting 'ends' on an event without a recurrence rule?
Traceback (most recent call last):
File "C:\cygwin\home\Administrator\work\osaf\chandler\chandler\parcels\osaf\framework\attributeEditors\AttributeEditors.py", line 720, in OnEditLoseFocus
NotifyBlockToSaveValue(self)
File "C:\cygwin\home\Administrator\work\osaf\chandler\chandler\parcels\osaf\framework\attributeEditors\AttributeEditors.py", line 712, in NotifyBlockToSaveValue
saveMethod()
File "C:\cygwin\home\Administrator\work\osaf\chandler\chandler\parcels\osaf\framework\blocks\ControlBlocks.py", line 1549, in saveValue
editor.EndControlEdit(self.item, self.attributeName, widget)
File "C:\cygwin\home\Administrator\work\osaf\chandler\chandler\parcels\osaf\framework\attributeEditors\AttributeEditors.py", line 1251, in EndControlEdit
self.SetAttributeValue (item, attributeName, value)
File "C:\cygwin\home\Administrator\work\osaf\chandler\chandler\parcels\osaf\views\detail\detail.py", line 1665, in SetAttributeValue
assert False, "Hey - Setting 'ends' on an event without a recurrence rule?"
AssertionError: Hey - Setting 'ends' on an event without a recurrence rule?
"" Failed :: Comment ""None""
Action ""Check_DetailView"" Failed :: Total Time ""0:00:00"" :: Comment ""None""
Report ""CheckEditableBlock"" Failed :: Comment ""(On display name Checking) || detail view value = New Event ; expected value = \u4e5fMonthly book club\u062b""
Action ""Check_Object"" Failed :: Total Time ""0:00:00"" :: Comment ""(On display name Checking) || object title = New Event ; expected title = \u4e5fMonthly book club\u062b""
Report ""(On display name Checking) || object title = New Event ; expected title = \u4e5fMonthly book club\u062b"" Failed :: Comment ""None""
Action ""Recurring event change window is still open at end of test"" Failed :: Total Time ""0:00:00"" :: Comment ""Action created by framework for report call""
Report ""Action created by framework for report call"" Failed :: Comment ""None""
$Suites run=1, pass=0, fail=1 :: Tests run=18, pass=17, fail=1 :: Tests skipped=11 :: Actions run=297, pass=291, fail=6 :: Reports run=417, pass=411, fail=6
*********** TEST RESULTS ************
*************************************
TestCreateAccounts____________ passed
TestAllDayEvent_______________ passed
TestNewCollection_____________ passed
TestNewEvent__________________ passed
TestNewMail___________________ passed
TestNewTask___________________ passed
TestNewNote___________________ passed
TestTriageSectioning__________ passed
TestTableSelection____________ passed
TestStamping__________________ passed
TestSharing___________________ passed
TestMoveToTrash_______________ passed
TestDeleteCollection__________ passed
TestMulti_____________________ passed
TestCalView___________________ passed
TestReminderProcessing________ passed
TestRecurrenceImporting_______ passed
TestRecurringEvent____________*FAILED*
** 11 tests skipped after failure **
*************************************
#TINDERBOX# Testname = ChandlerFunctionalTestSuite
#TINDERBOX# Time elapsed = 106.04 (seconds)
#TINDERBOX# Status = FAILED
\home\Administrator\work\osaf\chandler\chandler\parcels\osaf\framework\attributeEditors\AttributeEditors.py", line 720, in OnEditLoseFocus
NotifyBlockToSaveValue(self)
File "C:\cygwin\home\Administrator\work\osaf\chandler\chandler\parcels\osaf\framework\attributeEditors\AttributeEditors.py", line 712, in NotifyBlockToSaveValue
saveMethod()
File "C:\cygwin\home\Administrator\work\osaf\chandler\chandler\parcels\osaf\framework\blocks\ControlBlocks.py", line 1549, in saveValue
editor.EndControlEdit(self.item, self.attributeName, widget)
File "C:\cygwin\home\Administrator\work\osaf\chandler\chandler\parcels\osaf\framework\attributeEditors\AttributeEditors.py", line 1251, in EndControlEdit
self.SetAttributeValue (item, attributeName, value)
File "C:\cygwin\home\Administrator\work\osaf\chandler\chandler\parcels\osaf\views\detail\detail.py", line 1665, in SetAttributeValue
assert False, "Hey - Setting 'ends' on an event without a recurrence rule?"
AssertionError: Hey - Setting 'ends' on an event without a recurrence rule?
Traceback (most recent call last):
File "C:\cygwin\home\Administrator\work\osaf\chandler\chandler\parcels\osaf\framework\blocks\ControlBlocks.py", line 1537, in onLoseFocusFromWidget
self.saveValue()
File "C:\cygwin\home\Administrator\work\osaf\chandler\chandler\parcels\osaf\framework\blocks\ControlBlocks.py", line 1549, in saveValue
editor.EndControlEdit(self.item, self.attributeName, widget)
File "C:\cygwin\home\Administrator\work\osaf\chandler\chandler\parcels\osaf\framework\attributeEditors\AttributeEditors.py", line 1251, in EndControlEdit
self.SetAttributeValue (item, attributeName, value)
File "C:\cygwin\home\Administrator\work\osaf\chandler\chandler\parcels\osaf\views\detail\detail.py", line 1665, in SetAttributeValue
assert False, "Hey - Setting 'ends' on an event without a recurrence rule?"
AssertionError: Hey - Setting 'ends' on an event without a recurrence rule?
Traceback (most recent call last):
File "C:\cygwin\home\Administrator\work\osaf\chandler\chandler\parcels\osaf\framework\attributeEditors\AttributeEditors.py", line 720, in OnEditLoseFocus
NotifyBlockToSaveValue(self)
File "C:\cygwin\home\Administrator\work\osaf\chandler\chandler\parcels\osaf\framework\attributeEditors\AttributeEditors.py", line 712, in NotifyBlockToSaveValue
saveMethod()
File "C:\cygwin\home\Administrator\work\osaf\chandler\chandler\parcels\osaf\framework\blocks\ControlBlocks.py", line 1549, in saveValue
editor.EndControlEdit(self.item, self.attributeName, widget)
File "C:\cygwin\home\Administrator\work\osaf\chandler\chandler\parcels\osaf\framework\attributeEditors\AttributeEditors.py", line 1251, in EndControlEdit
self.SetAttributeValue (item, attributeName, value)
File "C:\cygwin\home\Administrator\work\osaf\chandler\chandler\parcels\osaf\views\detail\detail.py", line 1665, in SetAttributeValue
assert False, "Hey - Setting 'ends' on an event without a recurrence rule?"
AssertionError: Hey - Setting 'ends' on an event without a recurrence rule?
- - - - - - - - - - - - - - - - - - - - - - - - - -
C:\cygwin\home\Administrator\work\osaf\chandler\chandler\tools\cats\Functional\FunctionalTestSuite.py []
- + - + - + - + - + - + - + - + - + - + - + - + - + - + - +
The following tests failed
(release)C:\cygwin\home\Administrator\work\osaf\chandler\chandler\tools\cats\Functional\FunctionalTestSuite.py
Using [/home/Administrator/work/osaf/chandler/chandler] as the chandler/ directory
- + - + - + - + - + - + - + - + - + - + - + - + - + - + - +
Started Tue Dec 12 12:22:20 USEST 2006
Setting up script environment
Running release mode only
Running functional tests
Running C:\cygwin\home\Administrator\work\osaf\chandler\chandler\tools\cats\Functional\FunctionalTestSuite.py
+++Starting Suite ChandlerFunctionalTestSuite :: StartTime 17:22:37.58
++++++Starting Test ""TestCreateAccounts"" :: StartTime 17:22:37.58
++++++Ending Test ""TestCreateAccounts"" :: EndTime 17:22:38.11 :: Total Time 0.53 seconds
++++++Starting Test ""TestAllDayEvent"" :: StartTime 17:22:38.11
++++++Ending Test ""TestAllDayEvent"" :: EndTime 17:22:39.04 :: Total Time 0.93 seconds
++++++Starting Test ""TestNewCollection"" :: StartTime 17:22:39.06
++++++Ending Test ""TestNewCollection"" :: EndTime 17:22:41.51 :: Total Time 2.44 seconds
++++++Starting Test ""TestNewEvent"" :: StartTime 17:22:41.53
++++++Ending Test ""TestNewEvent"" :: EndTime 17:22:44.70 :: Total Time 3.16 seconds
++++++Starting Test ""TestNewMail"" :: StartTime 17:22:44.71
++++++Ending Test ""TestNewMail"" :: EndTime 17:22:50.28 :: Total Time 5.57 seconds
++++++Starting Test ""TestNewTask"" :: StartTime 17:22:50.31
++++++Ending Test ""TestNewTask"" :: EndTime 17:22:51.07 :: Total Time 0.76 seconds
++++++Starting Test ""TestNewNote"" :: StartTime 17:22:51.07
++++++Ending Test ""TestNewNote"" :: EndTime 17:22:51.85 :: Total Time 0.78 seconds
++++++Starting Test ""TestTriageSectioning"" :: StartTime 17:22:51.85
++++++Ending Test ""TestTriageSectioning"" :: EndTime 17:22:53.55 :: Total Time 1.70 seconds
++++++Starting Test ""TestTableSelection"" :: StartTime 17:22:53.55
++++++Ending Test ""TestTableSelection"" :: EndTime 17:22:59.88 :: Total Time 6.33 seconds
++++++Starting Test ""TestStamping"" :: StartTime 17:22:59.90
++++++Ending Test ""TestStamping"" :: EndTime 17:23:2.34 :: Total Time 2.44 seconds
++++++Starting Test ""TestSharing"" :: StartTime 17:23:2.34
++++++Ending Test ""TestSharing"" :: EndTime 17:23:24.44 :: Total Time 22.09 seconds
++++++Starting Test ""TestMoveToTrash"" :: StartTime 17:23:24.44
++++++Ending Test ""TestMoveToTrash"" :: EndTime 17:23:35.87 :: Total Time 11.43 seconds
++++++Starting Test ""TestDeleteCollection"" :: StartTime 17:23:36.67
++++++Ending Test ""TestDeleteCollection"" :: EndTime 17:23:42.61 :: Total Time 5.94 seconds
++++++Starting Test ""TestMulti"" :: StartTime 17:23:42.61
++++++Ending Test ""TestMulti"" :: EndTime 17:23:52.93 :: Total Time 10.32 seconds
++++++Starting Test ""TestCalView"" :: StartTime 17:23:52.96
++++++Ending Test ""TestCalView"" :: EndTime 17:23:55.53 :: Total Time 2.57 seconds
++++++Starting Test ""TestReminderProcessing"" :: StartTime 17:23:55.55
++++++Ending Test ""TestReminderProcessing"" :: EndTime 17:24:12.27 :: Total Time 16.72 seconds
++++++Starting Test ""TestRecurrenceImporting"" :: StartTime 17:24:12.28
++++++Ending Test ""TestRecurrenceImporting"" :: EndTime 17:24:15.56 :: Total Time 3.29 seconds
++++++Starting Test ""TestRecurringEvent"" :: StartTime 17:24:15.56
Traceback (most recent call last):
File "C:\cygwin\home\Administrator\work\osaf\chandler\chandler\parcels\osaf\framework\blocks\ControlBlocks.py", line 1537, in onLoseFocusFromWidget
self.saveValue()
File "C:\cygwin\home\Administrator\work\osaf\chandler\chandler\parcels\osaf\framework\blocks\ControlBlocks.py", line 1549, in saveValue
editor.EndControlEdit(self.item, self.attributeName, widget)
File "C:\cygwin\home\Administrator\work\osaf\chandler\chandler\parcels\osaf\framework\attributeEditors\AttributeEditors.py", line 1251, in EndControlEdit
self.SetAttributeValue (item, attributeName, value)
File "C:\cygwin\home\Administrator\work\osaf\chandler\chandler\parcels\osaf\views\detail\detail.py", line 1665, in SetAttributeValue
assert False, "Hey - Setting 'ends' on an event without a recurrence rule?"
AssertionError: Hey - Setting 'ends' on an event without a recurrence rule?
Traceback (most recent call last):
File "C:\cygwin\home\Administrator\work\osaf\chandler\chandler\parcels\osaf\framework\attributeEditors\AttributeEditors.py", line 720, in OnEditLoseFocus
NotifyBlockToSaveValue(self)
File "C:\cygwin\home\Administrator\work\osaf\chandler\chandler\parcels\osaf\framework\attributeEditors\AttributeEditors.py", line 712, in NotifyBlockToSaveValue
saveMethod()
File "C:\cygwin\home\Administrator\work\osaf\chandler\chandler\parcels\osaf\framework\blocks\ControlBlocks.py", line 1549, in saveValue
editor.EndControlEdit(self.item, self.attributeName, widget)
File "C:\cygwin\home\Administrator\work\osaf\chandler\chandler\parcels\osaf\framework\attributeEditors\AttributeEditors.py", line 1251, in EndControlEdit
self.SetAttributeValue (item, attributeName, value)
File "C:\cygwin\home\Administrator\work\osaf\chandler\chandler\parcels\osaf\views\detail\detail.py", line 1665, in SetAttributeValue
assert False, "Hey - Setting 'ends' on an event without a recurrence rule?"
AssertionError: Hey - Setting 'ends' on an event without a recurrence rule?
Traceback (most recent call last):
File "C:\cygwin\home\Administrator\work\osaf\chandler\chandler\parcels\osaf\framework\blocks\ControlBlocks.py", line 1511, in onClickFromWidget
Block.finishEdits(oldFocus) # finish any edits in progress
File "C:\cygwin\home\Administrator\work\osaf\chandler\chandler\parcels\osaf\framework\blocks\Block.py", line 704, in finishEdits
saveValueMethod(onBlock)
File "C:\cygwin\home\Administrator\work\osaf\chandler\chandler\parcels\osaf\framework\blocks\ControlBlocks.py", line 1549, in saveValue
editor.EndControlEdit(self.item, self.attributeName, widget)
File "C:\cygwin\home\Administrator\work\osaf\chandler\chandler\parcels\osaf\framework\attributeEditors\AttributeEditors.py", line 1251, in EndControlEdit
self.SetAttributeValue (item, attributeName, value)
File "C:\cygwin\home\Administrator\work\osaf\chandler\chandler\parcels\osaf\views\detail\detail.py", line 1665, in SetAttributeValue
assert False, "Hey - Setting 'ends' on an event without a recurrence rule?"
AssertionError: Hey - Setting 'ends' on an event without a recurrence rule?
Traceback (most recent call last):
File "C:\cygwin\home\Administrator\work\osaf\chandler\chandler\parcels\osaf\framework\blocks\ControlBlocks.py", line 1537, in onLoseFocusFromWidget
self.saveValue()
File "C:\cygwin\home\Administrator\work\osaf\chandler\chandler\parcels\osaf\framework\blocks\ControlBlocks.py", line 1549, in saveValue
editor.EndControlEdit(self.item, self.attributeName, widget)
File "C:\cygwin\home\Administrator\work\osaf\chandler\chandler\parcels\osaf\framework\attributeEditors\AttributeEditors.py", line 1251, in EndControlEdit
self.SetAttributeValue (item, attributeName, value)
File "C:\cygwin\home\Administrator\work\osaf\chandler\chandler\parcels\osaf\views\detail\detail.py", line 1665, in SetAttributeValue
assert False, "Hey - Setting 'ends' on an event without a recurrence rule?"
AssertionError: Hey - Setting 'ends' on an event without a recurrence rule?
Traceback (most recent call last):
File "C:\cygwin++++++Ending Test ""TestRecurringEvent"" :: EndTime 17:24:24.66 :: Total Time 9.09 seconds
+++Ending Suite ""ChandlerFunctionalTestSuite"" :: EndTime 17:24:25.55 :: Total Time 107.97 seconds
*** Test Report ***
Suite ""ChandlerFunctionalTestSuite"" Failed :: Total Time ""0:01:47.969000"" :: Comment ""None""
Test ""TestRecurringEvent"" Failed :: Total Time ""0:00:09.093000"" :: Comment ""None :: [17:24:18.54] Object state :: [17:24:20.78] Object state :: [17:24:22.76] Object state :: [17:24:24.65] Object state
None""
Action ""Check_DetailView"" Failed :: Total Time ""0:00:00"" :: Comment ""None""
Report ""CheckEditableBlock"" Failed :: Comment ""(On recurrence end Checking) || detail view value = ? ; expected value = 3/1/2006""
Action ""Event creation"" Failed :: Total Time ""0:00:00.300000"" :: Comment ""None""
Report ""stderr output detected
Traceback (most recent call last):
File "C:\cygwin\home\Administrator\work\osaf\chandler\chandler\parcels\osaf\framework\blocks\ControlBlocks.py", line 1537, in onLoseFocusFromWidget
self.saveValue()
File "C:\cygwin\home\Administrator\work\osaf\chandler\chandler\parcels\osaf\framework\blocks\ControlBlocks.py", line 1549, in saveValue
editor.EndControlEdit(self.item, self.attributeName, widget)
File "C:\cygwin\home\Administrator\work\osaf\chandler\chandler\parcels\osaf\framework\attributeEditors\AttributeEditors.py", line 1251, in EndControlEdit
self.SetAttributeValue (item, attributeName, value)
File "C:\cygwin\home\Administrator\work\osaf\chandler\chandler\parcels\osaf\views\detail\detail.py", line 1665, in SetAttributeValue
assert False, "Hey - Setting 'ends' on an event without a recurrence rule?"
AssertionError: Hey - Setting 'ends' on an event without a recurrence rule?
Traceback (most recent call last):
File "C:\cygwin\home\Administrator\work\osaf\chandler\chandler\parcels\osaf\framework\attributeEditors\AttributeEditors.py", line 720, in OnEditLoseFocus
NotifyBlockToSaveValue(self)
File "C:\cygwin\home\Administrator\work\osaf\chandler\chandler\parcels\osaf\framework\attributeEditors\AttributeEditors.py", line 712, in NotifyBlockToSaveValue
saveMethod()
File "C:\cygwin\home\Administrator\work\osaf\chandler\chandler\parcels\osaf\framework\blocks\ControlBlocks.py", line 1549, in saveValue
editor.EndControlEdit(self.item, self.attributeName, widget)
File "C:\cygwin\home\Administrator\work\osaf\chandler\chandler\parcels\osaf\framework\attributeEditors\AttributeEditors.py", line 1251, in EndControlEdit
self.SetAttributeValue (item, attributeName, value)
File "C:\cygwin\home\Administrator\work\osaf\chandler\chandler\parcels\osaf\views\detail\detail.py", line 1665, in SetAttributeValue
assert False, "Hey - Setting 'ends' on an event without a recurrence rule?"
AssertionError: Hey - Setting 'ends' on an event without a recurrence rule?
"" Failed :: Comment ""None""
Action ""Multiple Attribute Setting"" Failed :: Total Time ""0:00:01.943000"" :: Comment ""None""
Report ""stderr output detected
Traceback (most recent call last):
File "C:\cygwin\home\Administrator\work\osaf\chandler\chandler\parcels\osaf\framework\blocks\ControlBlocks.py", line 1511, in onClickFromWidget
Block.finishEdits(oldFocus) # finish any edits in progress
File "C:\cygwin\home\Administrator\work\osaf\chandler\chandler\parcels\osaf\framework\blocks\Block.py", line 704, in finishEdits
saveValueMethod(onBlock)
File "C:\cygwin\home\Administrator\work\osaf\chandler\chandler\parcels\osaf\framework\blocks\ControlBlocks.py", line 1549, in saveValue
editor.EndControlEdit(self.item, self.attributeName, widget)
File "C:\cygwin\home\Administrator\work\osaf\chandler\chandler\parcels\osaf\framework\attributeEditors\AttributeEditors.py", line 1251, in EndControlEdit
self.SetAttributeValue (item, attributeName, value)
File "C:\cygwin\home\Administrator\work\osaf\chandler\chandler\parcels\osaf\views\detail\detail.py", line 1665, in SetAttributeValue
assert False, "Hey - Setting 'ends' on an event without a recurrence rule?"
AssertionError: Hey - Setting 'ends' on an event without a recurrence rule?
Traceback (most recent call last):
File "C:\cygwin\home\Administrator\work\osaf\chandler\chandler\parcels\osaf\framework\blocks\ControlBlocks.py", line 1537, in onLoseFocusFromWidget
self.saveValue()
File "C:\cygwin\home\Administrator\work\osaf\chandler\chandler\parcels\osaf\framework\blocks\ControlBlocks.py", line 1549, in saveValue
editor.EndControlEdit(self.item, self.attributeName, widget)
File "C:\cygwin\home\Administrator\work\osaf\chandler\chandler\parcels\osaf\framework\attributeEditors\AttributeEditors.py", line 1251, in EndControlEdit
self.SetAttributeValue (item, attributeName, value)
File "C:\cygwin\home\Administrator\work\osaf\chandler\chandler\parcels\osaf\views\detail\detail.py", line 1665, in SetAttributeValue
assert False, "Hey - Setting 'ends' on an event without a recurrence rule?"
AssertionError: Hey - Setting 'ends' on an event without a recurrence rule?
Traceback (most recent call last):
File "C:\cygwin\home\Administrator\work\osaf\chandler\chandler\parcels\osaf\framework\attributeEditors\AttributeEditors.py", line 720, in OnEditLoseFocus
NotifyBlockToSaveValue(self)
File "C:\cygwin\home\Administrator\work\osaf\chandler\chandler\parcels\osaf\framework\attributeEditors\AttributeEditors.py", line 712, in NotifyBlockToSaveValue
saveMethod()
File "C:\cygwin\home\Administrator\work\osaf\chandler\chandler\parcels\osaf\framework\blocks\ControlBlocks.py", line 1549, in saveValue
editor.EndControlEdit(self.item, self.attributeName, widget)
File "C:\cygwin\home\Administrator\work\osaf\chandler\chandler\parcels\osaf\framework\attributeEditors\AttributeEditors.py", line 1251, in EndControlEdit
self.SetAttributeValue (item, attributeName, value)
File "C:\cygwin\home\Administrator\work\osaf\chandler\chandler\parcels\osaf\views\detail\detail.py", line 1665, in SetAttributeValue
assert False, "Hey - Setting 'ends' on an event without a recurrence rule?"
AssertionError: Hey - Setting 'ends' on an event without a recurrence rule?
Traceback (most recent call last):
File "C:\cygwin\home\Administrator\work\osaf\chandler\chandler\parcels\osaf\framework\blocks\ControlBlocks.py", line 1537, in onLoseFocusFromWidget
self.saveValue()
File "C:\cygwin\home\Administrator\work\osaf\chandler\chandler\parcels\osaf\framework\blocks\ControlBlocks.py", line 1549, in saveValue
editor.EndControlEdit(self.item, self.attributeName, widget)
File "C:\cygwin\home\Administrator\work\osaf\chandler\chandler\parcels\osaf\framework\attributeEditors\AttributeEditors.py", line 1251, in EndControlEdit
self.SetAttributeValue (item, attributeName, value)
File "C:\cygwin\home\Administrator\work\osaf\chandler\chandler\parcels\osaf\views\detail\detail.py", line 1665, in SetAttributeValue
assert False, "Hey - Setting 'ends' on an event without a recurrence rule?"
AssertionError: Hey - Setting 'ends' on an event without a recurrence rule?
Traceback (most recent call last):
File "C:\cygwin\home\Administrator\work\osaf\chandler\chandler\parcels\osaf\framework\attributeEditors\AttributeEditors.py", line 720, in OnEditLoseFocus
NotifyBlockToSaveValue(self)
File "C:\cygwin\home\Administrator\work\osaf\chandler\chandler\parcels\osaf\framework\attributeEditors\AttributeEditors.py", line 712, in NotifyBlockToSaveValue
saveMethod()
File "C:\cygwin\home\Administrator\work\osaf\chandler\chandler\parcels\osaf\framework\blocks\ControlBlocks.py", line 1549, in saveValue
editor.EndControlEdit(self.item, self.attributeName, widget)
File "C:\cygwin\home\Administrator\work\osaf\chandler\chandler\parcels\osaf\framework\attributeEditors\AttributeEditors.py", line 1251, in EndControlEdit
self.SetAttributeValue (item, attributeName, value)
File "C:\cygwin\home\Administrator\work\osaf\chandler\chandler\parcels\osaf\views\detail\detail.py", line 1665, in SetAttributeValue
assert False, "Hey - Setting 'ends' on an event without a recurrence rule?"
AssertionError: Hey - Setting 'ends' on an event without a recurrence rule?
"" Failed :: Comment ""None""
Action ""Check_DetailView"" Failed :: Total Time ""0:00:00"" :: Comment ""None""
Report ""CheckEditableBlock"" Failed :: Comment ""(On display name Checking) || detail view value = New Event ; expected value = \u8ad6Weekly call home\u062b""
Action ""Check_Object"" Failed :: Total Time ""0:00:00"" :: Comment ""(On display name Checking) || object title = New Event ; expected title = \u8ad6Weekly call home\u062b""
Report ""(On display name Checking) || object title = New Event ; expected title = \u8ad6Weekly call home\u062b"" Failed :: Comment ""None""
Action ""Recurring event change window is still open at end of test"" Failed :: Total Time ""0:00:00"" :: Comment ""Action created by framework for report call""
Report ""Action created by framework for report call"" Failed :: Comment ""None""
$Suites run=1, pass=0, fail=1 :: Tests run=18, pass=17, fail=1 :: Tests skipped=11 :: Actions run=297, pass=291, fail=6 :: Reports run=417, pass=411, fail=6
*********** TEST RESULTS ************
*************************************
TestCreateAccounts____________ passed
TestAllDayEvent_______________ passed
TestNewCollection_____________ passed
TestNewEvent__________________ passed
TestNewMail___________________ passed
TestNewTask___________________ passed
TestNewNote___________________ passed
TestTriageSectioning__________ passed
TestTableSelection____________ passed
TestStamping__________________ passed
TestSharing___________________ passed
TestMoveToTrash_______________ passed
TestDeleteCollection__________ passed
TestMulti_____________________ passed
TestCalView___________________ passed
TestReminderProcessing________ passed
TestRecurrenceImporting_______ passed
TestRecurringEvent____________*FAILED*
** 11 tests skipped after failure **
*************************************
#TINDERBOX# Testname = ChandlerFunctionalTestSuite
#TINDERBOX# Time elapsed = 107.97 (seconds)
#TINDERBOX# Status = FAILED
\home\Administrator\work\osaf\chandler\chandler\parcels\osaf\framework\attributeEditors\AttributeEditors.py", line 720, in OnEditLoseFocus
NotifyBlockToSaveValue(self)
File "C:\cygwin\home\Administrator\work\osaf\chandler\chandler\parcels\osaf\framework\attributeEditors\AttributeEditors.py", line 712, in NotifyBlockToSaveValue
saveMethod()
File "C:\cygwin\home\Administrator\work\osaf\chandler\chandler\parcels\osaf\framework\blocks\ControlBlocks.py", line 1549, in saveValue
editor.EndControlEdit(self.item, self.attributeName, widget)
File "C:\cygwin\home\Administrator\work\osaf\chandler\chandler\parcels\osaf\framework\attributeEditors\AttributeEditors.py", line 1251, in EndControlEdit
self.SetAttributeValue (item, attributeName, value)
File "C:\cygwin\home\Administrator\work\osaf\chandler\chandler\parcels\osaf\views\detail\detail.py", line 1665, in SetAttributeValue
assert False, "Hey - Setting 'ends' on an event without a recurrence rule?"
AssertionError: Hey - Setting 'ends' on an event without a recurrence rule?
Traceback (most recent call last):
File "C:\cygwin\home\Administrator\work\osaf\chandler\chandler\parcels\osaf\framework\blocks\ControlBlocks.py", line 1537, in onLoseFocusFromWidget
self.saveValue()
File "C:\cygwin\home\Administrator\work\osaf\chandler\chandler\parcels\osaf\framework\blocks\ControlBlocks.py", line 1549, in saveValue
editor.EndControlEdit(self.item, self.attributeName, widget)
File "C:\cygwin\home\Administrator\work\osaf\chandler\chandler\parcels\osaf\framework\attributeEditors\AttributeEditors.py", line 1251, in EndControlEdit
self.SetAttributeValue (item, attributeName, value)
File "C:\cygwin\home\Administrator\work\osaf\chandler\chandler\parcels\osaf\views\detail\detail.py", line 1665, in SetAttributeValue
assert False, "Hey - Setting 'ends' on an event without a recurrence rule?"
AssertionError: Hey - Setting 'ends' on an event without a recurrence rule?
Traceback (most recent call last):
File "C:\cygwin\home\Administrator\work\osaf\chandler\chandler\parcels\osaf\framework\attributeEditors\AttributeEditors.py", line 720, in OnEditLoseFocus
NotifyBlockToSaveValue(self)
File "C:\cygwin\home\Administrator\work\osaf\chandler\chandler\parcels\osaf\framework\attributeEditors\AttributeEditors.py", line 712, in NotifyBlockToSaveValue
saveMethod()
File "C:\cygwin\home\Administrator\work\osaf\chandler\chandler\parcels\osaf\framework\blocks\ControlBlocks.py", line 1549, in saveValue
editor.EndControlEdit(self.item, self.attributeName, widget)
File "C:\cygwin\home\Administrator\work\osaf\chandler\chandler\parcels\osaf\framework\attributeEditors\AttributeEditors.py", line 1251, in EndControlEdit
self.SetAttributeValue (item, attributeName, value)
File "C:\cygwin\home\Administrator\work\osaf\chandler\chandler\parcels\osaf\views\detail\detail.py", line 1665, in SetAttributeValue
assert False, "Hey - Setting 'ends' on an event without a recurrence rule?"
AssertionError: Hey - Setting 'ends' on an event without a recurrence rule?
- - - - - - - - - - - - - - - - - - - - - - - - - -
C:\cygwin\home\Administrator\work\osaf\chandler\chandler\tools\cats\Functional\FunctionalTestSuite.py []
- + - + - + - + - + - + - + - + - + - + - + - + - + - + - +
The following tests failed
(release)C:\cygwin\home\Administrator\work\osaf\chandler\chandler\tools\cats\Functional\FunctionalTestSuite.py