then mv -f ".deps/gnome-about-me.Tpo" ".deps/gnome-about-me.Po"; else rm -f ".deps/gnome-about-me.Tpo"; exit 1; fi
gnome-about-me.c: In function `about_me_load_string_field':
gnome-about-me.c:388: warning: assignment discards qualifiers from pointer target type
gnome-about-me.c: In function `about_me_load_photo':
gnome-about-me.c:422: error: structure has no member named `length'
gnome-about-me.c:422: error: incompatible type for argument 2 of `e_image_chooser_set_image_data'
gnome-about-me.c: In function `about_me_update_photo':
gnome-about-me.c:493: error: incompatible types in assignment
gnome-about-me.c:494: error: structure has no member named `length'
gnome-about-me.c:501: error: structure has no member named `length'
gnome-about-me.c:501: error: incompatible type for argument 1 of `fwrite'
make[3]: *** [gnome-about-me.o] Error 1
make[3]: Leaving directory `/var/tmp/portage/control-center-2.14.2/work/control-center-2.14.2/capplets/about-me'
make[2]: *** [all-recursive] Error 1
make[2]: Leaving directory `/var/tmp/portage/control-center-2.14.2/work/control-center-2.14.2/capplets'
make[1]: *** [all-recursive] Error 1
make[1]: Leaving directory `/var/tmp/portage/control-center-2.14.2/work/control-center-2.14.2'
make: *** [all] Error 2
!!! ERROR: gnome-base/control-center-2.14.2 failed.
Call stack:
ebuild.sh, line 1546: Called dyn_compile
ebuild.sh, line 937: Called src_compile
ebuild.sh, line 1255: Called gnome2_src_compile
gnome2.eclass, line 78: Called die
!!! compile failure
!!! If you need support, post the topmost build error, and the call stack if relevant.