All pastes #27425 Raw Edit

configure-error

public text v1 · immutable
#27425 ·published 2005-11-02 20:16 UTC
rendered paste body
This file contains any messages produced by compilers while
running configure, to aid debugging if configure makes a mistake.

It was created by configure, which was
generated by GNU Autoconf 2.59.  Invocation command line was

  $ ./configure 

## --------- ##
## Platform. ##
## --------- ##

hostname = sun8
uname -m = sun4u
uname -r = 5.10
uname -s = SunOS
uname -v = Generic_118822-18

/usr/bin/uname -p = sparc
/bin/uname -X     = System = SunOS
Node = sun8
Release = 5.10
KernelID = Generic_118822-18
Machine = sun4u
BusType = <unknown>
Serial = <unknown>
Users = <unknown>
OEM# = 0
Origin# = 1
NumCPU = 2

/bin/arch              = sun4
/usr/bin/arch -k       = sun4u
/usr/convex/getsysinfo = unknown
hostinfo               = unknown
/bin/machine           = unknown
/usr/bin/oslevel       = unknown
/bin/universe          = unknown

PATH: /export/home/beaulieus/bin


## ----------- ##
## Core tests. ##
## ----------- ##

configure:1565: checking build system type
configure:1583: result: sparc-sun-solaris2.10
configure:1591: checking host system type
configure:1605: result: sparc-sun-solaris2.10
configure:1613: checking target system type
configure:1627: result: sparc-sun-solaris2.10
configure:1655: checking for a BSD-compatible install
configure:1710: result: /export/home/beaulieus/bin/ginstall -c
configure:1721: checking whether build environment is sane
configure:1764: result: yes
configure:1829: checking for gawk
configure:1845: found /export/home/beaulieus/bin/gawk
configure:1855: result: gawk
configure:1865: checking whether make sets $(MAKE)
configure:1885: result: yes
configure:2069: checking for whoami
configure:2096: result: no
configure:2171: checking whether make sets $(MAKE)
configure:2191: result: yes
configure:2246: checking for gcc
configure:2262: found /export/home/beaulieus/bin/gcc
configure:2272: result: gcc
configure:2516: checking for C compiler version
configure:2519: gcc --version </dev/null >&5
gcc (GCC) 3.4.2
Copyright (C) 2004 Free Software Foundation, Inc.
This is free software; see the source for copying conditions.  There is NO
warranty; not even for MERCHANTABILITY or FITNESS FOR A PARTICULAR PURPOSE.

configure:2522: $? = 0
configure:2524: gcc -v </dev/null >&5
Reading specs from /opt/sfw/lib/gcc/sparc-sun-solaris2.10/3.4.2/specs
Configured with: ../gcc-3.4.2/configure --prefix=/opt/sfw --with-ld=/usr/ccs/bin/ld --with-gnu-as --with-as=/opt/sfw/bin/gas --enable-shared --disable-libgcj
Thread model: posix
gcc version 3.4.2
configure:2527: $? = 0
configure:2529: gcc -V </dev/null >&5
gcc: `-V' option must have argument
configure:2532: $? = 1
configure:2555: checking for C compiler default output file name
configure:2558: gcc    conftest.c  >&5
configure:2561: $? = 0
configure:2607: result: a.out
configure:2612: checking whether the C compiler works
configure:2618: ./a.out
configure:2621: $? = 0
configure:2638: result: yes
configure:2645: checking whether we are cross compiling
configure:2647: result: no
configure:2650: checking for suffix of executables
configure:2652: gcc -o conftest    conftest.c  >&5
configure:2655: $? = 0
configure:2680: result: 
configure:2686: checking for suffix of object files
configure:2707: gcc -c   conftest.c >&5
configure:2710: $? = 0
configure:2732: result: o
configure:2736: checking whether we are using the GNU C compiler
configure:2760: gcc -c   conftest.c >&5
configure:2766: $? = 0
configure:2770: test -z 
			 || test ! -s conftest.err
configure:2773: $? = 0
configure:2776: test -s conftest.o
configure:2779: $? = 0
configure:2792: result: yes
configure:2798: checking whether gcc accepts -g
configure:2819: gcc -c -g  conftest.c >&5
configure:2825: $? = 0
configure:2829: test -z 
			 || test ! -s conftest.err
configure:2832: $? = 0
configure:2835: test -s conftest.o
configure:2838: $? = 0
configure:2849: result: yes
configure:2866: checking for gcc option to accept ANSI C
configure:2936: gcc  -c -g -O2  conftest.c >&5
configure:2942: $? = 0
configure:2946: test -z 
			 || test ! -s conftest.err
configure:2949: $? = 0
configure:2952: test -s conftest.o
configure:2955: $? = 0
configure:2973: result: none needed
configure:2991: gcc -c -g -O2  conftest.c >&5
conftest.c:2: error: parse error before "me"
configure:2997: $? = 1
configure: failed program was:
| #ifndef __cplusplus
|   choke me
| #endif
configure:3141: checking for style of include used by make
configure:3169: result: GNU
configure:3197: checking dependency style of gcc
configure:3287: result: gcc3
configure:3356: checking for g++
configure:3372: found /export/home/beaulieus/bin/g++
configure:3382: result: g++
configure:3398: checking for C++ compiler version
configure:3401: g++ --version </dev/null >&5
g++ (GCC) 3.4.2
Copyright (C) 2004 Free Software Foundation, Inc.
This is free software; see the source for copying conditions.  There is NO
warranty; not even for MERCHANTABILITY or FITNESS FOR A PARTICULAR PURPOSE.

configure:3404: $? = 0
configure:3406: g++ -v </dev/null >&5
Reading specs from /opt/sfw/lib/gcc/sparc-sun-solaris2.10/3.4.2/specs
Configured with: ../gcc-3.4.2/configure --prefix=/opt/sfw --with-ld=/usr/ccs/bin/ld --with-gnu-as --with-as=/opt/sfw/bin/gas --enable-shared --disable-libgcj
Thread model: posix
gcc version 3.4.2
configure:3409: $? = 0
configure:3411: g++ -V </dev/null >&5
g++: `-V' option must have argument
configure:3414: $? = 1
configure:3417: checking whether we are using the GNU C++ compiler
configure:3441: g++ -c   conftest.cc >&5
configure:3447: $? = 0
configure:3451: test -z 
			 || test ! -s conftest.err
configure:3454: $? = 0
configure:3457: test -s conftest.o
configure:3460: $? = 0
configure:3473: result: yes
configure:3479: checking whether g++ accepts -g
configure:3500: g++ -c -g  conftest.cc >&5
configure:3506: $? = 0
configure:3510: test -z 
			 || test ! -s conftest.err
configure:3513: $? = 0
configure:3516: test -s conftest.o
configure:3519: $? = 0
configure:3530: result: yes
configure:3572: g++ -c -g -O2  conftest.cc >&5
configure:3578: $? = 0
configure:3582: test -z 
			 || test ! -s conftest.err
configure:3585: $? = 0
configure:3588: test -s conftest.o
configure:3591: $? = 0
configure:3617: g++ -c -g -O2  conftest.cc >&5
conftest.cc: In function `int main()':
conftest.cc:18: error: `exit' undeclared (first use this function)
conftest.cc:18: error: (Each undeclared identifier is reported only once for each function it appears in.)
configure:3623: $? = 1
configure: failed program was:
| /* confdefs.h.  */
| 
| #define PACKAGE_NAME ""
| #define PACKAGE_TARNAME ""
| #define PACKAGE_VERSION ""
| #define PACKAGE_STRING ""
| #define PACKAGE_BUGREPORT ""
| #define PACKAGE "bzflag"
| #define VERSION "2.0.4.20051102"
| #define BZ_BUILD_OS "solaris2.10"
| #define BZ_BUILD_USER "anonymous"
| #define BUILD_REGEX 1
| /* end confdefs.h.  */
| 
| int
| main ()
| {
| exit (42);
|   ;
|   return 0;
| }
configure:3572: g++ -c -g -O2  conftest.cc >&5
configure:3578: $? = 0
configure:3582: test -z 
			 || test ! -s conftest.err
configure:3585: $? = 0
configure:3588: test -s conftest.o
configure:3591: $? = 0
configure:3617: g++ -c -g -O2  conftest.cc >&5
configure:3623: $? = 0
configure:3627: test -z 
			 || test ! -s conftest.err
configure:3630: $? = 0
configure:3633: test -s conftest.o
configure:3636: $? = 0
configure:3661: checking dependency style of g++
configure:3751: result: gcc3
configure:3771: checking for ccache
configure:3804: result: no
configure:3855: checking for windres
configure:3882: result: :
configure:3953: checking whether ln -s works
configure:3957: result: yes
configure:4005: checking for ranlib
configure:4021: found /export/home/beaulieus/bin/ranlib
configure:4032: result: ranlib
configure:4123: checking for a sed that does not truncate output
configure:4177: result: /export/home/beaulieus/bin/gsed
configure:4180: checking for egrep
configure:4190: result: egrep
configure:4206: checking for ld used by gcc
configure:4273: result: /usr/ccs/bin/ld
configure:4282: checking if the linker (/usr/ccs/bin/ld) is GNU ld
configure:4297: result: no
configure:4302: checking for /usr/ccs/bin/ld option to reload object files
configure:4309: result: -r
configure:4318: checking for BSD-compatible nm
configure:4360: result: /export/home/beaulieus/bin/nm -p
configure:4364: checking how to recognise dependent libraries
configure:4547: result: pass_all
configure:4760: checking how to run the C preprocessor
configure:4795: gcc -E  conftest.c
configure:4801: $? = 0
configure:4833: gcc -E  conftest.c
conftest.c:17:28: ac_nonexistent.h: No such file or directory
configure:4839: $? = 1
configure: failed program was:
| /* confdefs.h.  */
| 
| #define PACKAGE_NAME ""
| #define PACKAGE_TARNAME ""
| #define PACKAGE_VERSION ""
| #define PACKAGE_STRING ""
| #define PACKAGE_BUGREPORT ""
| #define PACKAGE "bzflag"
| #define VERSION "2.0.4.20051102"
| #define BZ_BUILD_OS "solaris2.10"
| #define BZ_BUILD_USER "anonymous"
| #define BUILD_REGEX 1
| #ifdef __cplusplus
| extern "C" void std::exit (int) throw (); using std::exit;
| #endif
| /* end confdefs.h.  */
| #include <ac_nonexistent.h>
configure:4878: result: gcc -E
configure:4902: gcc -E  conftest.c
configure:4908: $? = 0
configure:4940: gcc -E  conftest.c
conftest.c:17:28: ac_nonexistent.h: No such file or directory
configure:4946: $? = 1
configure: failed program was:
| /* confdefs.h.  */
| 
| #define PACKAGE_NAME ""
| #define PACKAGE_TARNAME ""
| #define PACKAGE_VERSION ""
| #define PACKAGE_STRING ""
| #define PACKAGE_BUGREPORT ""
| #define PACKAGE "bzflag"
| #define VERSION "2.0.4.20051102"
| #define BZ_BUILD_OS "solaris2.10"
| #define BZ_BUILD_USER "anonymous"
| #define BUILD_REGEX 1
| #ifdef __cplusplus
| extern "C" void std::exit (int) throw (); using std::exit;
| #endif
| /* end confdefs.h.  */
| #include <ac_nonexistent.h>
configure:4990: checking for ANSI C header files
configure:5015: gcc -c -g -O2  conftest.c >&5
configure:5021: $? = 0
configure:5025: test -z 
			 || test ! -s conftest.err
configure:5028: $? = 0
configure:5031: test -s conftest.o
configure:5034: $? = 0
configure:5123: gcc -o conftest -g -O2   conftest.c  >&5
configure:5126: $? = 0
configure:5128: ./conftest
configure:5131: $? = 0
configure:5146: result: yes
configure:5170: checking for sys/types.h
configure:5186: gcc -c -g -O2  conftest.c >&5
configure:5192: $? = 0
configure:5196: test -z 
			 || test ! -s conftest.err
configure:5199: $? = 0
configure:5202: test -s conftest.o
configure:5205: $? = 0
configure:5216: result: yes
configure:5170: checking for sys/stat.h
configure:5186: gcc -c -g -O2  conftest.c >&5
configure:5192: $? = 0
configure:5196: test -z 
			 || test ! -s conftest.err
configure:5199: $? = 0
configure:5202: test -s conftest.o
configure:5205: $? = 0
configure:5216: result: yes
configure:5170: checking for stdlib.h
configure:5186: gcc -c -g -O2  conftest.c >&5
configure:5192: $? = 0
configure:5196: test -z 
			 || test ! -s conftest.err
configure:5199: $? = 0
configure:5202: test -s conftest.o
configure:5205: $? = 0
configure:5216: result: yes
configure:5170: checking for string.h
configure:5186: gcc -c -g -O2  conftest.c >&5
configure:5192: $? = 0
configure:5196: test -z 
			 || test ! -s conftest.err
configure:5199: $? = 0
configure:5202: test -s conftest.o
configure:5205: $? = 0
configure:5216: result: yes
configure:5170: checking for memory.h
configure:5186: gcc -c -g -O2  conftest.c >&5
configure:5192: $? = 0
configure:5196: test -z 
			 || test ! -s conftest.err
configure:5199: $? = 0
configure:5202: test -s conftest.o
configure:5205: $? = 0
configure:5216: result: yes
configure:5170: checking for strings.h
configure:5186: gcc -c -g -O2  conftest.c >&5
configure:5192: $? = 0
configure:5196: test -z 
			 || test ! -s conftest.err
configure:5199: $? = 0
configure:5202: test -s conftest.o
configure:5205: $? = 0
configure:5216: result: yes
configure:5170: checking for inttypes.h
configure:5186: gcc -c -g -O2  conftest.c >&5
configure:5192: $? = 0
configure:5196: test -z 
			 || test ! -s conftest.err
configure:5199: $? = 0
configure:5202: test -s conftest.o
configure:5205: $? = 0
configure:5216: result: yes
configure:5170: checking for stdint.h
configure:5186: gcc -c -g -O2  conftest.c >&5
configure:5192: $? = 0
configure:5196: test -z 
			 || test ! -s conftest.err
configure:5199: $? = 0
configure:5202: test -s conftest.o
configure:5205: $? = 0
configure:5216: result: yes
configure:5170: checking for unistd.h
configure:5186: gcc -c -g -O2  conftest.c >&5
configure:5192: $? = 0
configure:5196: test -z 
			 || test ! -s conftest.err
configure:5199: $? = 0
configure:5202: test -s conftest.o
configure:5205: $? = 0
configure:5216: result: yes
configure:5242: checking dlfcn.h usability
configure:5254: gcc -c -g -O2  conftest.c >&5
configure:5260: $? = 0
configure:5264: test -z 
			 || test ! -s conftest.err
configure:5267: $? = 0
configure:5270: test -s conftest.o
configure:5273: $? = 0
configure:5283: result: yes
configure:5287: checking dlfcn.h presence
configure:5297: gcc -E  conftest.c
configure:5303: $? = 0
configure:5323: result: yes
configure:5358: checking for dlfcn.h
configure:5365: result: yes
configure:5383: checking how to run the C++ preprocessor
configure:5414: g++ -E  conftest.cc
configure:5420: $? = 0
configure:5452: g++ -E  conftest.cc
conftest.cc:28:28: ac_nonexistent.h: No such file or directory
configure:5458: $? = 1
configure: failed program was:
| /* confdefs.h.  */
| 
| #define PACKAGE_NAME ""
| #define PACKAGE_TARNAME ""
| #define PACKAGE_VERSION ""
| #define PACKAGE_STRING ""
| #define PACKAGE_BUGREPORT ""
| #define PACKAGE "bzflag"
| #define VERSION "2.0.4.20051102"
| #define BZ_BUILD_OS "solaris2.10"
| #define BZ_BUILD_USER "anonymous"
| #define BUILD_REGEX 1
| #ifdef __cplusplus
| extern "C" void std::exit (int) throw (); using std::exit;
| #endif
| #define STDC_HEADERS 1
| #define HAVE_SYS_TYPES_H 1
| #define HAVE_SYS_STAT_H 1
| #define HAVE_STDLIB_H 1
| #define HAVE_STRING_H 1
| #define HAVE_MEMORY_H 1
| #define HAVE_STRINGS_H 1
| #define HAVE_INTTYPES_H 1
| #define HAVE_STDINT_H 1
| #define HAVE_UNISTD_H 1
| #define HAVE_DLFCN_H 1
| /* end confdefs.h.  */
| #include <ac_nonexistent.h>
configure:5497: result: g++ -E
configure:5521: g++ -E  conftest.cc
configure:5527: $? = 0
configure:5559: g++ -E  conftest.cc
conftest.cc:28:28: ac_nonexistent.h: No such file or directory
configure:5565: $? = 1
configure: failed program was:
| /* confdefs.h.  */
| 
| #define PACKAGE_NAME ""
| #define PACKAGE_TARNAME ""
| #define PACKAGE_VERSION ""
| #define PACKAGE_STRING ""
| #define PACKAGE_BUGREPORT ""
| #define PACKAGE "bzflag"
| #define VERSION "2.0.4.20051102"
| #define BZ_BUILD_OS "solaris2.10"
| #define BZ_BUILD_USER "anonymous"
| #define BUILD_REGEX 1
| #ifdef __cplusplus
| extern "C" void std::exit (int) throw (); using std::exit;
| #endif
| #define STDC_HEADERS 1
| #define HAVE_SYS_TYPES_H 1
| #define HAVE_SYS_STAT_H 1
| #define HAVE_STDLIB_H 1
| #define HAVE_STRING_H 1
| #define HAVE_MEMORY_H 1
| #define HAVE_STRINGS_H 1
| #define HAVE_INTTYPES_H 1
| #define HAVE_STDINT_H 1
| #define HAVE_UNISTD_H 1
| #define HAVE_DLFCN_H 1
| /* end confdefs.h.  */
| #include <ac_nonexistent.h>
configure:5660: checking for g77
configure:5676: found /export/home/beaulieus/bin/g77
configure:5686: result: g77
configure:5701: checking for Fortran 77 compiler version
configure:5704: g77 --version </dev/null >&5
GNU Fortran (GCC) 3.4.2
Copyright (C) 2004 Free Software Foundation, Inc.

GNU Fortran comes with NO WARRANTY, to the extent permitted by law.
You may redistribute copies of GNU Fortran
under the terms of the GNU General Public License.
For more information about these matters, see the file named COPYING
or type the command `info -f g77 Copying'.
configure:5707: $? = 0
configure:5709: g77 -v </dev/null >&5
Reading specs from /opt/sfw/lib/gcc/sparc-sun-solaris2.10/3.4.2/specs
Configured with: ../gcc-3.4.2/configure --prefix=/opt/sfw --with-ld=/usr/ccs/bin/ld --with-gnu-as --with-as=/opt/sfw/bin/gas --enable-shared --disable-libgcj
Thread model: posix
gcc version 3.4.2
configure:5712: $? = 0
configure:5714: g77 -V </dev/null >&5
g77: `-V' option must have argument
configure:5717: $? = 1
configure:5725: checking whether we are using the GNU Fortran 77 compiler
configure:5739: g77 -c  conftest.F >&5
configure:5745: $? = 0
configure:5749: test -z 
			 || test ! -s conftest.err
configure:5752: $? = 0
configure:5755: test -s conftest.o
configure:5758: $? = 0
configure:5771: result: yes
configure:5777: checking whether g77 accepts -g
configure:5789: g77 -c -g conftest.f >&5
configure:5795: $? = 0
configure:5799: test -z 
			 || test ! -s conftest.err
configure:5802: $? = 0
configure:5805: test -s conftest.o
configure:5808: $? = 0
configure:5820: result: yes
configure:5850: checking the maximum length of command line arguments
configure:5915: result: 262144
configure:5926: checking command to parse /export/home/beaulieus/bin/nm -p output from gcc object
configure:6015: gcc -c -g -O2  conftest.c >&5
configure:6018: $? = 0
configure:6022: /export/home/beaulieus/bin/nm -p conftest.o \| sed -n -e 's/^.*[ 	]\([BDRT][BDRT]*\)[ 	][ 	]*\(\)\([_A-Za-z][_A-Za-z0-9]*\)$/\1 \2\3 \3/p' \> conftest.nm
configure:6025: $? = 0
cannot find nm_test_var in conftest.nm
configure:6015: gcc -c -g -O2  conftest.c >&5
configure:6018: $? = 0
configure:6022: /export/home/beaulieus/bin/nm -p conftest.o \| sed -n -e 's/^.*[ 	]\([BDRT][BDRT]*\)[ 	][ 	]*\(_\)\([_A-Za-z][_A-Za-z0-9]*\)$/\1 \2\3 \3/p' \> conftest.nm
configure:6025: $? = 0
cannot run sed -n -e 's/^.*[ 	]\([BDRT][BDRT]*\)[ 	][ 	]*\(_\)\([_A-Za-z][_A-Za-z0-9]*\)$/\1 \2\3 \3/p'
configure:6115: result: failed
configure:6122: checking for objdir
configure:6137: result: .libs
configure:6227: checking for ar
configure:6243: found /export/home/beaulieus/bin/ar
configure:6254: result: ar
configure:6307: checking for ranlib
configure:6334: result: ranlib
configure:6387: checking for strip
configure:6403: found /export/home/beaulieus/bin/strip
configure:6414: result: strip
configure:6676: checking if gcc static flag  works
configure:6699: result: yes
configure:6717: checking if gcc supports -fno-rtti -fno-exceptions
configure:6735: gcc -c -g -O2  -fno-rtti -fno-exceptions conftest.c >&5
cc1: warning: command line option "-fno-rtti" is valid for C++/ObjC++ but not for C
configure:6739: $? = 0
configure:6750: result: no
configure:6765: checking for gcc option to produce PIC
configure:6942: result: -fPIC
configure:6950: checking if gcc PIC flag -fPIC works
configure:6968: gcc -c -g -O2  -fPIC -DPIC conftest.c >&5
configure:6972: $? = 0
configure:6983: result: yes
configure:7007: checking if gcc supports -c -o file.o
configure:7028: gcc -c -g -O2  -o out/conftest2.o conftest.c >&5
configure:7032: $? = 0
configure:7052: result: yes
configure:7078: checking whether the gcc linker (/usr/ccs/bin/ld) supports shared libraries
configure:7926: result: yes
configure:7952: checking whether -lc should be explicitly linked in
configure:7957: gcc -c -g -O2  conftest.c >&5
configure:7960: $? = 0
configure:7974: gcc -shared -Wl,-h -Wl,conftest -o conftest conftest.o  -v 2\>\&1 \| grep  -lc  \>/dev/null 2\>\&1
configure:7977: $? = 1
configure:7989: result: yes
configure:7997: checking dynamic linker characteristics
configure:8558: result: solaris2.10 ld.so
configure:8562: checking how to hardcode library paths into programs
configure:8587: result: immediate
configure:8601: checking whether stripping libraries is possible
configure:8622: result: no
configure:8732: checking for shl_load
configure:8789: gcc -o conftest -g -O2   conftest.c  >&5
Undefined			first referenced
 symbol  			    in file
shl_load                            /var/tmp//ccuHO3g6.o
ld: fatal: Symbol referencing errors. No output written to conftest
collect2: ld returned 1 exit status
configure:8795: $? = 1
configure: failed program was:
| /* confdefs.h.  */
| 
| #define PACKAGE_NAME ""
| #define PACKAGE_TARNAME ""
| #define PACKAGE_VERSION ""
| #define PACKAGE_STRING ""
| #define PACKAGE_BUGREPORT ""
| #define PACKAGE "bzflag"
| #define VERSION "2.0.4.20051102"
| #define BZ_BUILD_OS "solaris2.10"
| #define BZ_BUILD_USER "anonymous"
| #define BUILD_REGEX 1
| #ifdef __cplusplus
| extern "C" void std::exit (int) throw (); using std::exit;
| #endif
| #define STDC_HEADERS 1
| #define HAVE_SYS_TYPES_H 1
| #define HAVE_SYS_STAT_H 1
| #define HAVE_STDLIB_H 1
| #define HAVE_STRING_H 1
| #define HAVE_MEMORY_H 1
| #define HAVE_STRINGS_H 1
| #define HAVE_INTTYPES_H 1
| #define HAVE_STDINT_H 1
| #define HAVE_UNISTD_H 1
| #define HAVE_DLFCN_H 1
| /* end confdefs.h.  */
| /* Define shl_load to an innocuous variant, in case <limits.h> declares shl_load.
|    For example, HP-UX 11i <limits.h> declares gettimeofday.  */
| #define shl_load innocuous_shl_load
| 
| /* System header to define __stub macros and hopefully few prototypes,
|     which can conflict with char shl_load (); below.
|     Prefer <limits.h> to <assert.h> if __STDC__ is defined, since
|     <limits.h> exists even on freestanding compilers.  */
| 
| #ifdef __STDC__
| # include <limits.h>
| #else
| # include <assert.h>
| #endif
| 
| #undef shl_load
| 
| /* Override any gcc2 internal prototype to avoid an error.  */
| #ifdef __cplusplus
| extern "C"
| {
| #endif
| /* We use char because int might match the return type of a gcc2
|    builtin and then its argument prototype would still apply.  */
| char shl_load ();
| /* The GNU C library defines this for functions which it implements
|     to always fail with ENOSYS.  Some functions are actually named
|     something starting with __ and the normal name is an alias.  */
| #if defined (__stub_shl_load) || defined (__stub___shl_load)
| choke me
| #else
| char (*f) () = shl_load;
| #endif
| #ifdef __cplusplus
| }
| #endif
| 
| int
| main ()
| {
| return f != shl_load;
|   ;
|   return 0;
| }
configure:8820: result: no
configure:8825: checking for shl_load in -ldld
configure:8855: gcc -o conftest -g -O2   conftest.c -ldld   >&5
ld: fatal: library -ldld: not found
ld: fatal: File processing errors. No output written to conftest
collect2: ld returned 1 exit status
configure:8861: $? = 1
configure: failed program was:
| /* confdefs.h.  */
| 
| #define PACKAGE_NAME ""
| #define PACKAGE_TARNAME ""
| #define PACKAGE_VERSION ""
| #define PACKAGE_STRING ""
| #define PACKAGE_BUGREPORT ""
| #define PACKAGE "bzflag"
| #define VERSION "2.0.4.20051102"
| #define BZ_BUILD_OS "solaris2.10"
| #define BZ_BUILD_USER "anonymous"
| #define BUILD_REGEX 1
| #ifdef __cplusplus
| extern "C" void std::exit (int) throw (); using std::exit;
| #endif
| #define STDC_HEADERS 1
| #define HAVE_SYS_TYPES_H 1
| #define HAVE_SYS_STAT_H 1
| #define HAVE_STDLIB_H 1
| #define HAVE_STRING_H 1
| #define HAVE_MEMORY_H 1
| #define HAVE_STRINGS_H 1
| #define HAVE_INTTYPES_H 1
| #define HAVE_STDINT_H 1
| #define HAVE_UNISTD_H 1
| #define HAVE_DLFCN_H 1
| /* end confdefs.h.  */
| 
| /* Override any gcc2 internal prototype to avoid an error.  */
| #ifdef __cplusplus
| extern "C"
| #endif
| /* We use char because int might match the return type of a gcc2
|    builtin and then its argument prototype would still apply.  */
| char shl_load ();
| int
| main ()
| {
| shl_load ();
|   ;
|   return 0;
| }
configure:8887: result: no
configure:8892: checking for dlopen
configure:8949: gcc -o conftest -g -O2   conftest.c  >&5
configure:8955: $? = 0
configure:8959: test -z 
			 || test ! -s conftest.err
configure:8962: $? = 0
configure:8965: test -s conftest
configure:8968: $? = 0
configure:8980: result: yes
configure:9222: checking whether a program can dlopen itself
configure:9294: gcc -o conftest -g -O2  -DHAVE_DLFCN_H   conftest.c   >&5
configure:9297: $? = 0
configure:9315: result: yes
configure:9320: checking whether a statically linked program can dlopen itself
configure:9392: gcc -o conftest -g -O2  -DHAVE_DLFCN_H    conftest.c   >&5
configure:9395: $? = 0
configure:9413: result: yes
configure:9436: checking if libtool supports shared libraries
configure:9438: result: yes
configure:9441: checking whether to build shared libraries
configure:9499: result: yes
configure:9502: checking whether to build static libraries
configure:9506: result: yes
configure:9598: creating libtool
configure:10145: checking for ld used by g++
configure:10212: result: /usr/ccs/bin/ld
configure:10221: checking if the linker (/usr/ccs/bin/ld) is GNU ld
configure:10236: result: no
configure:10287: checking whether the g++ linker (/usr/ccs/bin/ld) supports shared libraries
configure:11115: result: yes
configure:11133: g++ -c -g -O2  conftest.cc >&5
configure:11136: $? = 0
configure:11232: checking for g++ option to produce PIC
configure:11484: result: -fPIC
configure:11492: checking if g++ PIC flag -fPIC works
configure:11510: g++ -c -g -O2  -fPIC -DPIC conftest.cc >&5
configure:11514: $? = 0
configure:11525: result: yes
configure:11549: checking if g++ supports -c -o file.o
configure:11570: g++ -c -g -O2  -o out/conftest2.o conftest.cc >&5
configure:11574: $? = 0
configure:11594: result: yes
configure:11620: checking whether the g++ linker (/usr/ccs/bin/ld) supports shared libraries
configure:11645: result: yes
configure:11716: checking dynamic linker characteristics
configure:12277: result: solaris2.10 ld.so
configure:12281: checking how to hardcode library paths into programs
configure:12306: result: immediate
configure:12320: checking whether stripping libraries is possible
configure:12341: result: no
configure:12451: checking for shl_load
configure:12539: result: no
configure:12544: checking for shl_load in -ldld
configure:12606: result: no
configure:12611: checking for dlopen
configure:12699: result: yes
configure:12941: checking whether a program can dlopen itself
configure:13034: result: yes
configure:13039: checking whether a statically linked program can dlopen itself
configure:13132: result: yes
configure:13632: checking if libtool supports shared libraries
configure:13634: result: yes
configure:13637: checking whether to build shared libraries
configure:13655: result: yes
configure:13658: checking whether to build static libraries
configure:13662: result: yes
configure:13674: checking for g77 option to produce PIC
configure:13851: result: -fPIC
configure:13859: checking if g77 PIC flag -fPIC works
configure:13877: g77 -c -g -O2 -fPIC conftest.f >&5
configure:13881: $? = 0
configure:13892: result: yes
configure:13916: checking if g77 supports -c -o file.o
configure:13937: g77 -c -g -O2 -o out/conftest2.o conftest.f >&5
configure:13941: $? = 0
configure:13961: result: yes
configure:13987: checking whether the g77 linker (/usr/ccs/bin/ld) supports shared libraries
configure:14815: result: yes
configure:14886: checking dynamic linker characteristics
configure:15447: result: solaris2.10 ld.so
configure:15451: checking how to hardcode library paths into programs
configure:15476: result: immediate
configure:15490: checking whether stripping libraries is possible
configure:15511: result: no
configure:19607: checking for pod2man
configure:19634: result: no
configure:19642: WARNING: some man pages will not be generated
configure:19658: checking for ar
configure:19684: result: ar
configure:19693: checking for compress in -lz
configure:19723: gcc -o conftest -g -O2   conftest.c -lz   >&5
configure:19729: $? = 0
configure:19733: test -z 
			 || test ! -s conftest.err
configure:19736: $? = 0
configure:19739: test -s conftest
configure:19742: $? = 0
configure:19755: result: yes
configure:19784: checking for curl >= 7.10.0
configure:19794: result: 7.15.0
configure:19888: checking for artificial intelligence for bz's robots
configure:19890: result: not found
configure:19894: checking for ANSI C header files
configure:20050: result: yes
configure:20087: checking cstdlib usability
configure:20099: g++ -c -g -O2  conftest.cc >&5
configure:20105: $? = 0
configure:20109: test -z 
			 || test ! -s conftest.err
configure:20112: $? = 0
configure:20115: test -s conftest.o
configure:20118: $? = 0
configure:20128: result: yes
configure:20132: checking cstdlib presence
configure:20142: g++ -E  conftest.cc
configure:20148: $? = 0
configure:20168: result: yes
configure:20203: checking for cstdlib
configure:20210: result: yes
configure:20087: checking cstdio usability
configure:20099: g++ -c -g -O2  conftest.cc >&5
configure:20105: $? = 0
configure:20109: test -z 
			 || test ! -s conftest.err
configure:20112: $? = 0
configure:20115: test -s conftest.o
configure:20118: $? = 0
configure:20128: result: yes
configure:20132: checking cstdio presence
configure:20142: g++ -E  conftest.cc
configure:20148: $? = 0
configure:20168: result: yes
configure:20203: checking for cstdio
configure:20210: result: yes
configure:20087: checking cstring usability
configure:20099: g++ -c -g -O2  conftest.cc >&5
configure:20105: $? = 0
configure:20109: test -z 
			 || test ! -s conftest.err
configure:20112: $? = 0
configure:20115: test -s conftest.o
configure:20118: $? = 0
configure:20128: result: yes
configure:20132: checking cstring presence
configure:20142: g++ -E  conftest.cc
configure:20148: $? = 0
configure:20168: result: yes
configure:20203: checking for cstring
configure:20210: result: yes
configure:20419: checking GL/glx.h usability
configure:20431: gcc -c -g -O2  conftest.c >&5
configure:20437: $? = 0
configure:20441: test -z 
			 || test ! -s conftest.err
configure:20444: $? = 0
configure:20447: test -s conftest.o
configure:20450: $? = 0
configure:20460: result: yes
configure:20464: checking GL/glx.h presence
configure:20474: gcc -E  conftest.c
configure:20480: $? = 0
configure:20500: result: yes
configure:20535: checking for GL/glx.h
configure:20542: result: yes
configure:20419: checking SDL/SDL.h usability
configure:20431: gcc -c -g -O2  conftest.c >&5
configure:20437: $? = 0
configure:20441: test -z 
			 || test ! -s conftest.err
configure:20444: $? = 0
configure:20447: test -s conftest.o
configure:20450: $? = 0
configure:20460: result: yes
configure:20464: checking SDL/SDL.h presence
configure:20474: gcc -E  conftest.c
configure:20480: $? = 0
configure:20500: result: yes
configure:20535: checking for SDL/SDL.h
configure:20542: result: yes
configure:20419: checking X11/Xlib.h usability
configure:20431: gcc -c -g -O2  conftest.c >&5
configure:20437: $? = 0
configure:20441: test -z 
			 || test ! -s conftest.err
configure:20444: $? = 0
configure:20447: test -s conftest.o
configure:20450: $? = 0
configure:20460: result: yes
configure:20464: checking X11/Xlib.h presence
configure:20474: gcc -E  conftest.c
configure:20480: $? = 0
configure:20500: result: yes
configure:20535: checking for X11/Xlib.h
configure:20542: result: yes
configure:20419: checking bstring.h usability
configure:20431: gcc -c -g -O2  conftest.c >&5
conftest.c:69:21: bstring.h: No such file or directory
configure:20437: $? = 1
configure: failed program was:
| /* confdefs.h.  */
| 
| #define PACKAGE_NAME ""
| #define PACKAGE_TARNAME ""
| #define PACKAGE_VERSION ""
| #define PACKAGE_STRING ""
| #define PACKAGE_BUGREPORT ""
| #define PACKAGE "bzflag"
| #define VERSION "2.0.4.20051102"
| #define BZ_BUILD_OS "solaris2.10"
| #define BZ_BUILD_USER "anonymous"
| #define BUILD_REGEX 1
| #ifdef __cplusplus
| extern "C" void std::exit (int) throw (); using std::exit;
| #endif
| #define STDC_HEADERS 1
| #define HAVE_SYS_TYPES_H 1
| #define HAVE_SYS_STAT_H 1
| #define HAVE_STDLIB_H 1
| #define HAVE_STRING_H 1
| #define HAVE_MEMORY_H 1
| #define HAVE_STRINGS_H 1
| #define HAVE_INTTYPES_H 1
| #define HAVE_STDINT_H 1
| #define HAVE_UNISTD_H 1
| #define HAVE_DLFCN_H 1
| #define STDC_HEADERS 1
| #define HAVE_CSTDLIB 1
| #define HAVE_CSTDIO 1
| #define HAVE_CSTRING 1
| #define HAVE_GL_GLX_H 1
| #define HAVE_SDL_SDL_H 1
| #define HAVE_X11_XLIB_H 1
| /* end confdefs.h.  */
| #include <stdio.h>
| #if HAVE_SYS_TYPES_H
| # include <sys/types.h>
| #endif
| #if HAVE_SYS_STAT_H
| # include <sys/stat.h>
| #endif
| #if STDC_HEADERS
| # include <stdlib.h>
| # include <stddef.h>
| #else
| # if HAVE_STDLIB_H
| #  include <stdlib.h>
| # endif
| #endif
| #if HAVE_STRING_H
| # if !STDC_HEADERS && HAVE_MEMORY_H
| #  include <memory.h>
| # endif
| # include <string.h>
| #endif
| #if HAVE_STRINGS_H
| # include <strings.h>
| #endif
| #if HAVE_INTTYPES_H
| # include <inttypes.h>
| #else
| # if HAVE_STDINT_H
| #  include <stdint.h>
| # endif
| #endif
| #if HAVE_UNISTD_H
| # include <unistd.h>
| #endif
| #include <bstring.h>
configure:20460: result: no
configure:20464: checking bstring.h presence
configure:20474: gcc -E  conftest.c
conftest.c:35:21: bstring.h: No such file or directory
configure:20480: $? = 1
configure: failed program was:
| /* confdefs.h.  */
| 
| #define PACKAGE_NAME ""
| #define PACKAGE_TARNAME ""
| #define PACKAGE_VERSION ""
| #define PACKAGE_STRING ""
| #define PACKAGE_BUGREPORT ""
| #define PACKAGE "bzflag"
| #define VERSION "2.0.4.20051102"
| #define BZ_BUILD_OS "solaris2.10"
| #define BZ_BUILD_USER "anonymous"
| #define BUILD_REGEX 1
| #ifdef __cplusplus
| extern "C" void std::exit (int) throw (); using std::exit;
| #endif
| #define STDC_HEADERS 1
| #define HAVE_SYS_TYPES_H 1
| #define HAVE_SYS_STAT_H 1
| #define HAVE_STDLIB_H 1
| #define HAVE_STRING_H 1
| #define HAVE_MEMORY_H 1
| #define HAVE_STRINGS_H 1
| #define HAVE_INTTYPES_H 1
| #define HAVE_STDINT_H 1
| #define HAVE_UNISTD_H 1
| #define HAVE_DLFCN_H 1
| #define STDC_HEADERS 1
| #define HAVE_CSTDLIB 1
| #define HAVE_CSTDIO 1
| #define HAVE_CSTRING 1
| #define HAVE_GL_GLX_H 1
| #define HAVE_SDL_SDL_H 1
| #define HAVE_X11_XLIB_H 1
| /* end confdefs.h.  */
| #include <bstring.h>
configure:20500: result: no
configure:20535: checking for bstring.h
configure:20542: result: no
configure:20419: checking linux/input.h usability
configure:20431: gcc -c -g -O2  conftest.c >&5
conftest.c:69:25: linux/input.h: No such file or directory
configure:20437: $? = 1
configure: failed program was:
| /* confdefs.h.  */
| 
| #define PACKAGE_NAME ""
| #define PACKAGE_TARNAME ""
| #define PACKAGE_VERSION ""
| #define PACKAGE_STRING ""
| #define PACKAGE_BUGREPORT ""
| #define PACKAGE "bzflag"
| #define VERSION "2.0.4.20051102"
| #define BZ_BUILD_OS "solaris2.10"
| #define BZ_BUILD_USER "anonymous"
| #define BUILD_REGEX 1
| #ifdef __cplusplus
| extern "C" void std::exit (int) throw (); using std::exit;
| #endif
| #define STDC_HEADERS 1
| #define HAVE_SYS_TYPES_H 1
| #define HAVE_SYS_STAT_H 1
| #define HAVE_STDLIB_H 1
| #define HAVE_STRING_H 1
| #define HAVE_MEMORY_H 1
| #define HAVE_STRINGS_H 1
| #define HAVE_INTTYPES_H 1
| #define HAVE_STDINT_H 1
| #define HAVE_UNISTD_H 1
| #define HAVE_DLFCN_H 1
| #define STDC_HEADERS 1
| #define HAVE_CSTDLIB 1
| #define HAVE_CSTDIO 1
| #define HAVE_CSTRING 1
| #define HAVE_GL_GLX_H 1
| #define HAVE_SDL_SDL_H 1
| #define HAVE_X11_XLIB_H 1
| /* end confdefs.h.  */
| #include <stdio.h>
| #if HAVE_SYS_TYPES_H
| # include <sys/types.h>
| #endif
| #if HAVE_SYS_STAT_H
| # include <sys/stat.h>
| #endif
| #if STDC_HEADERS
| # include <stdlib.h>
| # include <stddef.h>
| #else
| # if HAVE_STDLIB_H
| #  include <stdlib.h>
| # endif
| #endif
| #if HAVE_STRING_H
| # if !STDC_HEADERS && HAVE_MEMORY_H
| #  include <memory.h>
| # endif
| # include <string.h>
| #endif
| #if HAVE_STRINGS_H
| # include <strings.h>
| #endif
| #if HAVE_INTTYPES_H
| # include <inttypes.h>
| #else
| # if HAVE_STDINT_H
| #  include <stdint.h>
| # endif
| #endif
| #if HAVE_UNISTD_H
| # include <unistd.h>
| #endif
| #include <linux/input.h>
configure:20460: result: no
configure:20464: checking linux/input.h presence
configure:20474: gcc -E  conftest.c
conftest.c:35:25: linux/input.h: No such file or directory
configure:20480: $? = 1
configure: failed program was:
| /* confdefs.h.  */
| 
| #define PACKAGE_NAME ""
| #define PACKAGE_TARNAME ""
| #define PACKAGE_VERSION ""
| #define PACKAGE_STRING ""
| #define PACKAGE_BUGREPORT ""
| #define PACKAGE "bzflag"
| #define VERSION "2.0.4.20051102"
| #define BZ_BUILD_OS "solaris2.10"
| #define BZ_BUILD_USER "anonymous"
| #define BUILD_REGEX 1
| #ifdef __cplusplus
| extern "C" void std::exit (int) throw (); using std::exit;
| #endif
| #define STDC_HEADERS 1
| #define HAVE_SYS_TYPES_H 1
| #define HAVE_SYS_STAT_H 1
| #define HAVE_STDLIB_H 1
| #define HAVE_STRING_H 1
| #define HAVE_MEMORY_H 1
| #define HAVE_STRINGS_H 1
| #define HAVE_INTTYPES_H 1
| #define HAVE_STDINT_H 1
| #define HAVE_UNISTD_H 1
| #define HAVE_DLFCN_H 1
| #define STDC_HEADERS 1
| #define HAVE_CSTDLIB 1
| #define HAVE_CSTDIO 1
| #define HAVE_CSTRING 1
| #define HAVE_GL_GLX_H 1
| #define HAVE_SDL_SDL_H 1
| #define HAVE_X11_XLIB_H 1
| /* end confdefs.h.  */
| #include <linux/input.h>
configure:20500: result: no
configure:20535: checking for linux/input.h
configure:20542: result: no
configure:20410: checking for stdint.h
configure:20415: result: yes
configure:20419: checking sys/param.h usability
configure:20431: gcc -c -g -O2  conftest.c >&5
configure:20437: $? = 0
configure:20441: test -z 
			 || test ! -s conftest.err
configure:20444: $? = 0
configure:20447: test -s conftest.o
configure:20450: $? = 0
configure:20460: result: yes
configure:20464: checking sys/param.h presence
configure:20474: gcc -E  conftest.c
configure:20480: $? = 0
configure:20500: result: yes
configure:20535: checking for sys/param.h
configure:20542: result: yes
configure:20410: checking for unistd.h
configure:20415: result: yes
configure:20419: checking values.h usability
configure:20431: gcc -c -g -O2  conftest.c >&5
configure:20437: $? = 0
configure:20441: test -z 
			 || test ! -s conftest.err
configure:20444: $? = 0
configure:20447: test -s conftest.o
configure:20450: $? = 0
configure:20460: result: yes
configure:20464: checking values.h presence
configure:20474: gcc -E  conftest.c
configure:20480: $? = 0
configure:20500: result: yes
configure:20535: checking for values.h
configure:20542: result: yes
configure:20419: checking dsound.h usability
configure:20431: gcc -c -g -O2  conftest.c >&5
conftest.c:73:20: dsound.h: No such file or directory
configure:20437: $? = 1
configure: failed program was:
| /* confdefs.h.  */
| 
| #define PACKAGE_NAME ""
| #define PACKAGE_TARNAME ""
| #define PACKAGE_VERSION ""
| #define PACKAGE_STRING ""
| #define PACKAGE_BUGREPORT ""
| #define PACKAGE "bzflag"
| #define VERSION "2.0.4.20051102"
| #define BZ_BUILD_OS "solaris2.10"
| #define BZ_BUILD_USER "anonymous"
| #define BUILD_REGEX 1
| #ifdef __cplusplus
| extern "C" void std::exit (int) throw (); using std::exit;
| #endif
| #define STDC_HEADERS 1
| #define HAVE_SYS_TYPES_H 1
| #define HAVE_SYS_STAT_H 1
| #define HAVE_STDLIB_H 1
| #define HAVE_STRING_H 1
| #define HAVE_MEMORY_H 1
| #define HAVE_STRINGS_H 1
| #define HAVE_INTTYPES_H 1
| #define HAVE_STDINT_H 1
| #define HAVE_UNISTD_H 1
| #define HAVE_DLFCN_H 1
| #define STDC_HEADERS 1
| #define HAVE_CSTDLIB 1
| #define HAVE_CSTDIO 1
| #define HAVE_CSTRING 1
| #define HAVE_GL_GLX_H 1
| #define HAVE_SDL_SDL_H 1
| #define HAVE_X11_XLIB_H 1
| #define HAVE_STDINT_H 1
| #define HAVE_SYS_PARAM_H 1
| #define HAVE_UNISTD_H 1
| #define HAVE_VALUES_H 1
| /* end confdefs.h.  */
| #include <stdio.h>
| #if HAVE_SYS_TYPES_H
| # include <sys/types.h>
| #endif
| #if HAVE_SYS_STAT_H
| # include <sys/stat.h>
| #endif
| #if STDC_HEADERS
| # include <stdlib.h>
| # include <stddef.h>
| #else
| # if HAVE_STDLIB_H
| #  include <stdlib.h>
| # endif
| #endif
| #if HAVE_STRING_H
| # if !STDC_HEADERS && HAVE_MEMORY_H
| #  include <memory.h>
| # endif
| # include <string.h>
| #endif
| #if HAVE_STRINGS_H
| # include <strings.h>
| #endif
| #if HAVE_INTTYPES_H
| # include <inttypes.h>
| #else
| # if HAVE_STDINT_H
| #  include <stdint.h>
| # endif
| #endif
| #if HAVE_UNISTD_H
| # include <unistd.h>
| #endif
| #include <dsound.h>
configure:20460: result: no
configure:20464: checking dsound.h presence
configure:20474: gcc -E  conftest.c
conftest.c:39:20: dsound.h: No such file or directory
configure:20480: $? = 1
configure: failed program was:
| /* confdefs.h.  */
| 
| #define PACKAGE_NAME ""
| #define PACKAGE_TARNAME ""
| #define PACKAGE_VERSION ""
| #define PACKAGE_STRING ""
| #define PACKAGE_BUGREPORT ""
| #define PACKAGE "bzflag"
| #define VERSION "2.0.4.20051102"
| #define BZ_BUILD_OS "solaris2.10"
| #define BZ_BUILD_USER "anonymous"
| #define BUILD_REGEX 1
| #ifdef __cplusplus
| extern "C" void std::exit (int) throw (); using std::exit;
| #endif
| #define STDC_HEADERS 1
| #define HAVE_SYS_TYPES_H 1
| #define HAVE_SYS_STAT_H 1
| #define HAVE_STDLIB_H 1
| #define HAVE_STRING_H 1
| #define HAVE_MEMORY_H 1
| #define HAVE_STRINGS_H 1
| #define HAVE_INTTYPES_H 1
| #define HAVE_STDINT_H 1
| #define HAVE_UNISTD_H 1
| #define HAVE_DLFCN_H 1
| #define STDC_HEADERS 1
| #define HAVE_CSTDLIB 1
| #define HAVE_CSTDIO 1
| #define HAVE_CSTRING 1
| #define HAVE_GL_GLX_H 1
| #define HAVE_SDL_SDL_H 1
| #define HAVE_X11_XLIB_H 1
| #define HAVE_STDINT_H 1
| #define HAVE_SYS_PARAM_H 1
| #define HAVE_UNISTD_H 1
| #define HAVE_VALUES_H 1
| /* end confdefs.h.  */
| #include <dsound.h>
configure:20500: result: no
configure:20535: checking for dsound.h
configure:20542: result: no
configure:20559: checking for an ANSI C-conforming const
configure:20626: gcc -c -g -O2  conftest.c >&5
configure:20632: $? = 0
configure:20636: test -z 
			 || test ! -s conftest.err
configure:20639: $? = 0
configure:20642: test -s conftest.o
configure:20645: $? = 0
configure:20656: result: yes
configure:20667: checking for socklen_t type
configure:20686: gcc -c -g -O2  conftest.c >&5
configure:20692: $? = 0
configure:20696: test -z 
			 || test ! -s conftest.err
configure:20699: $? = 0
configure:20702: test -s conftest.o
configure:20705: $? = 0
configure:20728: result: yes
configure:20732: checking for linux rumble joystick support
configure:20750: gcc -c -g -O2  conftest.c >&5
conftest.c:40:25: linux/input.h: No such file or directory
conftest.c: In function `main':
conftest.c:44: error: storage size of 'x' isn't known
configure:20756: $? = 1
configure: failed program was:
| /* confdefs.h.  */
| 
| #define PACKAGE_NAME ""
| #define PACKAGE_TARNAME ""
| #define PACKAGE_VERSION ""
| #define PACKAGE_STRING ""
| #define PACKAGE_BUGREPORT ""
| #define PACKAGE "bzflag"
| #define VERSION "2.0.4.20051102"
| #define BZ_BUILD_OS "solaris2.10"
| #define BZ_BUILD_USER "anonymous"
| #define BUILD_REGEX 1
| #ifdef __cplusplus
| extern "C" void std::exit (int) throw (); using std::exit;
| #endif
| #define STDC_HEADERS 1
| #define HAVE_SYS_TYPES_H 1
| #define HAVE_SYS_STAT_H 1
| #define HAVE_STDLIB_H 1
| #define HAVE_STRING_H 1
| #define HAVE_MEMORY_H 1
| #define HAVE_STRINGS_H 1
| #define HAVE_INTTYPES_H 1
| #define HAVE_STDINT_H 1
| #define HAVE_UNISTD_H 1
| #define HAVE_DLFCN_H 1
| #define STDC_HEADERS 1
| #define HAVE_CSTDLIB 1
| #define HAVE_CSTDIO 1
| #define HAVE_CSTRING 1
| #define HAVE_GL_GLX_H 1
| #define HAVE_SDL_SDL_H 1
| #define HAVE_X11_XLIB_H 1
| #define HAVE_STDINT_H 1
| #define HAVE_SYS_PARAM_H 1
| #define HAVE_UNISTD_H 1
| #define HAVE_VALUES_H 1
| #define HAVE_SOCKLEN_T 1
| /* end confdefs.h.  */
| #include <linux/input.h>
| int
| main ()
| {
| struct ff_effect x; x.u.rumble.weak_magnitude = 42; return 0;
|   ;
|   return 0;
| }
configure:20786: result: no
configure:20790: checking for linux force feedback joystick support
configure:20808: gcc -c -g -O2  conftest.c >&5
conftest.c:40:25: linux/input.h: No such file or directory
conftest.c: In function `main':
conftest.c:44: error: storage size of 'x' isn't known
configure:20814: $? = 1
configure: failed program was:
| /* confdefs.h.  */
| 
| #define PACKAGE_NAME ""
| #define PACKAGE_TARNAME ""
| #define PACKAGE_VERSION ""
| #define PACKAGE_STRING ""
| #define PACKAGE_BUGREPORT ""
| #define PACKAGE "bzflag"
| #define VERSION "2.0.4.20051102"
| #define BZ_BUILD_OS "solaris2.10"
| #define BZ_BUILD_USER "anonymous"
| #define BUILD_REGEX 1
| #ifdef __cplusplus
| extern "C" void std::exit (int) throw (); using std::exit;
| #endif
| #define STDC_HEADERS 1
| #define HAVE_SYS_TYPES_H 1
| #define HAVE_SYS_STAT_H 1
| #define HAVE_STDLIB_H 1
| #define HAVE_STRING_H 1
| #define HAVE_MEMORY_H 1
| #define HAVE_STRINGS_H 1
| #define HAVE_INTTYPES_H 1
| #define HAVE_STDINT_H 1
| #define HAVE_UNISTD_H 1
| #define HAVE_DLFCN_H 1
| #define STDC_HEADERS 1
| #define HAVE_CSTDLIB 1
| #define HAVE_CSTDIO 1
| #define HAVE_CSTRING 1
| #define HAVE_GL_GLX_H 1
| #define HAVE_SDL_SDL_H 1
| #define HAVE_X11_XLIB_H 1
| #define HAVE_STDINT_H 1
| #define HAVE_SYS_PARAM_H 1
| #define HAVE_UNISTD_H 1
| #define HAVE_VALUES_H 1
| #define HAVE_SOCKLEN_T 1
| /* end confdefs.h.  */
| #include <linux/input.h>
| int
| main ()
| {
| struct ff_effect x; x.direction = 0x4000; return 0;
|   ;
|   return 0;
| }
configure:20844: result: no
configure:20975: checking for X
configure:21080: gcc -E  conftest.c
configure:21086: $? = 0
configure:21136: gcc -o conftest -g -O2   conftest.c -lXt -L/export/home/beaulieus/lib -lcurl -L/usr/sfw/lib -lssl -lcrypto -lsocket -lnsl -lssl -lcrypto -lsocket -lnsl -ldl -lz  >&5
configure:21142: $? = 0
configure:21146: test -z 
			 || test ! -s conftest.err
configure:21149: $? = 0
configure:21152: test -s conftest
configure:21155: $? = 0
configure:21205: result: libraries , headers 
configure:21377: gcc -o conftest -g -O2   conftest.c -L/export/home/beaulieus/lib -lcurl -L/usr/sfw/lib -lssl -lcrypto -lsocket -lnsl -lssl -lcrypto -lsocket -lnsl -ldl -lz   -lX11 >&5
configure:21383: $? = 0
configure:21387: test -z 
			 || test ! -s conftest.err
configure:21390: $? = 0
configure:21393: test -s conftest
configure:21396: $? = 0
configure:21554: checking for gethostbyname
configure:21611: gcc -o conftest -g -O2   conftest.c -L/export/home/beaulieus/lib -lcurl -L/usr/sfw/lib -lssl -lcrypto -lsocket -lnsl -lssl -lcrypto -lsocket -lnsl -ldl -lz  >&5
configure:21617: $? = 0
configure:21621: test -z 
			 || test ! -s conftest.err
configure:21624: $? = 0
configure:21627: test -s conftest
configure:21630: $? = 0
configure:21642: result: yes
configure:21793: checking for connect
configure:21850: gcc -o conftest -g -O2   conftest.c -L/export/home/beaulieus/lib -lcurl -L/usr/sfw/lib -lssl -lcrypto -lsocket -lnsl -lssl -lcrypto -lsocket -lnsl -ldl -lz  >&5
configure:21856: $? = 0
configure:21860: test -z 
			 || test ! -s conftest.err
configure:21863: $? = 0
configure:21866: test -s conftest
configure:21869: $? = 0
configure:21881: result: yes
configure:21956: checking for remove
configure:22013: gcc -o conftest -g -O2   conftest.c -L/export/home/beaulieus/lib -lcurl -L/usr/sfw/lib -lssl -lcrypto -lsocket -lnsl -lssl -lcrypto -lsocket -lnsl -ldl -lz  >&5
configure:22019: $? = 0
configure:22023: test -z 
			 || test ! -s conftest.err
configure:22026: $? = 0
configure:22029: test -s conftest
configure:22032: $? = 0
configure:22044: result: yes
configure:22119: checking for shmat
configure:22176: gcc -o conftest -g -O2   conftest.c -L/export/home/beaulieus/lib -lcurl -L/usr/sfw/lib -lssl -lcrypto -lsocket -lnsl -lssl -lcrypto -lsocket -lnsl -ldl -lz  >&5
configure:22182: $? = 0
configure:22186: test -z 
			 || test ! -s conftest.err
configure:22189: $? = 0
configure:22192: test -s conftest
configure:22195: $? = 0
configure:22207: result: yes
configure:22291: checking for IceConnectionNumber in -lICE
configure:22321: gcc -o conftest -g -O2   conftest.c -lICE  -L/export/home/beaulieus/lib -lcurl -L/usr/sfw/lib -lssl -lcrypto -lsocket -lnsl -lssl -lcrypto -lsocket -lnsl -ldl -lz  >&5
configure:22327: $? = 0
configure:22331: test -z 
			 || test ! -s conftest.err
configure:22334: $? = 0
configure:22337: test -s conftest
configure:22340: $? = 0
configure:22353: result: yes
configure:22387: checking for sqrtf in -lm
configure:22417: gcc -o conftest -g -O2     -L/usr/demo/SOUND/lib conftest.c -lm  -L/export/home/beaulieus/lib -lcurl -L/usr/sfw/lib -lssl -lcrypto -lsocket -lnsl -lssl -lcrypto -lsocket -lnsl -ldl -lz  -lsocket -lnsl -lresolv >&5
conftest.c:47: warning: conflicting types for built-in function 'sqrtf'
configure:22423: $? = 0
configure:22427: test -z 
			 || test ! -s conftest.err
configure:22430: $? = 0
configure:22433: test -s conftest
configure:22436: $? = 0
configure:22449: result: yes
configure:22463: checking for socket in -lsocket
configure:22493: gcc -o conftest -g -O2     -L/usr/demo/SOUND/lib conftest.c -lsocket  -lm -L/export/home/beaulieus/lib -lcurl -L/usr/sfw/lib -lssl -lcrypto -lsocket -lnsl -lssl -lcrypto -lsocket -lnsl -ldl -lz  -lsocket -lnsl -lresolv >&5
configure:22499: $? = 0
configure:22503: test -z 
			 || test ! -s conftest.err
configure:22506: $? = 0
configure:22509: test -s conftest
configure:22512: $? = 0
configure:22525: result: yes
configure:22537: checking for gethostent in -lsocket
configure:22567: gcc -o conftest -g -O2     -L/usr/demo/SOUND/lib conftest.c -lsocket  -lsocket -lm -L/export/home/beaulieus/lib -lcurl -L/usr/sfw/lib -lssl -lcrypto -lsocket -lnsl -lssl -lcrypto -lsocket -lnsl -ldl -lz  -lsocket -lnsl -lresolv >&5
configure:22573: $? = 0
configure:22577: test -z 
			 || test ! -s conftest.err
configure:22580: $? = 0
configure:22583: test -s conftest
configure:22586: $? = 0
configure:22599: result: yes
configure:22687: checking for acosf in -lm
configure:22717: gcc -o conftest -g -O2     -L/usr/demo/SOUND/lib conftest.c -lm  -lsocket -lsocket -lm -L/export/home/beaulieus/lib -lcurl -L/usr/sfw/lib -lssl -lcrypto -lsocket -lnsl -lssl -lcrypto -lsocket -lnsl -ldl -lz  -lsocket -lnsl -lresolv >&5
conftest.c:50: warning: conflicting types for built-in function 'acosf'
configure:22723: $? = 0
configure:22727: test -z 
			 || test ! -s conftest.err
configure:22730: $? = 0
configure:22733: test -s conftest
configure:22736: $? = 0
configure:22749: result: yes
configure:22759: checking for asinf in -lm
configure:22789: gcc -o conftest -g -O2     -L/usr/demo/SOUND/lib conftest.c -lm  -lsocket -lsocket -lm -L/export/home/beaulieus/lib -lcurl -L/usr/sfw/lib -lssl -lcrypto -lsocket -lnsl -lssl -lcrypto -lsocket -lnsl -ldl -lz  -lsocket -lnsl -lresolv >&5
conftest.c:51: warning: conflicting types for built-in function 'asinf'
configure:22795: $? = 0
configure:22799: test -z 
			 || test ! -s conftest.err
configure:22802: $? = 0
configure:22805: test -s conftest
configure:22808: $? = 0
configure:22821: result: yes
configure:22831: checking for atan2f in -lm
configure:22861: gcc -o conftest -g -O2     -L/usr/demo/SOUND/lib conftest.c -lm  -lsocket -lsocket -lm -L/export/home/beaulieus/lib -lcurl -L/usr/sfw/lib -lssl -lcrypto -lsocket -lnsl -lssl -lcrypto -lsocket -lnsl -ldl -lz  -lsocket -lnsl -lresolv >&5
conftest.c:52: warning: conflicting types for built-in function 'atan2f'
configure:22867: $? = 0
configure:22871: test -z 
			 || test ! -s conftest.err
configure:22874: $? = 0
configure:22877: test -s conftest
configure:22880: $? = 0
configure:22893: result: yes
configure:22903: checking for atanf in -lm
configure:22933: gcc -o conftest -g -O2     -L/usr/demo/SOUND/lib conftest.c -lm  -lsocket -lsocket -lm -L/export/home/beaulieus/lib -lcurl -L/usr/sfw/lib -lssl -lcrypto -lsocket -lnsl -lssl -lcrypto -lsocket -lnsl -ldl -lz  -lsocket -lnsl -lresolv >&5
conftest.c:53: warning: conflicting types for built-in function 'atanf'
configure:22939: $? = 0
configure:22943: test -z 
			 || test ! -s conftest.err
configure:22946: $? = 0
configure:22949: test -s conftest
configure:22952: $? = 0
configure:22965: result: yes
configure:22975: checking for cosf in -lm
configure:23005: gcc -o conftest -g -O2     -L/usr/demo/SOUND/lib conftest.c -lm  -lsocket -lsocket -lm -L/export/home/beaulieus/lib -lcurl -L/usr/sfw/lib -lssl -lcrypto -lsocket -lnsl -lssl -lcrypto -lsocket -lnsl -ldl -lz  -lsocket -lnsl -lresolv >&5
conftest.c:54: warning: conflicting types for built-in function 'cosf'
configure:23011: $? = 0
configure:23015: test -z 
			 || test ! -s conftest.err
configure:23018: $? = 0
configure:23021: test -s conftest
configure:23024: $? = 0
configure:23037: result: yes
configure:23047: checking for expf in -lm
configure:23077: gcc -o conftest -g -O2     -L/usr/demo/SOUND/lib conftest.c -lm  -lsocket -lsocket -lm -L/export/home/beaulieus/lib -lcurl -L/usr/sfw/lib -lssl -lcrypto -lsocket -lnsl -lssl -lcrypto -lsocket -lnsl -ldl -lz  -lsocket -lnsl -lresolv >&5
conftest.c:55: warning: conflicting types for built-in function 'expf'
configure:23083: $? = 0
configure:23087: test -z 
			 || test ! -s conftest.err
configure:23090: $? = 0
configure:23093: test -s conftest
configure:23096: $? = 0
configure:23109: result: yes
configure:23119: checking for fabsf in -lm
configure:23149: gcc -o conftest -g -O2     -L/usr/demo/SOUND/lib conftest.c -lm  -lsocket -lsocket -lm -L/export/home/beaulieus/lib -lcurl -L/usr/sfw/lib -lssl -lcrypto -lsocket -lnsl -lssl -lcrypto -lsocket -lnsl -ldl -lz  -lsocket -lnsl -lresolv >&5
conftest.c:56: warning: conflicting types for built-in function 'fabsf'
configure:23155: $? = 0
configure:23159: test -z 
			 || test ! -s conftest.err
configure:23162: $? = 0
configure:23165: test -s conftest
configure:23168: $? = 0
configure:23181: result: yes
configure:23191: checking for floorf in -lm
configure:23221: gcc -o conftest -g -O2     -L/usr/demo/SOUND/lib conftest.c -lm  -lsocket -lsocket -lm -L/export/home/beaulieus/lib -lcurl -L/usr/sfw/lib -lssl -lcrypto -lsocket -lnsl -lssl -lcrypto -lsocket -lnsl -ldl -lz  -lsocket -lnsl -lresolv >&5
conftest.c:57: warning: conflicting types for built-in function 'floorf'
configure:23227: $? = 0
configure:23231: test -z 
			 || test ! -s conftest.err
configure:23234: $? = 0
configure:23237: test -s conftest
configure:23240: $? = 0
configure:23253: result: yes
configure:23263: checking for fmodf in -lm
configure:23293: gcc -o conftest -g -O2     -L/usr/demo/SOUND/lib conftest.c -lm  -lsocket -lsocket -lm -L/export/home/beaulieus/lib -lcurl -L/usr/sfw/lib -lssl -lcrypto -lsocket -lnsl -lssl -lcrypto -lsocket -lnsl -ldl -lz  -lsocket -lnsl -lresolv >&5
conftest.c:58: warning: conflicting types for built-in function 'fmodf'
configure:23299: $? = 0
configure:23303: test -z 
			 || test ! -s conftest.err
configure:23306: $? = 0
configure:23309: test -s conftest
configure:23312: $? = 0
configure:23325: result: yes
configure:23335: checking for hypotf in -lm
configure:23365: gcc -o conftest -g -O2     -L/usr/demo/SOUND/lib conftest.c -lm  -lsocket -lsocket -lm -L/export/home/beaulieus/lib -lcurl -L/usr/sfw/lib -lssl -lcrypto -lsocket -lnsl -lssl -lcrypto -lsocket -lnsl -ldl -lz  -lsocket -lnsl -lresolv >&5
conftest.c:59: warning: conflicting types for built-in function 'hypotf'
configure:23371: $? = 0
configure:23375: test -z 
			 || test ! -s conftest.err
configure:23378: $? = 0
configure:23381: test -s conftest
configure:23384: $? = 0
configure:23397: result: yes
configure:23407: checking for logf in -lm
configure:23437: gcc -o conftest -g -O2     -L/usr/demo/SOUND/lib conftest.c -lm  -lsocket -lsocket -lm -L/export/home/beaulieus/lib -lcurl -L/usr/sfw/lib -lssl -lcrypto -lsocket -lnsl -lssl -lcrypto -lsocket -lnsl -ldl -lz  -lsocket -lnsl -lresolv >&5
conftest.c:60: warning: conflicting types for built-in function 'logf'
configure:23443: $? = 0
configure:23447: test -z 
			 || test ! -s conftest.err
configure:23450: $? = 0
configure:23453: test -s conftest
configure:23456: $? = 0
configure:23469: result: yes
configure:23479: checking for log10f in -lm
configure:23509: gcc -o conftest -g -O2     -L/usr/demo/SOUND/lib conftest.c -lm  -lsocket -lsocket -lm -L/export/home/beaulieus/lib -lcurl -L/usr/sfw/lib -lssl -lcrypto -lsocket -lnsl -lssl -lcrypto -lsocket -lnsl -ldl -lz  -lsocket -lnsl -lresolv >&5
conftest.c:61: warning: conflicting types for built-in function 'log10f'
configure:23515: $? = 0
configure:23519: test -z 
			 || test ! -s conftest.err
configure:23522: $? = 0
configure:23525: test -s conftest
configure:23528: $? = 0
configure:23541: result: yes
configure:23551: checking for powf in -lm
configure:23581: gcc -o conftest -g -O2     -L/usr/demo/SOUND/lib conftest.c -lm  -lsocket -lsocket -lm -L/export/home/beaulieus/lib -lcurl -L/usr/sfw/lib -lssl -lcrypto -lsocket -lnsl -lssl -lcrypto -lsocket -lnsl -ldl -lz  -lsocket -lnsl -lresolv >&5
conftest.c:62: warning: conflicting types for built-in function 'powf'
configure:23587: $? = 0
configure:23591: test -z 
			 || test ! -s conftest.err
configure:23594: $? = 0
configure:23597: test -s conftest
configure:23600: $? = 0
configure:23613: result: yes
configure:23623: checking for sinf in -lm
configure:23653: gcc -o conftest -g -O2     -L/usr/demo/SOUND/lib conftest.c -lm  -lsocket -lsocket -lm -L/export/home/beaulieus/lib -lcurl -L/usr/sfw/lib -lssl -lcrypto -lsocket -lnsl -lssl -lcrypto -lsocket -lnsl -ldl -lz  -lsocket -lnsl -lresolv >&5
conftest.c:63: warning: conflicting types for built-in function 'sinf'
configure:23659: $? = 0
configure:23663: test -z 
			 || test ! -s conftest.err
configure:23666: $? = 0
configure:23669: test -s conftest
configure:23672: $? = 0
configure:23685: result: yes
configure:23695: checking for sqrtf in -lm
configure:23757: result: yes
configure:23767: checking for tanf in -lm
configure:23797: gcc -o conftest -g -O2     -L/usr/demo/SOUND/lib conftest.c -lm  -lsocket -lsocket -lm -L/export/home/beaulieus/lib -lcurl -L/usr/sfw/lib -lssl -lcrypto -lsocket -lnsl -lssl -lcrypto -lsocket -lnsl -ldl -lz  -lsocket -lnsl -lresolv >&5
conftest.c:65: warning: conflicting types for built-in function 'tanf'
configure:23803: $? = 0
configure:23807: test -z 
			 || test ! -s conftest.err
configure:23810: $? = 0
configure:23813: test -s conftest
configure:23816: $? = 0
configure:23829: result: yes
configure:23851: checking for XextAddDisplay in -lXext
configure:23881: gcc -o conftest -g -O2     -L/usr/demo/SOUND/lib conftest.c -lXext  -lSM -lICE -lX11  -lresolv -laudio  -lsocket -lsocket -lm -L/export/home/beaulieus/lib -lcurl -L/usr/sfw/lib -lssl -lcrypto -lsocket -lnsl -lssl -lcrypto -lsocket -lnsl -ldl -lz  -lsocket -lnsl -lresolv >&5
ld: fatal: library -laudio: not found
ld: fatal: File processing errors. No output written to conftest
collect2: ld returned 1 exit status
configure:23887: $? = 1
configure: failed program was:
| /* confdefs.h.  */
| 
| #define PACKAGE_NAME ""
| #define PACKAGE_TARNAME ""
| #define PACKAGE_VERSION ""
| #define PACKAGE_STRING ""
| #define PACKAGE_BUGREPORT ""
| #define PACKAGE "bzflag"
| #define VERSION "2.0.4.20051102"
| #define BZ_BUILD_OS "solaris2.10"
| #define BZ_BUILD_USER "anonymous"
| #define BUILD_REGEX 1
| #ifdef __cplusplus
| extern "C" void std::exit (int) throw (); using std::exit;
| #endif
| #define STDC_HEADERS 1
| #define HAVE_SYS_TYPES_H 1
| #define HAVE_SYS_STAT_H 1
| #define HAVE_STDLIB_H 1
| #define HAVE_STRING_H 1
| #define HAVE_MEMORY_H 1
| #define HAVE_STRINGS_H 1
| #define HAVE_INTTYPES_H 1
| #define HAVE_STDINT_H 1
| #define HAVE_UNISTD_H 1
| #define HAVE_DLFCN_H 1
| #define STDC_HEADERS 1
| #define HAVE_CSTDLIB 1
| #define HAVE_CSTDIO 1
| #define HAVE_CSTRING 1
| #define HAVE_GL_GLX_H 1
| #define HAVE_SDL_SDL_H 1
| #define HAVE_X11_XLIB_H 1
| #define HAVE_STDINT_H 1
| #define HAVE_SYS_PARAM_H 1
| #define HAVE_UNISTD_H 1
| #define HAVE_VALUES_H 1
| #define HAVE_SOCKLEN_T 1
| #define HAVE_LIBM 1
| #define HAVE_LIBSOCKET 1
| #define HAVE_LIBSOCKET 1
| #define HAVE_ACOSF 1
| #define HAVE_ASINF 1
| #define HAVE_ATAN2F 1
| #define HAVE_ATANF 1
| #define HAVE_COSF 1
| #define HAVE_EXPF 1
| #define HAVE_FABSF 1
| #define HAVE_FLOORF 1
| #define HAVE_FMODF 1
| #define HAVE_HYPOTF 1
| #define HAVE_LOGF 1
| #define HAVE_LOG10F 1
| #define HAVE_POWF 1
| #define HAVE_SINF 1
| #define HAVE_SQRTF 1
| #define HAVE_TANF 1
| /* end confdefs.h.  */
| 
| /* Override any gcc2 internal prototype to avoid an error.  */
| #ifdef __cplusplus
| extern "C"
| #endif
| /* We use char because int might match the return type of a gcc2
|    builtin and then its argument prototype would still apply.  */
| char XextAddDisplay ();
| int
| main ()
| {
| XextAddDisplay ();
|   ;
|   return 0;
| }
configure:23913: result: no
configure:24090: g++ -o conftest -g -O2     -L/usr/demo/SOUND/lib conftest.cc -lsocket -lsocket -lm -L/export/home/beaulieus/lib -lcurl -L/usr/sfw/lib -lssl -lcrypto -lsocket -lnsl -lssl -lcrypto -lsocket -lnsl -ldl -lz  -lsocket -lnsl -lresolv >&5
configure:24096: $? = 0
configure:24100: test -z 
			 || test ! -s conftest.err
configure:24103: $? = 0
configure:24106: test -s conftest
configure:24109: $? = 0
configure:24145: g++ -o conftest -g -O2     -L/usr/demo/SOUND/lib conftest.cc -framework OpenGL  -lSM -lICE -lX11  -lresolv -laudio  -lsocket -lsocket -lm -L/export/home/beaulieus/lib -lcurl -L/usr/sfw/lib -lssl -lcrypto -lsocket -lnsl -lssl -lcrypto -lsocket -lnsl -ldl -lz  -lsocket -lnsl -lresolv >&5
g++: OpenGL: No such file or directory
cc1plus: error: unrecognized command line option "-framework"
configure:24151: $? = 1
configure: failed program was:
| /* confdefs.h.  */
| 
| #define PACKAGE_NAME ""
| #define PACKAGE_TARNAME ""
| #define PACKAGE_VERSION ""
| #define PACKAGE_STRING ""
| #define PACKAGE_BUGREPORT ""
| #define PACKAGE "bzflag"
| #define VERSION "2.0.4.20051102"
| #define BZ_BUILD_OS "solaris2.10"
| #define BZ_BUILD_USER "anonymous"
| #define BUILD_REGEX 1
| #ifdef __cplusplus
| extern "C" void std::exit (int) throw (); using std::exit;
| #endif
| #define STDC_HEADERS 1
| #define HAVE_SYS_TYPES_H 1
| #define HAVE_SYS_STAT_H 1
| #define HAVE_STDLIB_H 1
| #define HAVE_STRING_H 1
| #define HAVE_MEMORY_H 1
| #define HAVE_STRINGS_H 1
| #define HAVE_INTTYPES_H 1
| #define HAVE_STDINT_H 1
| #define HAVE_UNISTD_H 1
| #define HAVE_DLFCN_H 1
| #define STDC_HEADERS 1
| #define HAVE_CSTDLIB 1
| #define HAVE_CSTDIO 1
| #define HAVE_CSTRING 1
| #define HAVE_GL_GLX_H 1
| #define HAVE_SDL_SDL_H 1
| #define HAVE_X11_XLIB_H 1
| #define HAVE_STDINT_H 1
| #define HAVE_SYS_PARAM_H 1
| #define HAVE_UNISTD_H 1
| #define HAVE_VALUES_H 1
| #define HAVE_SOCKLEN_T 1
| #define HAVE_LIBM 1
| #define HAVE_LIBSOCKET 1
| #define HAVE_LIBSOCKET 1
| #define HAVE_ACOSF 1
| #define HAVE_ASINF 1
| #define HAVE_ATAN2F 1
| #define HAVE_ATANF 1
| #define HAVE_COSF 1
| #define HAVE_EXPF 1
| #define HAVE_FABSF 1
| #define HAVE_FLOORF 1
| #define HAVE_FMODF 1
| #define HAVE_HYPOTF 1
| #define HAVE_LOGF 1
| #define HAVE_LOG10F 1
| #define HAVE_POWF 1
| #define HAVE_SINF 1
| #define HAVE_SQRTF 1
| #define HAVE_TANF 1
| #define HAVE_REGEX_H 1
| /* end confdefs.h.  */
| #include <OpenGL/gl.h>
| int
| main ()
| {
| glBegin(GL_POINTS)
|   ;
|   return 0;
| }
configure:24192: g++ -o conftest -g -O2     -L/usr/demo/SOUND/lib conftest.cc -lopengl32  -lSM -lICE -lX11  -lresolv -laudio  -lsocket -lsocket -lm -L/export/home/beaulieus/lib -lcurl -L/usr/sfw/lib -lssl -lcrypto -lsocket -lnsl -lssl -lcrypto -lsocket -lnsl -ldl -lz  -lsocket -lnsl -lresolv >&5
ld: fatal: library -lopengl32: not found
ld: fatal: library -laudio: not found
ld: fatal: File processing errors. No output written to conftest
collect2: ld returned 1 exit status
configure:24198: $? = 1
configure: failed program was:
| /* confdefs.h.  */
| 
| #define PACKAGE_NAME ""
| #define PACKAGE_TARNAME ""
| #define PACKAGE_VERSION ""
| #define PACKAGE_STRING ""
| #define PACKAGE_BUGREPORT ""
| #define PACKAGE "bzflag"
| #define VERSION "2.0.4.20051102"
| #define BZ_BUILD_OS "solaris2.10"
| #define BZ_BUILD_USER "anonymous"
| #define BUILD_REGEX 1
| #ifdef __cplusplus
| extern "C" void std::exit (int) throw (); using std::exit;
| #endif
| #define STDC_HEADERS 1
| #define HAVE_SYS_TYPES_H 1
| #define HAVE_SYS_STAT_H 1
| #define HAVE_STDLIB_H 1
| #define HAVE_STRING_H 1
| #define HAVE_MEMORY_H 1
| #define HAVE_STRINGS_H 1
| #define HAVE_INTTYPES_H 1
| #define HAVE_STDINT_H 1
| #define HAVE_UNISTD_H 1
| #define HAVE_DLFCN_H 1
| #define STDC_HEADERS 1
| #define HAVE_CSTDLIB 1
| #define HAVE_CSTDIO 1
| #define HAVE_CSTRING 1
| #define HAVE_GL_GLX_H 1
| #define HAVE_SDL_SDL_H 1
| #define HAVE_X11_XLIB_H 1
| #define HAVE_STDINT_H 1
| #define HAVE_SYS_PARAM_H 1
| #define HAVE_UNISTD_H 1
| #define HAVE_VALUES_H 1
| #define HAVE_SOCKLEN_T 1
| #define HAVE_LIBM 1
| #define HAVE_LIBSOCKET 1
| #define HAVE_LIBSOCKET 1
| #define HAVE_ACOSF 1
| #define HAVE_ASINF 1
| #define HAVE_ATAN2F 1
| #define HAVE_ATANF 1
| #define HAVE_COSF 1
| #define HAVE_EXPF 1
| #define HAVE_FABSF 1
| #define HAVE_FLOORF 1
| #define HAVE_FMODF 1
| #define HAVE_HYPOTF 1
| #define HAVE_LOGF 1
| #define HAVE_LOG10F 1
| #define HAVE_POWF 1
| #define HAVE_SINF 1
| #define HAVE_SQRTF 1
| #define HAVE_TANF 1
| #define HAVE_REGEX_H 1
| /* end confdefs.h.  */
| #include <GL/gl.h>
| int
| main ()
| {
| glBegin(GL_POINTS)
|   ;
|   return 0;
| }
configure:24192: g++ -o conftest -g -O2     -L/usr/demo/SOUND/lib conftest.cc -lGL  -lSM -lICE -lX11  -lresolv -laudio  -lsocket -lsocket -lm -L/export/home/beaulieus/lib -lcurl -L/usr/sfw/lib -lssl -lcrypto -lsocket -lnsl -lssl -lcrypto -lsocket -lnsl -ldl -lz  -lsocket -lnsl -lresolv >&5
ld: fatal: library -laudio: not found
ld: fatal: File processing errors. No output written to conftest
collect2: ld returned 1 exit status
configure:24198: $? = 1
configure: failed program was:
| /* confdefs.h.  */
| 
| #define PACKAGE_NAME ""
| #define PACKAGE_TARNAME ""
| #define PACKAGE_VERSION ""
| #define PACKAGE_STRING ""
| #define PACKAGE_BUGREPORT ""
| #define PACKAGE "bzflag"
| #define VERSION "2.0.4.20051102"
| #define BZ_BUILD_OS "solaris2.10"
| #define BZ_BUILD_USER "anonymous"
| #define BUILD_REGEX 1
| #ifdef __cplusplus
| extern "C" void std::exit (int) throw (); using std::exit;
| #endif
| #define STDC_HEADERS 1
| #define HAVE_SYS_TYPES_H 1
| #define HAVE_SYS_STAT_H 1
| #define HAVE_STDLIB_H 1
| #define HAVE_STRING_H 1
| #define HAVE_MEMORY_H 1
| #define HAVE_STRINGS_H 1
| #define HAVE_INTTYPES_H 1
| #define HAVE_STDINT_H 1
| #define HAVE_UNISTD_H 1
| #define HAVE_DLFCN_H 1
| #define STDC_HEADERS 1
| #define HAVE_CSTDLIB 1
| #define HAVE_CSTDIO 1
| #define HAVE_CSTRING 1
| #define HAVE_GL_GLX_H 1
| #define HAVE_SDL_SDL_H 1
| #define HAVE_X11_XLIB_H 1
| #define HAVE_STDINT_H 1
| #define HAVE_SYS_PARAM_H 1
| #define HAVE_UNISTD_H 1
| #define HAVE_VALUES_H 1
| #define HAVE_SOCKLEN_T 1
| #define HAVE_LIBM 1
| #define HAVE_LIBSOCKET 1
| #define HAVE_LIBSOCKET 1
| #define HAVE_ACOSF 1
| #define HAVE_ASINF 1
| #define HAVE_ATAN2F 1
| #define HAVE_ATANF 1
| #define HAVE_COSF 1
| #define HAVE_EXPF 1
| #define HAVE_FABSF 1
| #define HAVE_FLOORF 1
| #define HAVE_FMODF 1
| #define HAVE_HYPOTF 1
| #define HAVE_LOGF 1
| #define HAVE_LOG10F 1
| #define HAVE_POWF 1
| #define HAVE_SINF 1
| #define HAVE_SQRTF 1
| #define HAVE_TANF 1
| #define HAVE_REGEX_H 1
| /* end confdefs.h.  */
| #include <GL/gl.h>
| int
| main ()
| {
| glBegin(GL_POINTS)
|   ;
|   return 0;
| }
configure:24192: g++ -o conftest -g -O2     -L/usr/demo/SOUND/lib conftest.cc -lGL2  -lSM -lICE -lX11  -lresolv -laudio  -lsocket -lsocket -lm -L/export/home/beaulieus/lib -lcurl -L/usr/sfw/lib -lssl -lcrypto -lsocket -lnsl -lssl -lcrypto -lsocket -lnsl -ldl -lz  -lsocket -lnsl -lresolv >&5
ld: fatal: library -lGL2: not found
ld: fatal: library -laudio: not found
ld: fatal: File processing errors. No output written to conftest
collect2: ld returned 1 exit status
configure:24198: $? = 1
configure: failed program was:
| /* confdefs.h.  */
| 
| #define PACKAGE_NAME ""
| #define PACKAGE_TARNAME ""
| #define PACKAGE_VERSION ""
| #define PACKAGE_STRING ""
| #define PACKAGE_BUGREPORT ""
| #define PACKAGE "bzflag"
| #define VERSION "2.0.4.20051102"
| #define BZ_BUILD_OS "solaris2.10"
| #define BZ_BUILD_USER "anonymous"
| #define BUILD_REGEX 1
| #ifdef __cplusplus
| extern "C" void std::exit (int) throw (); using std::exit;
| #endif
| #define STDC_HEADERS 1
| #define HAVE_SYS_TYPES_H 1
| #define HAVE_SYS_STAT_H 1
| #define HAVE_STDLIB_H 1
| #define HAVE_STRING_H 1
| #define HAVE_MEMORY_H 1
| #define HAVE_STRINGS_H 1
| #define HAVE_INTTYPES_H 1
| #define HAVE_STDINT_H 1
| #define HAVE_UNISTD_H 1
| #define HAVE_DLFCN_H 1
| #define STDC_HEADERS 1
| #define HAVE_CSTDLIB 1
| #define HAVE_CSTDIO 1
| #define HAVE_CSTRING 1
| #define HAVE_GL_GLX_H 1
| #define HAVE_SDL_SDL_H 1
| #define HAVE_X11_XLIB_H 1
| #define HAVE_STDINT_H 1
| #define HAVE_SYS_PARAM_H 1
| #define HAVE_UNISTD_H 1
| #define HAVE_VALUES_H 1
| #define HAVE_SOCKLEN_T 1
| #define HAVE_LIBM 1
| #define HAVE_LIBSOCKET 1
| #define HAVE_LIBSOCKET 1
| #define HAVE_ACOSF 1
| #define HAVE_ASINF 1
| #define HAVE_ATAN2F 1
| #define HAVE_ATANF 1
| #define HAVE_COSF 1
| #define HAVE_EXPF 1
| #define HAVE_FABSF 1
| #define HAVE_FLOORF 1
| #define HAVE_FMODF 1
| #define HAVE_HYPOTF 1
| #define HAVE_LOGF 1
| #define HAVE_LOG10F 1
| #define HAVE_POWF 1
| #define HAVE_SINF 1
| #define HAVE_SQRTF 1
| #define HAVE_TANF 1
| #define HAVE_REGEX_H 1
| /* end confdefs.h.  */
| #include <GL/gl.h>
| int
| main ()
| {
| glBegin(GL_POINTS)
|   ;
|   return 0;
| }
configure:24622: checking for ares_init in -lcares
configure:24652: g++ -o conftest -g -O2     -L/usr/demo/SOUND/lib conftest.cc -lcares  -lsocket -lsocket -lm -L/export/home/beaulieus/lib -lcurl -L/usr/sfw/lib -lssl -lcrypto -lsocket -lnsl -lssl -lcrypto -lsocket -lnsl -ldl -lz  -lsocket -lnsl -lresolv >&5
ld: fatal: library -lcares: not found
ld: fatal: File processing errors. No output written to conftest
collect2: ld returned 1 exit status
configure:24658: $? = 1
configure: failed program was:
| /* confdefs.h.  */
| 
| #define PACKAGE_NAME ""
| #define PACKAGE_TARNAME ""
| #define PACKAGE_VERSION ""
| #define PACKAGE_STRING ""
| #define PACKAGE_BUGREPORT ""
| #define PACKAGE "bzflag"
| #define VERSION "2.0.4.20051102"
| #define BZ_BUILD_OS "solaris2.10"
| #define BZ_BUILD_USER "anonymous"
| #define BUILD_REGEX 1
| #ifdef __cplusplus
| extern "C" void std::exit (int) throw (); using std::exit;
| #endif
| #define STDC_HEADERS 1
| #define HAVE_SYS_TYPES_H 1
| #define HAVE_SYS_STAT_H 1
| #define HAVE_STDLIB_H 1
| #define HAVE_STRING_H 1
| #define HAVE_MEMORY_H 1
| #define HAVE_STRINGS_H 1
| #define HAVE_INTTYPES_H 1
| #define HAVE_STDINT_H 1
| #define HAVE_UNISTD_H 1
| #define HAVE_DLFCN_H 1
| #define STDC_HEADERS 1
| #define HAVE_CSTDLIB 1
| #define HAVE_CSTDIO 1
| #define HAVE_CSTRING 1
| #define HAVE_GL_GLX_H 1
| #define HAVE_SDL_SDL_H 1
| #define HAVE_X11_XLIB_H 1
| #define HAVE_STDINT_H 1
| #define HAVE_SYS_PARAM_H 1
| #define HAVE_UNISTD_H 1
| #define HAVE_VALUES_H 1
| #define HAVE_SOCKLEN_T 1
| #define HAVE_LIBM 1
| #define HAVE_LIBSOCKET 1
| #define HAVE_LIBSOCKET 1
| #define HAVE_ACOSF 1
| #define HAVE_ASINF 1
| #define HAVE_ATAN2F 1
| #define HAVE_ATANF 1
| #define HAVE_COSF 1
| #define HAVE_EXPF 1
| #define HAVE_FABSF 1
| #define HAVE_FLOORF 1
| #define HAVE_FMODF 1
| #define HAVE_HYPOTF 1
| #define HAVE_LOGF 1
| #define HAVE_LOG10F 1
| #define HAVE_POWF 1
| #define HAVE_SINF 1
| #define HAVE_SQRTF 1
| #define HAVE_TANF 1
| #define HAVE_REGEX_H 1
| #define _USE_BZ_API 1
| /* end confdefs.h.  */
| 
| /* Override any gcc2 internal prototype to avoid an error.  */
| #ifdef __cplusplus
| extern "C"
| #endif
| /* We use char because int might match the return type of a gcc2
|    builtin and then its argument prototype would still apply.  */
| char ares_init ();
| int
| main ()
| {
| ares_init ();
|   ;
|   return 0;
| }
configure:24684: result: no
configure:24703: WARNING: using an internal c-ares lib.
configure:24705: WARNING: Consider installing an updated library at system level
configure:24707: WARNING: link is http://daniel.haxx.se/projects/c-ares/
configure:24728: checking for working ncurses
configure:24753: g++ -o conftest -g -O2     -L/usr/demo/SOUND/lib conftest.cc -lsocket -lsocket -lm -L/export/home/beaulieus/lib -lcurl -L/usr/sfw/lib -lssl -lcrypto -lsocket -lnsl -lssl -lcrypto -lsocket -lnsl -ldl -lz  -lsocket -lnsl -lresolv -lncurses >&5
configure:24759: $? = 0
configure:24763: test -z 
			 || test ! -s conftest.err
configure:24766: $? = 0
configure:24769: test -s conftest
configure:24772: $? = 0
configure:24784: result: yes
configure:25078: checking for SDL framework
configure:25099: gcc -o conftest -g -O2     -L/usr/demo/SOUND/lib -framework SDL conftest.c  -lSM -lICE -lX11  -lresolv -laudio  -lsocket -lsocket -lm -L/export/home/beaulieus/lib -lcurl -L/usr/sfw/lib -lssl -lcrypto -lsocket -lnsl -lssl -lcrypto -lsocket -lnsl -ldl -lz  -lsocket -lnsl -lresolv >&5
gcc: SDL: No such file or directory
cc1: error: unrecognized command line option "-framework"
configure:25105: $? = 1
configure: failed program was:
| /* confdefs.h.  */
| 
| #define PACKAGE_NAME ""
| #define PACKAGE_TARNAME ""
| #define PACKAGE_VERSION ""
| #define PACKAGE_STRING ""
| #define PACKAGE_BUGREPORT ""
| #define PACKAGE "bzflag"
| #define VERSION "2.0.4.20051102"
| #define BZ_BUILD_OS "solaris2.10"
| #define BZ_BUILD_USER "anonymous"
| #define BUILD_REGEX 1
| #ifdef __cplusplus
| extern "C" void std::exit (int) throw (); using std::exit;
| #endif
| #define STDC_HEADERS 1
| #define HAVE_SYS_TYPES_H 1
| #define HAVE_SYS_STAT_H 1
| #define HAVE_STDLIB_H 1
| #define HAVE_STRING_H 1
| #define HAVE_MEMORY_H 1
| #define HAVE_STRINGS_H 1
| #define HAVE_INTTYPES_H 1
| #define HAVE_STDINT_H 1
| #define HAVE_UNISTD_H 1
| #define HAVE_DLFCN_H 1
| #define STDC_HEADERS 1
| #define HAVE_CSTDLIB 1
| #define HAVE_CSTDIO 1
| #define HAVE_CSTRING 1
| #define HAVE_GL_GLX_H 1
| #define HAVE_SDL_SDL_H 1
| #define HAVE_X11_XLIB_H 1
| #define HAVE_STDINT_H 1
| #define HAVE_SYS_PARAM_H 1
| #define HAVE_UNISTD_H 1
| #define HAVE_VALUES_H 1
| #define HAVE_SOCKLEN_T 1
| #define HAVE_LIBM 1
| #define HAVE_LIBSOCKET 1
| #define HAVE_LIBSOCKET 1
| #define HAVE_ACOSF 1
| #define HAVE_ASINF 1
| #define HAVE_ATAN2F 1
| #define HAVE_ATANF 1
| #define HAVE_COSF 1
| #define HAVE_EXPF 1
| #define HAVE_FABSF 1
| #define HAVE_FLOORF 1
| #define HAVE_FMODF 1
| #define HAVE_HYPOTF 1
| #define HAVE_LOGF 1
| #define HAVE_LOG10F 1
| #define HAVE_POWF 1
| #define HAVE_SINF 1
| #define HAVE_SQRTF 1
| #define HAVE_TANF 1
| #define HAVE_REGEX_H 1
| #define _USE_BZ_API 1
| #define HAVE_NCURSES_H
| /* end confdefs.h.  */
| #include <SDL/SDL_version.h>
| int
| main ()
| {
| 
|   ;
|   return 0;
| }
configure:25129: result: no
configure:25178: checking for sdl-config
configure:25196: found /export/home/beaulieus/bin/sdl-config
configure:25209: result: /export/home/beaulieus/bin/sdl-config
configure:25217: checking for SDL - version >= 1.2.5
configure:25309: gcc -o conftest -g -O2 -I/opt/sfw/include/SDL -D_REENTRANT     -L/usr/demo/SOUND/lib conftest.c  -lSM -lICE -lX11  -lresolv -laudio  -lsocket -lsocket -lm -L/export/home/beaulieus/lib -lcurl -L/usr/sfw/lib -lssl -lcrypto -lsocket -lnsl -lssl -lcrypto -lsocket -lnsl -ldl -lz  -lsocket -lnsl -lresolv -L/opt/sfw/lib -R/opt/sfw/lib -lSDL -lpthread -lposix4 >&5
ld: fatal: library -laudio: not found
ld: fatal: File processing errors. No output written to conftest
collect2: ld returned 1 exit status
configure:25312: $? = 1
configure: program exited with status 1
configure: failed program was:
| /* confdefs.h.  */
| 
| #define PACKAGE_NAME ""
| #define PACKAGE_TARNAME ""
| #define PACKAGE_VERSION ""
| #define PACKAGE_STRING ""
| #define PACKAGE_BUGREPORT ""
| #define PACKAGE "bzflag"
| #define VERSION "2.0.4.20051102"
| #define BZ_BUILD_OS "solaris2.10"
| #define BZ_BUILD_USER "anonymous"
| #define BUILD_REGEX 1
| #ifdef __cplusplus
| extern "C" void std::exit (int) throw (); using std::exit;
| #endif
| #define STDC_HEADERS 1
| #define HAVE_SYS_TYPES_H 1
| #define HAVE_SYS_STAT_H 1
| #define HAVE_STDLIB_H 1
| #define HAVE_STRING_H 1
| #define HAVE_MEMORY_H 1
| #define HAVE_STRINGS_H 1
| #define HAVE_INTTYPES_H 1
| #define HAVE_STDINT_H 1
| #define HAVE_UNISTD_H 1
| #define HAVE_DLFCN_H 1
| #define STDC_HEADERS 1
| #define HAVE_CSTDLIB 1
| #define HAVE_CSTDIO 1
| #define HAVE_CSTRING 1
| #define HAVE_GL_GLX_H 1
| #define HAVE_SDL_SDL_H 1
| #define HAVE_X11_XLIB_H 1
| #define HAVE_STDINT_H 1
| #define HAVE_SYS_PARAM_H 1
| #define HAVE_UNISTD_H 1
| #define HAVE_VALUES_H 1
| #define HAVE_SOCKLEN_T 1
| #define HAVE_LIBM 1
| #define HAVE_LIBSOCKET 1
| #define HAVE_LIBSOCKET 1
| #define HAVE_ACOSF 1
| #define HAVE_ASINF 1
| #define HAVE_ATAN2F 1
| #define HAVE_ATANF 1
| #define HAVE_COSF 1
| #define HAVE_EXPF 1
| #define HAVE_FABSF 1
| #define HAVE_FLOORF 1
| #define HAVE_FMODF 1
| #define HAVE_HYPOTF 1
| #define HAVE_LOGF 1
| #define HAVE_LOG10F 1
| #define HAVE_POWF 1
| #define HAVE_SINF 1
| #define HAVE_SQRTF 1
| #define HAVE_TANF 1
| #define HAVE_REGEX_H 1
| #define _USE_BZ_API 1
| #define HAVE_NCURSES_H
| /* end confdefs.h.  */
| 
| #include <stdio.h>
| #include <stdlib.h>
| #include <string.h>
| #include "SDL.h"
| 
| char*
| my_strdup (char *str)
| {
|   char *new_str;
| 
|   if (str)
|     {
|       new_str = (char *)malloc ((strlen (str) + 1) * sizeof(char));
|       strcpy (new_str, str);
|     }
|   else
|     new_str = NULL;
| 
|   return new_str;
| }
| 
| int main (int argc, char *argv[])
| {
|   int major, minor, micro;
|   char *tmp_version;
| 
|   /* This hangs on some systems (?)
|   system ("touch conf.sdltest");
|   */
|   { FILE *fp = fopen("conf.sdltest", "a"); if ( fp ) fclose(fp); }
| 
|   /* HP/UX 9 (%@#!) writes to sscanf strings */
|   tmp_version = my_strdup("1.2.5");
|   if (sscanf(tmp_version, "%d.%d.%d", &major, &minor, &micro) != 3) {
|      printf("%s, bad version string\n", "1.2.5");
|      exit(1);
|    }
| 
|    if ((1 > major) ||
|       ((1 == major) && (2 > minor)) ||
|       ((1 == major) && (2 == minor) && (5 >= micro)))
|     {
|       return 0;
|     }
|   else
|     {
|       printf("\n*** 'sdl-config --version' returned %d.%d.%d, but the minimum version\n", 1, 2, 5);
|       printf("*** of SDL required is %d.%d.%d. If sdl-config is correct, then it is\n", major, minor, micro);
|       printf("*** best to upgrade to the required version.\n");
|       printf("*** If sdl-config was wrong, set the environment variable SDL_CONFIG\n");
|       printf("*** to point to the correct copy of sdl-config, and remove the file\n");
|       printf("*** config.cache before re-running configure\n");
|       return 1;
|     }
| }
| 
| 
configure:25340: result: no
configure:25381: gcc -o conftest -g -O2 -I/opt/sfw/include/SDL -D_REENTRANT     -L/usr/demo/SOUND/lib conftest.c  -lSM -lICE -lX11  -lresolv -laudio  -lsocket -lsocket -lm -L/export/home/beaulieus/lib -lcurl -L/usr/sfw/lib -lssl -lcrypto -lsocket -lnsl -lssl -lcrypto -lsocket -lnsl -ldl -lz  -lsocket -lnsl -lresolv -L/opt/sfw/lib -R/opt/sfw/lib -lSDL -lpthread -lposix4 >&5
ld: fatal: library -laudio: not found
ld: fatal: File processing errors. No output written to conftest
collect2: ld returned 1 exit status
configure:25387: $? = 1
configure: failed program was:
| /* confdefs.h.  */
| 
| #define PACKAGE_NAME ""
| #define PACKAGE_TARNAME ""
| #define PACKAGE_VERSION ""
| #define PACKAGE_STRING ""
| #define PACKAGE_BUGREPORT ""
| #define PACKAGE "bzflag"
| #define VERSION "2.0.4.20051102"
| #define BZ_BUILD_OS "solaris2.10"
| #define BZ_BUILD_USER "anonymous"
| #define BUILD_REGEX 1
| #ifdef __cplusplus
| extern "C" void std::exit (int) throw (); using std::exit;
| #endif
| #define STDC_HEADERS 1
| #define HAVE_SYS_TYPES_H 1
| #define HAVE_SYS_STAT_H 1
| #define HAVE_STDLIB_H 1
| #define HAVE_STRING_H 1
| #define HAVE_MEMORY_H 1
| #define HAVE_STRINGS_H 1
| #define HAVE_INTTYPES_H 1
| #define HAVE_STDINT_H 1
| #define HAVE_UNISTD_H 1
| #define HAVE_DLFCN_H 1
| #define STDC_HEADERS 1
| #define HAVE_CSTDLIB 1
| #define HAVE_CSTDIO 1
| #define HAVE_CSTRING 1
| #define HAVE_GL_GLX_H 1
| #define HAVE_SDL_SDL_H 1
| #define HAVE_X11_XLIB_H 1
| #define HAVE_STDINT_H 1
| #define HAVE_SYS_PARAM_H 1
| #define HAVE_UNISTD_H 1
| #define HAVE_VALUES_H 1
| #define HAVE_SOCKLEN_T 1
| #define HAVE_LIBM 1
| #define HAVE_LIBSOCKET 1
| #define HAVE_LIBSOCKET 1
| #define HAVE_ACOSF 1
| #define HAVE_ASINF 1
| #define HAVE_ATAN2F 1
| #define HAVE_ATANF 1
| #define HAVE_COSF 1
| #define HAVE_EXPF 1
| #define HAVE_FABSF 1
| #define HAVE_FLOORF 1
| #define HAVE_FMODF 1
| #define HAVE_HYPOTF 1
| #define HAVE_LOGF 1
| #define HAVE_LOG10F 1
| #define HAVE_POWF 1
| #define HAVE_SINF 1
| #define HAVE_SQRTF 1
| #define HAVE_TANF 1
| #define HAVE_REGEX_H 1
| #define _USE_BZ_API 1
| #define HAVE_NCURSES_H
| /* end confdefs.h.  */
| 
| #include <stdio.h>
| #include "SDL.h"
| 
| int main(int argc, char *argv[])
| { return 0; }
| #undef  main
| #define main K_and_R_C_main
| 
| int
| main ()
| {
| 
| return 0;
| 
|   ;
|   return 0;
| }
configure:25436: WARNING: could not find an appropriate SDL version. BZflag will build without SDL
configure:25502: WARNING: Client build has been requested, but GL is not fully available (missing gl.h)
     ... disabling client generation
configure:25731: checking if the compiler understands -Wl,-search_paths_first -mdynamic-no-pic
configure:25752: g++ -o conftest -g -O2 -DBZ_BUILD_DATE=20051102 -O     -L/usr/demo/SOUND/lib -Wl,-search_paths_first -mdynamic-no-pic conftest.cc -lsocket -lsocket -lm -L/export/home/beaulieus/lib -lcurl -L/usr/sfw/lib -lssl -lcrypto -lsocket -lnsl -lssl -lcrypto -lsocket -lnsl -ldl -lz  -lsocket -lnsl -lresolv >&5
cc1plus: error: invalid option `dynamic-no-pic'
configure:25758: $? = 1
configure: failed program was:
| /* confdefs.h.  */
| 
| #define PACKAGE_NAME ""
| #define PACKAGE_TARNAME ""
| #define PACKAGE_VERSION ""
| #define PACKAGE_STRING ""
| #define PACKAGE_BUGREPORT ""
| #define PACKAGE "bzflag"
| #define VERSION "2.0.4.20051102"
| #define BZ_BUILD_OS "solaris2.10"
| #define BZ_BUILD_USER "anonymous"
| #define BUILD_REGEX 1
| #ifdef __cplusplus
| extern "C" void std::exit (int) throw (); using std::exit;
| #endif
| #define STDC_HEADERS 1
| #define HAVE_SYS_TYPES_H 1
| #define HAVE_SYS_STAT_H 1
| #define HAVE_STDLIB_H 1
| #define HAVE_STRING_H 1
| #define HAVE_MEMORY_H 1
| #define HAVE_STRINGS_H 1
| #define HAVE_INTTYPES_H 1
| #define HAVE_STDINT_H 1
| #define HAVE_UNISTD_H 1
| #define HAVE_DLFCN_H 1
| #define STDC_HEADERS 1
| #define HAVE_CSTDLIB 1
| #define HAVE_CSTDIO 1
| #define HAVE_CSTRING 1
| #define HAVE_GL_GLX_H 1
| #define HAVE_SDL_SDL_H 1
| #define HAVE_X11_XLIB_H 1
| #define HAVE_STDINT_H 1
| #define HAVE_SYS_PARAM_H 1
| #define HAVE_UNISTD_H 1
| #define HAVE_VALUES_H 1
| #define HAVE_SOCKLEN_T 1
| #define HAVE_LIBM 1
| #define HAVE_LIBSOCKET 1
| #define HAVE_LIBSOCKET 1
| #define HAVE_ACOSF 1
| #define HAVE_ASINF 1
| #define HAVE_ATAN2F 1
| #define HAVE_ATANF 1
| #define HAVE_COSF 1
| #define HAVE_EXPF 1
| #define HAVE_FABSF 1
| #define HAVE_FLOORF 1
| #define HAVE_FMODF 1
| #define HAVE_HYPOTF 1
| #define HAVE_LOGF 1
| #define HAVE_LOG10F 1
| #define HAVE_POWF 1
| #define HAVE_SINF 1
| #define HAVE_SQRTF 1
| #define HAVE_TANF 1
| #define HAVE_REGEX_H 1
| #define _USE_BZ_API 1
| #define HAVE_NCURSES_H
| #define ROBOT 1
| #define SNAPPING 1
| #define INSTALL_DATA_DIR "/usr/local/share/bzflag"
| #define ETC_INET
| #define SUN_OGL_NO_VERTEX_MACROS
| #define NDEBUG 1
| /* end confdefs.h.  */
| 
| int
| main ()
| {
| 
|   ;
|   return 0;
| }
configure:25782: result: no
configure:25822: checking for CGLGetCurrentContext
configure:25879: g++ -o conftest -g -O2 -DBZ_BUILD_DATE=20051102 -O     -L/usr/demo/SOUND/lib conftest.cc -lsocket -lsocket -lm -L/export/home/beaulieus/lib -lcurl -L/usr/sfw/lib -lssl -lcrypto -lsocket -lnsl -lssl -lcrypto -lsocket -lnsl -ldl -lz  -lsocket -lnsl -lresolv >&5
Undefined			first referenced
 symbol  			    in file
CGLGetCurrentContext                /var/tmp//ccoo3jhY.o
ld: fatal: Symbol referencing errors. No output written to conftest
collect2: ld returned 1 exit status
configure:25885: $? = 1
configure: failed program was:
| /* confdefs.h.  */
| 
| #define PACKAGE_NAME ""
| #define PACKAGE_TARNAME ""
| #define PACKAGE_VERSION ""
| #define PACKAGE_STRING ""
| #define PACKAGE_BUGREPORT ""
| #define PACKAGE "bzflag"
| #define VERSION "2.0.4.20051102"
| #define BZ_BUILD_OS "solaris2.10"
| #define BZ_BUILD_USER "anonymous"
| #define BUILD_REGEX 1
| #ifdef __cplusplus
| extern "C" void std::exit (int) throw (); using std::exit;
| #endif
| #define STDC_HEADERS 1
| #define HAVE_SYS_TYPES_H 1
| #define HAVE_SYS_STAT_H 1
| #define HAVE_STDLIB_H 1
| #define HAVE_STRING_H 1
| #define HAVE_MEMORY_H 1
| #define HAVE_STRINGS_H 1
| #define HAVE_INTTYPES_H 1
| #define HAVE_STDINT_H 1
| #define HAVE_UNISTD_H 1
| #define HAVE_DLFCN_H 1
| #define STDC_HEADERS 1
| #define HAVE_CSTDLIB 1
| #define HAVE_CSTDIO 1
| #define HAVE_CSTRING 1
| #define HAVE_GL_GLX_H 1
| #define HAVE_SDL_SDL_H 1
| #define HAVE_X11_XLIB_H 1
| #define HAVE_STDINT_H 1
| #define HAVE_SYS_PARAM_H 1
| #define HAVE_UNISTD_H 1
| #define HAVE_VALUES_H 1
| #define HAVE_SOCKLEN_T 1
| #define HAVE_LIBM 1
| #define HAVE_LIBSOCKET 1
| #define HAVE_LIBSOCKET 1
| #define HAVE_ACOSF 1
| #define HAVE_ASINF 1
| #define HAVE_ATAN2F 1
| #define HAVE_ATANF 1
| #define HAVE_COSF 1
| #define HAVE_EXPF 1
| #define HAVE_FABSF 1
| #define HAVE_FLOORF 1
| #define HAVE_FMODF 1
| #define HAVE_HYPOTF 1
| #define HAVE_LOGF 1
| #define HAVE_LOG10F 1
| #define HAVE_POWF 1
| #define HAVE_SINF 1
| #define HAVE_SQRTF 1
| #define HAVE_TANF 1
| #define HAVE_REGEX_H 1
| #define _USE_BZ_API 1
| #define HAVE_NCURSES_H
| #define ROBOT 1
| #define SNAPPING 1
| #define INSTALL_DATA_DIR "/usr/local/share/bzflag"
| #define ETC_INET
| #define SUN_OGL_NO_VERTEX_MACROS
| #define NDEBUG 1
| /* end confdefs.h.  */
| /* Define CGLGetCurrentContext to an innocuous variant, in case <limits.h> declares CGLGetCurrentContext.
|    For example, HP-UX 11i <limits.h> declares gettimeofday.  */
| #define CGLGetCurrentContext innocuous_CGLGetCurrentContext
| 
| /* System header to define __stub macros and hopefully few prototypes,
|     which can conflict with char CGLGetCurrentContext (); below.
|     Prefer <limits.h> to <assert.h> if __STDC__ is defined, since
|     <limits.h> exists even on freestanding compilers.  */
| 
| #ifdef __STDC__
| # include <limits.h>
| #else
| # include <assert.h>
| #endif
| 
| #undef CGLGetCurrentContext
| 
| /* Override any gcc2 internal prototype to avoid an error.  */
| #ifdef __cplusplus
| extern "C"
| {
| #endif
| /* We use char because int might match the return type of a gcc2
|    builtin and then its argument prototype would still apply.  */
| char CGLGetCurrentContext ();
| /* The GNU C library defines this for functions which it implements
|     to always fail with ENOSYS.  Some functions are actually named
|     something starting with __ and the normal name is an alias.  */
| #if defined (__stub_CGLGetCurrentContext) || defined (__stub___CGLGetCurrentContext)
| choke me
| #else
| char (*f) () = CGLGetCurrentContext;
| #endif
| #ifdef __cplusplus
| }
| #endif
| 
| int
| main ()
| {
| return f != CGLGetCurrentContext;
|   ;
|   return 0;
| }
configure:25910: result: no
configure:25822: checking for Sleep
configure:25879: g++ -o conftest -g -O2 -DBZ_BUILD_DATE=20051102 -O     -L/usr/demo/SOUND/lib conftest.cc -lsocket -lsocket -lm -L/export/home/beaulieus/lib -lcurl -L/usr/sfw/lib -lssl -lcrypto -lsocket -lnsl -lssl -lcrypto -lsocket -lnsl -ldl -lz  -lsocket -lnsl -lresolv >&5
Undefined			first referenced
 symbol  			    in file
Sleep                               /var/tmp//ccy80tlk.o
ld: fatal: Symbol referencing errors. No output written to conftest
collect2: ld returned 1 exit status
configure:25885: $? = 1
configure: failed program was:
| /* confdefs.h.  */
| 
| #define PACKAGE_NAME ""
| #define PACKAGE_TARNAME ""
| #define PACKAGE_VERSION ""
| #define PACKAGE_STRING ""
| #define PACKAGE_BUGREPORT ""
| #define PACKAGE "bzflag"
| #define VERSION "2.0.4.20051102"
| #define BZ_BUILD_OS "solaris2.10"
| #define BZ_BUILD_USER "anonymous"
| #define BUILD_REGEX 1
| #ifdef __cplusplus
| extern "C" void std::exit (int) throw (); using std::exit;
| #endif
| #define STDC_HEADERS 1
| #define HAVE_SYS_TYPES_H 1
| #define HAVE_SYS_STAT_H 1
| #define HAVE_STDLIB_H 1
| #define HAVE_STRING_H 1
| #define HAVE_MEMORY_H 1
| #define HAVE_STRINGS_H 1
| #define HAVE_INTTYPES_H 1
| #define HAVE_STDINT_H 1
| #define HAVE_UNISTD_H 1
| #define HAVE_DLFCN_H 1
| #define STDC_HEADERS 1
| #define HAVE_CSTDLIB 1
| #define HAVE_CSTDIO 1
| #define HAVE_CSTRING 1
| #define HAVE_GL_GLX_H 1
| #define HAVE_SDL_SDL_H 1
| #define HAVE_X11_XLIB_H 1
| #define HAVE_STDINT_H 1
| #define HAVE_SYS_PARAM_H 1
| #define HAVE_UNISTD_H 1
| #define HAVE_VALUES_H 1
| #define HAVE_SOCKLEN_T 1
| #define HAVE_LIBM 1
| #define HAVE_LIBSOCKET 1
| #define HAVE_LIBSOCKET 1
| #define HAVE_ACOSF 1
| #define HAVE_ASINF 1
| #define HAVE_ATAN2F 1
| #define HAVE_ATANF 1
| #define HAVE_COSF 1
| #define HAVE_EXPF 1
| #define HAVE_FABSF 1
| #define HAVE_FLOORF 1
| #define HAVE_FMODF 1
| #define HAVE_HYPOTF 1
| #define HAVE_LOGF 1
| #define HAVE_LOG10F 1
| #define HAVE_POWF 1
| #define HAVE_SINF 1
| #define HAVE_SQRTF 1
| #define HAVE_TANF 1
| #define HAVE_REGEX_H 1
| #define _USE_BZ_API 1
| #define HAVE_NCURSES_H
| #define ROBOT 1
| #define SNAPPING 1
| #define INSTALL_DATA_DIR "/usr/local/share/bzflag"
| #define ETC_INET
| #define SUN_OGL_NO_VERTEX_MACROS
| #define NDEBUG 1
| /* end confdefs.h.  */
| /* Define Sleep to an innocuous variant, in case <limits.h> declares Sleep.
|    For example, HP-UX 11i <limits.h> declares gettimeofday.  */
| #define Sleep innocuous_Sleep
| 
| /* System header to define __stub macros and hopefully few prototypes,
|     which can conflict with char Sleep (); below.
|     Prefer <limits.h> to <assert.h> if __STDC__ is defined, since
|     <limits.h> exists even on freestanding compilers.  */
| 
| #ifdef __STDC__
| # include <limits.h>
| #else
| # include <assert.h>
| #endif
| 
| #undef Sleep
| 
| /* Override any gcc2 internal prototype to avoid an error.  */
| #ifdef __cplusplus
| extern "C"
| {
| #endif
| /* We use char because int might match the return type of a gcc2
|    builtin and then its argument prototype would still apply.  */
| char Sleep ();
| /* The GNU C library defines this for functions which it implements
|     to always fail with ENOSYS.  Some functions are actually named
|     something starting with __ and the normal name is an alias.  */
| #if defined (__stub_Sleep) || defined (__stub___Sleep)
| choke me
| #else
| char (*f) () = Sleep;
| #endif
| #ifdef __cplusplus
| }
| #endif
| 
| int
| main ()
| {
| return f != Sleep;
|   ;
|   return 0;
| }
configure:25910: result: no
configure:25822: checking for WaitForSingleObject
configure:25879: g++ -o conftest -g -O2 -DBZ_BUILD_DATE=20051102 -O     -L/usr/demo/SOUND/lib conftest.cc -lsocket -lsocket -lm -L/export/home/beaulieus/lib -lcurl -L/usr/sfw/lib -lssl -lcrypto -lsocket -lnsl -lssl -lcrypto -lsocket -lnsl -ldl -lz  -lsocket -lnsl -lresolv >&5
Undefined			first referenced
 symbol  			    in file
WaitForSingleObject                 /var/tmp//cckUpI6P.o
ld: fatal: Symbol referencing errors. No output written to conftest
collect2: ld returned 1 exit status
configure:25885: $? = 1
configure: failed program was:
| /* confdefs.h.  */
| 
| #define PACKAGE_NAME ""
| #define PACKAGE_TARNAME ""
| #define PACKAGE_VERSION ""
| #define PACKAGE_STRING ""
| #define PACKAGE_BUGREPORT ""
| #define PACKAGE "bzflag"
| #define VERSION "2.0.4.20051102"
| #define BZ_BUILD_OS "solaris2.10"
| #define BZ_BUILD_USER "anonymous"
| #define BUILD_REGEX 1
| #ifdef __cplusplus
| extern "C" void std::exit (int) throw (); using std::exit;
| #endif
| #define STDC_HEADERS 1
| #define HAVE_SYS_TYPES_H 1
| #define HAVE_SYS_STAT_H 1
| #define HAVE_STDLIB_H 1
| #define HAVE_STRING_H 1
| #define HAVE_MEMORY_H 1
| #define HAVE_STRINGS_H 1
| #define HAVE_INTTYPES_H 1
| #define HAVE_STDINT_H 1
| #define HAVE_UNISTD_H 1
| #define HAVE_DLFCN_H 1
| #define STDC_HEADERS 1
| #define HAVE_CSTDLIB 1
| #define HAVE_CSTDIO 1
| #define HAVE_CSTRING 1
| #define HAVE_GL_GLX_H 1
| #define HAVE_SDL_SDL_H 1
| #define HAVE_X11_XLIB_H 1
| #define HAVE_STDINT_H 1
| #define HAVE_SYS_PARAM_H 1
| #define HAVE_UNISTD_H 1
| #define HAVE_VALUES_H 1
| #define HAVE_SOCKLEN_T 1
| #define HAVE_LIBM 1
| #define HAVE_LIBSOCKET 1
| #define HAVE_LIBSOCKET 1
| #define HAVE_ACOSF 1
| #define HAVE_ASINF 1
| #define HAVE_ATAN2F 1
| #define HAVE_ATANF 1
| #define HAVE_COSF 1
| #define HAVE_EXPF 1
| #define HAVE_FABSF 1
| #define HAVE_FLOORF 1
| #define HAVE_FMODF 1
| #define HAVE_HYPOTF 1
| #define HAVE_LOGF 1
| #define HAVE_LOG10F 1
| #define HAVE_POWF 1
| #define HAVE_SINF 1
| #define HAVE_SQRTF 1
| #define HAVE_TANF 1
| #define HAVE_REGEX_H 1
| #define _USE_BZ_API 1
| #define HAVE_NCURSES_H
| #define ROBOT 1
| #define SNAPPING 1
| #define INSTALL_DATA_DIR "/usr/local/share/bzflag"
| #define ETC_INET
| #define SUN_OGL_NO_VERTEX_MACROS
| #define NDEBUG 1
| /* end confdefs.h.  */
| /* Define WaitForSingleObject to an innocuous variant, in case <limits.h> declares WaitForSingleObject.
|    For example, HP-UX 11i <limits.h> declares gettimeofday.  */
| #define WaitForSingleObject innocuous_WaitForSingleObject
| 
| /* System header to define __stub macros and hopefully few prototypes,
|     which can conflict with char WaitForSingleObject (); below.
|     Prefer <limits.h> to <assert.h> if __STDC__ is defined, since
|     <limits.h> exists even on freestanding compilers.  */
| 
| #ifdef __STDC__
| # include <limits.h>
| #else
| # include <assert.h>
| #endif
| 
| #undef WaitForSingleObject
| 
| /* Override any gcc2 internal prototype to avoid an error.  */
| #ifdef __cplusplus
| extern "C"
| {
| #endif
| /* We use char because int might match the return type of a gcc2
|    builtin and then its argument prototype would still apply.  */
| char WaitForSingleObject ();
| /* The GNU C library defines this for functions which it implements
|     to always fail with ENOSYS.  Some functions are actually named
|     something starting with __ and the normal name is an alias.  */
| #if defined (__stub_WaitForSingleObject) || defined (__stub___WaitForSingleObject)
| choke me
| #else
| char (*f) () = WaitForSingleObject;
| #endif
| #ifdef __cplusplus
| }
| #endif
| 
| int
| main ()
| {
| return f != WaitForSingleObject;
|   ;
|   return 0;
| }
configure:25910: result: no
configure:25822: checking for _stricmp
configure:25879: g++ -o conftest -g -O2 -DBZ_BUILD_DATE=20051102 -O     -L/usr/demo/SOUND/lib conftest.cc -lsocket -lsocket -lm -L/export/home/beaulieus/lib -lcurl -L/usr/sfw/lib -lssl -lcrypto -lsocket -lnsl -lssl -lcrypto -lsocket -lnsl -ldl -lz  -lsocket -lnsl -lresolv >&5
Undefined			first referenced
 symbol  			    in file
_stricmp                            /var/tmp//cc2Vn6Nm.o
ld: fatal: Symbol referencing errors. No output written to conftest
collect2: ld returned 1 exit status
configure:25885: $? = 1
configure: failed program was:
| /* confdefs.h.  */
| 
| #define PACKAGE_NAME ""
| #define PACKAGE_TARNAME ""
| #define PACKAGE_VERSION ""
| #define PACKAGE_STRING ""
| #define PACKAGE_BUGREPORT ""
| #define PACKAGE "bzflag"
| #define VERSION "2.0.4.20051102"
| #define BZ_BUILD_OS "solaris2.10"
| #define BZ_BUILD_USER "anonymous"
| #define BUILD_REGEX 1
| #ifdef __cplusplus
| extern "C" void std::exit (int) throw (); using std::exit;
| #endif
| #define STDC_HEADERS 1
| #define HAVE_SYS_TYPES_H 1
| #define HAVE_SYS_STAT_H 1
| #define HAVE_STDLIB_H 1
| #define HAVE_STRING_H 1
| #define HAVE_MEMORY_H 1
| #define HAVE_STRINGS_H 1
| #define HAVE_INTTYPES_H 1
| #define HAVE_STDINT_H 1
| #define HAVE_UNISTD_H 1
| #define HAVE_DLFCN_H 1
| #define STDC_HEADERS 1
| #define HAVE_CSTDLIB 1
| #define HAVE_CSTDIO 1
| #define HAVE_CSTRING 1
| #define HAVE_GL_GLX_H 1
| #define HAVE_SDL_SDL_H 1
| #define HAVE_X11_XLIB_H 1
| #define HAVE_STDINT_H 1
| #define HAVE_SYS_PARAM_H 1
| #define HAVE_UNISTD_H 1
| #define HAVE_VALUES_H 1
| #define HAVE_SOCKLEN_T 1
| #define HAVE_LIBM 1
| #define HAVE_LIBSOCKET 1
| #define HAVE_LIBSOCKET 1
| #define HAVE_ACOSF 1
| #define HAVE_ASINF 1
| #define HAVE_ATAN2F 1
| #define HAVE_ATANF 1
| #define HAVE_COSF 1
| #define HAVE_EXPF 1
| #define HAVE_FABSF 1
| #define HAVE_FLOORF 1
| #define HAVE_FMODF 1
| #define HAVE_HYPOTF 1
| #define HAVE_LOGF 1
| #define HAVE_LOG10F 1
| #define HAVE_POWF 1
| #define HAVE_SINF 1
| #define HAVE_SQRTF 1
| #define HAVE_TANF 1
| #define HAVE_REGEX_H 1
| #define _USE_BZ_API 1
| #define HAVE_NCURSES_H
| #define ROBOT 1
| #define SNAPPING 1
| #define INSTALL_DATA_DIR "/usr/local/share/bzflag"
| #define ETC_INET
| #define SUN_OGL_NO_VERTEX_MACROS
| #define NDEBUG 1
| /* end confdefs.h.  */
| /* Define _stricmp to an innocuous variant, in case <limits.h> declares _stricmp.
|    For example, HP-UX 11i <limits.h> declares gettimeofday.  */
| #define _stricmp innocuous__stricmp
| 
| /* System header to define __stub macros and hopefully few prototypes,
|     which can conflict with char _stricmp (); below.
|     Prefer <limits.h> to <assert.h> if __STDC__ is defined, since
|     <limits.h> exists even on freestanding compilers.  */
| 
| #ifdef __STDC__
| # include <limits.h>
| #else
| # include <assert.h>
| #endif
| 
| #undef _stricmp
| 
| /* Override any gcc2 internal prototype to avoid an error.  */
| #ifdef __cplusplus
| extern "C"
| {
| #endif
| /* We use char because int might match the return type of a gcc2
|    builtin and then its argument prototype would still apply.  */
| char _stricmp ();
| /* The GNU C library defines this for functions which it implements
|     to always fail with ENOSYS.  Some functions are actually named
|     something starting with __ and the normal name is an alias.  */
| #if defined (__stub__stricmp) || defined (__stub____stricmp)
| choke me
| #else
| char (*f) () = _stricmp;
| #endif
| #ifdef __cplusplus
| }
| #endif
| 
| int
| main ()
| {
| return f != _stricmp;
|   ;
|   return 0;
| }
configure:25910: result: no
configure:25822: checking for _strnicmp
configure:25879: g++ -o conftest -g -O2 -DBZ_BUILD_DATE=20051102 -O     -L/usr/demo/SOUND/lib conftest.cc -lsocket -lsocket -lm -L/export/home/beaulieus/lib -lcurl -L/usr/sfw/lib -lssl -lcrypto -lsocket -lnsl -lssl -lcrypto -lsocket -lnsl -ldl -lz  -lsocket -lnsl -lresolv >&5
Undefined			first referenced
 symbol  			    in file
_strnicmp                           /var/tmp//ccwvSgN5.o
ld: fatal: Symbol referencing errors. No output written to conftest
collect2: ld returned 1 exit status
configure:25885: $? = 1
configure: failed program was:
| /* confdefs.h.  */
| 
| #define PACKAGE_NAME ""
| #define PACKAGE_TARNAME ""
| #define PACKAGE_VERSION ""
| #define PACKAGE_STRING ""
| #define PACKAGE_BUGREPORT ""
| #define PACKAGE "bzflag"
| #define VERSION "2.0.4.20051102"
| #define BZ_BUILD_OS "solaris2.10"
| #define BZ_BUILD_USER "anonymous"
| #define BUILD_REGEX 1
| #ifdef __cplusplus
| extern "C" void std::exit (int) throw (); using std::exit;
| #endif
| #define STDC_HEADERS 1
| #define HAVE_SYS_TYPES_H 1
| #define HAVE_SYS_STAT_H 1
| #define HAVE_STDLIB_H 1
| #define HAVE_STRING_H 1
| #define HAVE_MEMORY_H 1
| #define HAVE_STRINGS_H 1
| #define HAVE_INTTYPES_H 1
| #define HAVE_STDINT_H 1
| #define HAVE_UNISTD_H 1
| #define HAVE_DLFCN_H 1
| #define STDC_HEADERS 1
| #define HAVE_CSTDLIB 1
| #define HAVE_CSTDIO 1
| #define HAVE_CSTRING 1
| #define HAVE_GL_GLX_H 1
| #define HAVE_SDL_SDL_H 1
| #define HAVE_X11_XLIB_H 1
| #define HAVE_STDINT_H 1
| #define HAVE_SYS_PARAM_H 1
| #define HAVE_UNISTD_H 1
| #define HAVE_VALUES_H 1
| #define HAVE_SOCKLEN_T 1
| #define HAVE_LIBM 1
| #define HAVE_LIBSOCKET 1
| #define HAVE_LIBSOCKET 1
| #define HAVE_ACOSF 1
| #define HAVE_ASINF 1
| #define HAVE_ATAN2F 1
| #define HAVE_ATANF 1
| #define HAVE_COSF 1
| #define HAVE_EXPF 1
| #define HAVE_FABSF 1
| #define HAVE_FLOORF 1
| #define HAVE_FMODF 1
| #define HAVE_HYPOTF 1
| #define HAVE_LOGF 1
| #define HAVE_LOG10F 1
| #define HAVE_POWF 1
| #define HAVE_SINF 1
| #define HAVE_SQRTF 1
| #define HAVE_TANF 1
| #define HAVE_REGEX_H 1
| #define _USE_BZ_API 1
| #define HAVE_NCURSES_H
| #define ROBOT 1
| #define SNAPPING 1
| #define INSTALL_DATA_DIR "/usr/local/share/bzflag"
| #define ETC_INET
| #define SUN_OGL_NO_VERTEX_MACROS
| #define NDEBUG 1
| /* end confdefs.h.  */
| /* Define _strnicmp to an innocuous variant, in case <limits.h> declares _strnicmp.
|    For example, HP-UX 11i <limits.h> declares gettimeofday.  */
| #define _strnicmp innocuous__strnicmp
| 
| /* System header to define __stub macros and hopefully few prototypes,
|     which can conflict with char _strnicmp (); below.
|     Prefer <limits.h> to <assert.h> if __STDC__ is defined, since
|     <limits.h> exists even on freestanding compilers.  */
| 
| #ifdef __STDC__
| # include <limits.h>
| #else
| # include <assert.h>
| #endif
| 
| #undef _strnicmp
| 
| /* Override any gcc2 internal prototype to avoid an error.  */
| #ifdef __cplusplus
| extern "C"
| {
| #endif
| /* We use char because int might match the return type of a gcc2
|    builtin and then its argument prototype would still apply.  */
| char _strnicmp ();
| /* The GNU C library defines this for functions which it implements
|     to always fail with ENOSYS.  Some functions are actually named
|     something starting with __ and the normal name is an alias.  */
| #if defined (__stub__strnicmp) || defined (__stub____strnicmp)
| choke me
| #else
| char (*f) () = _strnicmp;
| #endif
| #ifdef __cplusplus
| }
| #endif
| 
| int
| main ()
| {
| return f != _strnicmp;
|   ;
|   return 0;
| }
configure:25910: result: no
configure:25822: checking for _vsnprintf
configure:25879: g++ -o conftest -g -O2 -DBZ_BUILD_DATE=20051102 -O     -L/usr/demo/SOUND/lib conftest.cc -lsocket -lsocket -lm -L/export/home/beaulieus/lib -lcurl -L/usr/sfw/lib -lssl -lcrypto -lsocket -lnsl -lssl -lcrypto -lsocket -lnsl -ldl -lz  -lsocket -lnsl -lresolv >&5
Undefined			first referenced
 symbol  			    in file
_vsnprintf                          /var/tmp//cc2kpoSj.o
ld: fatal: Symbol referencing errors. No output written to conftest
collect2: ld returned 1 exit status
configure:25885: $? = 1
configure: failed program was:
| /* confdefs.h.  */
| 
| #define PACKAGE_NAME ""
| #define PACKAGE_TARNAME ""
| #define PACKAGE_VERSION ""
| #define PACKAGE_STRING ""
| #define PACKAGE_BUGREPORT ""
| #define PACKAGE "bzflag"
| #define VERSION "2.0.4.20051102"
| #define BZ_BUILD_OS "solaris2.10"
| #define BZ_BUILD_USER "anonymous"
| #define BUILD_REGEX 1
| #ifdef __cplusplus
| extern "C" void std::exit (int) throw (); using std::exit;
| #endif
| #define STDC_HEADERS 1
| #define HAVE_SYS_TYPES_H 1
| #define HAVE_SYS_STAT_H 1
| #define HAVE_STDLIB_H 1
| #define HAVE_STRING_H 1
| #define HAVE_MEMORY_H 1
| #define HAVE_STRINGS_H 1
| #define HAVE_INTTYPES_H 1
| #define HAVE_STDINT_H 1
| #define HAVE_UNISTD_H 1
| #define HAVE_DLFCN_H 1
| #define STDC_HEADERS 1
| #define HAVE_CSTDLIB 1
| #define HAVE_CSTDIO 1
| #define HAVE_CSTRING 1
| #define HAVE_GL_GLX_H 1
| #define HAVE_SDL_SDL_H 1
| #define HAVE_X11_XLIB_H 1
| #define HAVE_STDINT_H 1
| #define HAVE_SYS_PARAM_H 1
| #define HAVE_UNISTD_H 1
| #define HAVE_VALUES_H 1
| #define HAVE_SOCKLEN_T 1
| #define HAVE_LIBM 1
| #define HAVE_LIBSOCKET 1
| #define HAVE_LIBSOCKET 1
| #define HAVE_ACOSF 1
| #define HAVE_ASINF 1
| #define HAVE_ATAN2F 1
| #define HAVE_ATANF 1
| #define HAVE_COSF 1
| #define HAVE_EXPF 1
| #define HAVE_FABSF 1
| #define HAVE_FLOORF 1
| #define HAVE_FMODF 1
| #define HAVE_HYPOTF 1
| #define HAVE_LOGF 1
| #define HAVE_LOG10F 1
| #define HAVE_POWF 1
| #define HAVE_SINF 1
| #define HAVE_SQRTF 1
| #define HAVE_TANF 1
| #define HAVE_REGEX_H 1
| #define _USE_BZ_API 1
| #define HAVE_NCURSES_H
| #define ROBOT 1
| #define SNAPPING 1
| #define INSTALL_DATA_DIR "/usr/local/share/bzflag"
| #define ETC_INET
| #define SUN_OGL_NO_VERTEX_MACROS
| #define NDEBUG 1
| /* end confdefs.h.  */
| /* Define _vsnprintf to an innocuous variant, in case <limits.h> declares _vsnprintf.
|    For example, HP-UX 11i <limits.h> declares gettimeofday.  */
| #define _vsnprintf innocuous__vsnprintf
| 
| /* System header to define __stub macros and hopefully few prototypes,
|     which can conflict with char _vsnprintf (); below.
|     Prefer <limits.h> to <assert.h> if __STDC__ is defined, since
|     <limits.h> exists even on freestanding compilers.  */
| 
| #ifdef __STDC__
| # include <limits.h>
| #else
| # include <assert.h>
| #endif
| 
| #undef _vsnprintf
| 
| /* Override any gcc2 internal prototype to avoid an error.  */
| #ifdef __cplusplus
| extern "C"
| {
| #endif
| /* We use char because int might match the return type of a gcc2
|    builtin and then its argument prototype would still apply.  */
| char _vsnprintf ();
| /* The GNU C library defines this for functions which it implements
|     to always fail with ENOSYS.  Some functions are actually named
|     something starting with __ and the normal name is an alias.  */
| #if defined (__stub__vsnprintf) || defined (__stub____vsnprintf)
| choke me
| #else
| char (*f) () = _vsnprintf;
| #endif
| #ifdef __cplusplus
| }
| #endif
| 
| int
| main ()
| {
| return f != _vsnprintf;
|   ;
|   return 0;
| }
configure:25910: result: no
configure:25822: checking for atexit
configure:25879: g++ -o conftest -g -O2 -DBZ_BUILD_DATE=20051102 -O     -L/usr/demo/SOUND/lib conftest.cc -lsocket -lsocket -lm -L/export/home/beaulieus/lib -lcurl -L/usr/sfw/lib -lssl -lcrypto -lsocket -lnsl -lssl -lcrypto -lsocket -lnsl -ldl -lz  -lsocket -lnsl -lresolv >&5
configure:25885: $? = 0
configure:25889: test -z 
			 || test ! -s conftest.err
configure:25892: $? = 0
configure:25895: test -s conftest
configure:25898: $? = 0
configure:25910: result: yes
configure:25822: checking for getrlimit
configure:25879: g++ -o conftest -g -O2 -DBZ_BUILD_DATE=20051102 -O     -L/usr/demo/SOUND/lib conftest.cc -lsocket -lsocket -lm -L/export/home/beaulieus/lib -lcurl -L/usr/sfw/lib -lssl -lcrypto -lsocket -lnsl -lssl -lcrypto -lsocket -lnsl -ldl -lz  -lsocket -lnsl -lresolv >&5
configure:25885: $? = 0
configure:25889: test -z 
			 || test ! -s conftest.err
configure:25892: $? = 0
configure:25895: test -s conftest
configure:25898: $? = 0
configure:25910: result: yes
configure:25822: checking for glXGetCurrentContext
configure:25879: g++ -o conftest -g -O2 -DBZ_BUILD_DATE=20051102 -O     -L/usr/demo/SOUND/lib conftest.cc -lsocket -lsocket -lm -L/export/home/beaulieus/lib -lcurl -L/usr/sfw/lib -lssl -lcrypto -lsocket -lnsl -lssl -lcrypto -lsocket -lnsl -ldl -lz  -lsocket -lnsl -lresolv >&5
Undefined			first referenced
 symbol  			    in file
glXGetCurrentContext                /var/tmp//cc4w9lqA.o
ld: fatal: Symbol referencing errors. No output written to conftest
collect2: ld returned 1 exit status
configure:25885: $? = 1
configure: failed program was:
| /* confdefs.h.  */
| 
| #define PACKAGE_NAME ""
| #define PACKAGE_TARNAME ""
| #define PACKAGE_VERSION ""
| #define PACKAGE_STRING ""
| #define PACKAGE_BUGREPORT ""
| #define PACKAGE "bzflag"
| #define VERSION "2.0.4.20051102"
| #define BZ_BUILD_OS "solaris2.10"
| #define BZ_BUILD_USER "anonymous"
| #define BUILD_REGEX 1
| #ifdef __cplusplus
| extern "C" void std::exit (int) throw (); using std::exit;
| #endif
| #define STDC_HEADERS 1
| #define HAVE_SYS_TYPES_H 1
| #define HAVE_SYS_STAT_H 1
| #define HAVE_STDLIB_H 1
| #define HAVE_STRING_H 1
| #define HAVE_MEMORY_H 1
| #define HAVE_STRINGS_H 1
| #define HAVE_INTTYPES_H 1
| #define HAVE_STDINT_H 1
| #define HAVE_UNISTD_H 1
| #define HAVE_DLFCN_H 1
| #define STDC_HEADERS 1
| #define HAVE_CSTDLIB 1
| #define HAVE_CSTDIO 1
| #define HAVE_CSTRING 1
| #define HAVE_GL_GLX_H 1
| #define HAVE_SDL_SDL_H 1
| #define HAVE_X11_XLIB_H 1
| #define HAVE_STDINT_H 1
| #define HAVE_SYS_PARAM_H 1
| #define HAVE_UNISTD_H 1
| #define HAVE_VALUES_H 1
| #define HAVE_SOCKLEN_T 1
| #define HAVE_LIBM 1
| #define HAVE_LIBSOCKET 1
| #define HAVE_LIBSOCKET 1
| #define HAVE_ACOSF 1
| #define HAVE_ASINF 1
| #define HAVE_ATAN2F 1
| #define HAVE_ATANF 1
| #define HAVE_COSF 1
| #define HAVE_EXPF 1
| #define HAVE_FABSF 1
| #define HAVE_FLOORF 1
| #define HAVE_FMODF 1
| #define HAVE_HYPOTF 1
| #define HAVE_LOGF 1
| #define HAVE_LOG10F 1
| #define HAVE_POWF 1
| #define HAVE_SINF 1
| #define HAVE_SQRTF 1
| #define HAVE_TANF 1
| #define HAVE_REGEX_H 1
| #define _USE_BZ_API 1
| #define HAVE_NCURSES_H
| #define ROBOT 1
| #define SNAPPING 1
| #define INSTALL_DATA_DIR "/usr/local/share/bzflag"
| #define ETC_INET
| #define SUN_OGL_NO_VERTEX_MACROS
| #define NDEBUG 1
| #define HAVE_ATEXIT 1
| #define HAVE_GETRLIMIT 1
| /* end confdefs.h.  */
| /* Define glXGetCurrentContext to an innocuous variant, in case <limits.h> declares glXGetCurrentContext.
|    For example, HP-UX 11i <limits.h> declares gettimeofday.  */
| #define glXGetCurrentContext innocuous_glXGetCurrentContext
| 
| /* System header to define __stub macros and hopefully few prototypes,
|     which can conflict with char glXGetCurrentContext (); below.
|     Prefer <limits.h> to <assert.h> if __STDC__ is defined, since
|     <limits.h> exists even on freestanding compilers.  */
| 
| #ifdef __STDC__
| # include <limits.h>
| #else
| # include <assert.h>
| #endif
| 
| #undef glXGetCurrentContext
| 
| /* Override any gcc2 internal prototype to avoid an error.  */
| #ifdef __cplusplus
| extern "C"
| {
| #endif
| /* We use char because int might match the return type of a gcc2
|    builtin and then its argument prototype would still apply.  */
| char glXGetCurrentContext ();
| /* The GNU C library defines this for functions which it implements
|     to always fail with ENOSYS.  Some functions are actually named
|     something starting with __ and the normal name is an alias.  */
| #if defined (__stub_glXGetCurrentContext) || defined (__stub___glXGetCurrentContext)
| choke me
| #else
| char (*f) () = glXGetCurrentContext;
| #endif
| #ifdef __cplusplus
| }
| #endif
| 
| int
| main ()
| {
| return f != glXGetCurrentContext;
|   ;
|   return 0;
| }
configure:25910: result: no
configure:25822: checking for select
configure:25879: g++ -o conftest -g -O2 -DBZ_BUILD_DATE=20051102 -O     -L/usr/demo/SOUND/lib conftest.cc -lsocket -lsocket -lm -L/export/home/beaulieus/lib -lcurl -L/usr/sfw/lib -lssl -lcrypto -lsocket -lnsl -lssl -lcrypto -lsocket -lnsl -ldl -lz  -lsocket -lnsl -lresolv >&5
configure:25885: $? = 0
configure:25889: test -z 
			 || test ! -s conftest.err
configure:25892: $? = 0
configure:25895: test -s conftest
configure:25898: $? = 0
configure:25910: result: yes
configure:25822: checking for snooze
configure:25879: g++ -o conftest -g -O2 -DBZ_BUILD_DATE=20051102 -O     -L/usr/demo/SOUND/lib conftest.cc -lsocket -lsocket -lm -L/export/home/beaulieus/lib -lcurl -L/usr/sfw/lib -lssl -lcrypto -lsocket -lnsl -lssl -lcrypto -lsocket -lnsl -ldl -lz  -lsocket -lnsl -lresolv >&5
Undefined			first referenced
 symbol  			    in file
snooze                              /var/tmp//ccGiCx8j.o
ld: fatal: Symbol referencing errors. No output written to conftest
collect2: ld returned 1 exit status
configure:25885: $? = 1
configure: failed program was:
| /* confdefs.h.  */
| 
| #define PACKAGE_NAME ""
| #define PACKAGE_TARNAME ""
| #define PACKAGE_VERSION ""
| #define PACKAGE_STRING ""
| #define PACKAGE_BUGREPORT ""
| #define PACKAGE "bzflag"
| #define VERSION "2.0.4.20051102"
| #define BZ_BUILD_OS "solaris2.10"
| #define BZ_BUILD_USER "anonymous"
| #define BUILD_REGEX 1
| #ifdef __cplusplus
| extern "C" void std::exit (int) throw (); using std::exit;
| #endif
| #define STDC_HEADERS 1
| #define HAVE_SYS_TYPES_H 1
| #define HAVE_SYS_STAT_H 1
| #define HAVE_STDLIB_H 1
| #define HAVE_STRING_H 1
| #define HAVE_MEMORY_H 1
| #define HAVE_STRINGS_H 1
| #define HAVE_INTTYPES_H 1
| #define HAVE_STDINT_H 1
| #define HAVE_UNISTD_H 1
| #define HAVE_DLFCN_H 1
| #define STDC_HEADERS 1
| #define HAVE_CSTDLIB 1
| #define HAVE_CSTDIO 1
| #define HAVE_CSTRING 1
| #define HAVE_GL_GLX_H 1
| #define HAVE_SDL_SDL_H 1
| #define HAVE_X11_XLIB_H 1
| #define HAVE_STDINT_H 1
| #define HAVE_SYS_PARAM_H 1
| #define HAVE_UNISTD_H 1
| #define HAVE_VALUES_H 1
| #define HAVE_SOCKLEN_T 1
| #define HAVE_LIBM 1
| #define HAVE_LIBSOCKET 1
| #define HAVE_LIBSOCKET 1
| #define HAVE_ACOSF 1
| #define HAVE_ASINF 1
| #define HAVE_ATAN2F 1
| #define HAVE_ATANF 1
| #define HAVE_COSF 1
| #define HAVE_EXPF 1
| #define HAVE_FABSF 1
| #define HAVE_FLOORF 1
| #define HAVE_FMODF 1
| #define HAVE_HYPOTF 1
| #define HAVE_LOGF 1
| #define HAVE_LOG10F 1
| #define HAVE_POWF 1
| #define HAVE_SINF 1
| #define HAVE_SQRTF 1
| #define HAVE_TANF 1
| #define HAVE_REGEX_H 1
| #define _USE_BZ_API 1
| #define HAVE_NCURSES_H
| #define ROBOT 1
| #define SNAPPING 1
| #define INSTALL_DATA_DIR "/usr/local/share/bzflag"
| #define ETC_INET
| #define SUN_OGL_NO_VERTEX_MACROS
| #define NDEBUG 1
| #define HAVE_ATEXIT 1
| #define HAVE_GETRLIMIT 1
| #define HAVE_SELECT 1
| /* end confdefs.h.  */
| /* Define snooze to an innocuous variant, in case <limits.h> declares snooze.
|    For example, HP-UX 11i <limits.h> declares gettimeofday.  */
| #define snooze innocuous_snooze
| 
| /* System header to define __stub macros and hopefully few prototypes,
|     which can conflict with char snooze (); below.
|     Prefer <limits.h> to <assert.h> if __STDC__ is defined, since
|     <limits.h> exists even on freestanding compilers.  */
| 
| #ifdef __STDC__
| # include <limits.h>
| #else
| # include <assert.h>
| #endif
| 
| #undef snooze
| 
| /* Override any gcc2 internal prototype to avoid an error.  */
| #ifdef __cplusplus
| extern "C"
| {
| #endif
| /* We use char because int might match the return type of a gcc2
|    builtin and then its argument prototype would still apply.  */
| char snooze ();
| /* The GNU C library defines this for functions which it implements
|     to always fail with ENOSYS.  Some functions are actually named
|     something starting with __ and the normal name is an alias.  */
| #if defined (__stub_snooze) || defined (__stub___snooze)
| choke me
| #else
| char (*f) () = snooze;
| #endif
| #ifdef __cplusplus
| }
| #endif
| 
| int
| main ()
| {
| return f != snooze;
|   ;
|   return 0;
| }
configure:25910: result: no
configure:25822: checking for usleep
configure:25879: g++ -o conftest -g -O2 -DBZ_BUILD_DATE=20051102 -O     -L/usr/demo/SOUND/lib conftest.cc -lsocket -lsocket -lm -L/export/home/beaulieus/lib -lcurl -L/usr/sfw/lib -lssl -lcrypto -lsocket -lnsl -lssl -lcrypto -lsocket -lnsl -ldl -lz  -lsocket -lnsl -lresolv >&5
configure:25885: $? = 0
configure:25889: test -z 
			 || test ! -s conftest.err
configure:25892: $? = 0
configure:25895: test -s conftest
configure:25898: $? = 0
configure:25910: result: yes
configure:25822: checking for vsnprintf
configure:25879: g++ -o conftest -g -O2 -DBZ_BUILD_DATE=20051102 -O     -L/usr/demo/SOUND/lib conftest.cc -lsocket -lsocket -lm -L/export/home/beaulieus/lib -lcurl -L/usr/sfw/lib -lssl -lcrypto -lsocket -lnsl -lssl -lcrypto -lsocket -lnsl -ldl -lz  -lsocket -lnsl -lresolv >&5
configure:25885: $? = 0
configure:25889: test -z 
			 || test ! -s conftest.err
configure:25892: $? = 0
configure:25895: test -s conftest
configure:25898: $? = 0
configure:25910: result: yes
configure:25822: checking for wglGetCurrentContext
configure:25879: g++ -o conftest -g -O2 -DBZ_BUILD_DATE=20051102 -O     -L/usr/demo/SOUND/lib conftest.cc -lsocket -lsocket -lm -L/export/home/beaulieus/lib -lcurl -L/usr/sfw/lib -lssl -lcrypto -lsocket -lnsl -lssl -lcrypto -lsocket -lnsl -ldl -lz  -lsocket -lnsl -lresolv >&5
Undefined			first referenced
 symbol  			    in file
wglGetCurrentContext                /var/tmp//ccu2t0W4.o
ld: fatal: Symbol referencing errors. No output written to conftest
collect2: ld returned 1 exit status
configure:25885: $? = 1
configure: failed program was:
| /* confdefs.h.  */
| 
| #define PACKAGE_NAME ""
| #define PACKAGE_TARNAME ""
| #define PACKAGE_VERSION ""
| #define PACKAGE_STRING ""
| #define PACKAGE_BUGREPORT ""
| #define PACKAGE "bzflag"
| #define VERSION "2.0.4.20051102"
| #define BZ_BUILD_OS "solaris2.10"
| #define BZ_BUILD_USER "anonymous"
| #define BUILD_REGEX 1
| #ifdef __cplusplus
| extern "C" void std::exit (int) throw (); using std::exit;
| #endif
| #define STDC_HEADERS 1
| #define HAVE_SYS_TYPES_H 1
| #define HAVE_SYS_STAT_H 1
| #define HAVE_STDLIB_H 1
| #define HAVE_STRING_H 1
| #define HAVE_MEMORY_H 1
| #define HAVE_STRINGS_H 1
| #define HAVE_INTTYPES_H 1
| #define HAVE_STDINT_H 1
| #define HAVE_UNISTD_H 1
| #define HAVE_DLFCN_H 1
| #define STDC_HEADERS 1
| #define HAVE_CSTDLIB 1
| #define HAVE_CSTDIO 1
| #define HAVE_CSTRING 1
| #define HAVE_GL_GLX_H 1
| #define HAVE_SDL_SDL_H 1
| #define HAVE_X11_XLIB_H 1
| #define HAVE_STDINT_H 1
| #define HAVE_SYS_PARAM_H 1
| #define HAVE_UNISTD_H 1
| #define HAVE_VALUES_H 1
| #define HAVE_SOCKLEN_T 1
| #define HAVE_LIBM 1
| #define HAVE_LIBSOCKET 1
| #define HAVE_LIBSOCKET 1
| #define HAVE_ACOSF 1
| #define HAVE_ASINF 1
| #define HAVE_ATAN2F 1
| #define HAVE_ATANF 1
| #define HAVE_COSF 1
| #define HAVE_EXPF 1
| #define HAVE_FABSF 1
| #define HAVE_FLOORF 1
| #define HAVE_FMODF 1
| #define HAVE_HYPOTF 1
| #define HAVE_LOGF 1
| #define HAVE_LOG10F 1
| #define HAVE_POWF 1
| #define HAVE_SINF 1
| #define HAVE_SQRTF 1
| #define HAVE_TANF 1
| #define HAVE_REGEX_H 1
| #define _USE_BZ_API 1
| #define HAVE_NCURSES_H
| #define ROBOT 1
| #define SNAPPING 1
| #define INSTALL_DATA_DIR "/usr/local/share/bzflag"
| #define ETC_INET
| #define SUN_OGL_NO_VERTEX_MACROS
| #define NDEBUG 1
| #define HAVE_ATEXIT 1
| #define HAVE_GETRLIMIT 1
| #define HAVE_SELECT 1
| #define HAVE_USLEEP 1
| #define HAVE_VSNPRINTF 1
| /* end confdefs.h.  */
| /* Define wglGetCurrentContext to an innocuous variant, in case <limits.h> declares wglGetCurrentContext.
|    For example, HP-UX 11i <limits.h> declares gettimeofday.  */
| #define wglGetCurrentContext innocuous_wglGetCurrentContext
| 
| /* System header to define __stub macros and hopefully few prototypes,
|     which can conflict with char wglGetCurrentContext (); below.
|     Prefer <limits.h> to <assert.h> if __STDC__ is defined, since
|     <limits.h> exists even on freestanding compilers.  */
| 
| #ifdef __STDC__
| # include <limits.h>
| #else
| # include <assert.h>
| #endif
| 
| #undef wglGetCurrentContext
| 
| /* Override any gcc2 internal prototype to avoid an error.  */
| #ifdef __cplusplus
| extern "C"
| {
| #endif
| /* We use char because int might match the return type of a gcc2
|    builtin and then its argument prototype would still apply.  */
| char wglGetCurrentContext ();
| /* The GNU C library defines this for functions which it implements
|     to always fail with ENOSYS.  Some functions are actually named
|     something starting with __ and the normal name is an alias.  */
| #if defined (__stub_wglGetCurrentContext) || defined (__stub___wglGetCurrentContext)
| choke me
| #else
| char (*f) () = wglGetCurrentContext;
| #endif
| #ifdef __cplusplus
| }
| #endif
| 
| int
| main ()
| {
| return f != wglGetCurrentContext;
|   ;
|   return 0;
| }
configure:25910: result: no
configure:25941: g++ -c -g -O2 -DBZ_BUILD_DATE=20051102 -O   conftest.cc >&5
configure:25947: $? = 0
configure:25951: test -z 
			 || test ! -s conftest.err
configure:25954: $? = 0
configure:25957: test -s conftest.o
configure:25960: $? = 0
configure:25994: g++ -c -g -O2 -DBZ_BUILD_DATE=20051102 -O   conftest.cc >&5
configure:26000: $? = 0
configure:26004: test -z 
			 || test ! -s conftest.err
configure:26007: $? = 0
configure:26010: test -s conftest.o
configure:26013: $? = 0
configure:26048: g++ -c -g -O2 -DBZ_BUILD_DATE=20051102 -O   conftest.cc >&5
configure:26054: $? = 0
configure:26058: test -z 
			 || test ! -s conftest.err
configure:26061: $? = 0
configure:26064: test -s conftest.o
configure:26067: $? = 0
configure:26403: creating ./config.status

## ---------------------- ##
## Running config.status. ##
## ---------------------- ##

This file was extended by config.status, which was
generated by GNU Autoconf 2.59.  Invocation command line was

  CONFIG_FILES    = 
  CONFIG_HEADERS  = 
  CONFIG_LINKS    = 
  CONFIG_COMMANDS = 
  $ ./config.status 

on sun8

config.status:863: creating bzflag.info
config.status:863: creating BZFlag.xcode/Makefile
config.status:863: creating Dev-C++/Makefile
config.status:863: creating Makefile
config.status:863: creating bzflag.lsm
config.status:863: creating bzflag.spec
config.status:863: creating data/Makefile
config.status:863: creating data/fonts/Makefile
config.status:863: creating data/l10n/Makefile
config.status:863: creating debian/Makefile
config.status:863: creating doc/Makefile
config.status:863: creating doc/faq/Makefile
config.status:863: creating doc/guide/Commands/Makefile
config.status:863: creating doc/guide/Flags/Makefile
config.status:863: creating doc/guide/Geometry/Makefile
config.status:863: creating doc/guide/Installation/Makefile
config.status:863: creating doc/guide/Makefile
config.status:863: creating doc/guide/Tactics/Makefile
config.status:863: creating doc/howto/Makefile
config.status:863: creating doc/man/Makefile
config.status:863: creating include/Makefile
config.status:863: creating m4/Makefile
config.status:863: creating man/Makefile
config.status:863: creating man/bzadmin.6
config.status:863: creating man/bzflag.6
config.status:863: creating man/bzfs.6
config.status:863: creating man/bzw.5
config.status:863: creating misc/Makefile
config.status:863: creating package/Makefile
config.status:863: creating package/irix/Makefile
config.status:863: creating package/linux/Makefile
config.status:863: creating package/rpm/Makefile
config.status:863: creating package/win32/Makefile
config.status:863: creating package/win32/nsis/Makefile
config.status:863: creating plugins/Makefile
config.status:863: creating plugins/RogueGenocide/Makefile
config.status:863: creating plugins/SAMPLE_PLUGIN/Makefile
config.status:863: creating plugins/airspawn/Makefile
config.status:863: creating plugins/chathistory/Makefile
config.status:863: creating plugins/hiddenAdmin/Makefile
config.status:863: creating plugins/killall/Makefile
config.status:863: creating plugins/playHistoryTracker/Makefile
config.status:863: creating plugins/python/Makefile
config.status:863: creating plugins/shockwaveDeath/Makefile
config.status:863: creating plugins/vocaliser/Makefile
config.status:863: creating plugins/doc/Makefile
config.status:863: creating plugins/vc71/Makefile
config.status:863: creating src/3D/Makefile
config.status:863: creating src/Makefile
config.status:863: creating src/bzadmin/Makefile
config.status:863: creating src/bzflag/Makefile
config.status:863: creating src/bzfs/Makefile
config.status:863: creating src/c-ares/Makefile
config.status:863: creating src/common/Makefile
config.status:863: creating src/date/Makefile
config.status:863: creating src/game/Makefile
config.status:863: creating src/geometry/Makefile
config.status:863: creating src/geometry/models/Makefile
config.status:863: creating src/geometry/models/tank/Makefile
config.status:863: creating src/mediafile/Makefile
config.status:863: creating src/net/Makefile
config.status:863: creating src/obstacle/Makefile
config.status:863: creating src/ogl/Makefile
config.status:863: creating src/platform/MacOSX/BZFlag-Info.plist
config.status:863: creating src/platform/MacOSX/Makefile
config.status:863: creating src/platform/Makefile
config.status:863: creating src/regex/Makefile
config.status:863: creating src/scene/Makefile
config.status:863: creating src/zlib/Makefile
config.status:863: creating tools/Makefile
config.status:863: creating tools/TextTool-W32/Makefile
config.status:863: creating tools/TextTool-W32/res/Makefile
config.status:863: creating tools/bzwtransform/Makefile
config.status:863: creating tools/modeltool/Makefile
config.status:863: creating tools/modeltool/vc71/Makefile
config.status:863: creating win32/Makefile
config.status:863: creating win32/VC71/Makefile
config.status:967: creating include/config.h
config.status:1193: include/config.h is unchanged
config.status:1373: executing depfiles commands