All pastes #272925 Raw Edit

xushi

public text v1 · immutable
·published 2006-12-09 12:37 UTC
rendered paste body
checking if kernel defines kzalloc function... yes
checking if kernel defines fs_subsys... yes
checking whether lookup_instantiate_filp is defined... yes
checking if this is user mode linux... no
configure: creating ./config.status
config.status: creating Makefile
config.status: creating config.h
make -C /usr/src/linux M=/var/tmp/portage/fuse-2.6.0_rc1/work/fuse-2.6.0-rc1/kernel  modules
make[1]: Entering directory `/usr/src/linux-2.6.19-ck2'
  CC [M]  /var/tmp/portage/fuse-2.6.0_rc1/work/fuse-2.6.0-rc1/kernel/dev.o
  CC [M]  /var/tmp/portage/fuse-2.6.0_rc1/work/fuse-2.6.0-rc1/kernel/dir.o
  CC [M]  /var/tmp/portage/fuse-2.6.0_rc1/work/fuse-2.6.0-rc1/kernel/file.o
/var/tmp/portage/fuse-2.6.0_rc1/work/fuse-2.6.0-rc1/kernel/dev.c:1094: error: unknown field ‘readv’ specified in initializer
/var/tmp/portage/fuse-2.6.0_rc1/work/fuse-2.6.0-rc1/kernel/dev.c:1094: warning: initialization from incompatible pointer type
/var/tmp/portage/fuse-2.6.0_rc1/work/fuse-2.6.0-rc1/kernel/dev.c:1096: error: unknown field ‘writev’ specified in initializer
/var/tmp/portage/fuse-2.6.0_rc1/work/fuse-2.6.0-rc1/kernel/dev.c:1096: warning: initialization from incompatible pointer type
make[2]: *** [/var/tmp/portage/fuse-2.6.0_rc1/work/fuse-2.6.0-rc1/kernel/dev.o] Error 1
make[2]: *** Waiting for unfinished jobs....
/var/tmp/portage/fuse-2.6.0_rc1/work/fuse-2.6.0-rc1/kernel/file.c:942: error: ‘generic_file_read’ undeclared here (not in a function)
/var/tmp/portage/fuse-2.6.0_rc1/work/fuse-2.6.0-rc1/kernel/file.c:943: error: ‘generic_file_write’ undeclared here (not in a function)
make[2]: *** [/var/tmp/portage/fuse-2.6.0_rc1/work/fuse-2.6.0-rc1/kernel/file.o] Error 1
make[1]: *** [_module_/var/tmp/portage/fuse-2.6.0_rc1/work/fuse-2.6.0-rc1/kernel] Error 2
make[1]: Leaving directory `/usr/src/linux-2.6.19-ck2'
make: *** [all-spec] Error 2

!!! ERROR: sys-fs/fuse-2.6.0_rc1 failed.
Call stack:
  ebuild.sh, line 1546:   Called dyn_compile
  ebuild.sh, line 937:   Called src_compile
  fuse-2.6.0_rc1.ebuild, line 46:   Called linux-mod_src_compile
  linux-mod.eclass, line 510:   Called die

!!! Unable to make  majver=2.6
                          fusemoduledir=//lib/modules/2.6.19-ck2/fs all.
!!! If you need support, post the topmost build error, and the call stack if relevant.

xushitop d #