All pastes #272317 Raw Edit

Unnamed

public text v1 · immutable
·published 2006-12-08 22:19 UTC
rendered paste body
libtool: link: warning: `/usr/X11R6/lib/libXdamage.la' seems to be mov
ed
libtool: link: warning: `/usr/X11R6/lib/libXss.la' seems to be moved
libtool: link: warning: `/usr/X11R6/lib/libX11.la' seems to be moved
libtool: link: warning: `/usr/X11R6/lib/libXext.la' seems to be moved
grep: /usr/lib/libeet.la: No such file or directory
/bin/sed: can't read /usr/lib/libeet.la: No such file or directory
libtool: link: `/usr/lib/libeet.la' is not a valid libtool archive
make[4]: *** [libecore_evas.la] Error 1
make[4]: Leaving directory `/var/tmp/portage/x11-libs/ecore-9999/work/
e17/libs/ecore/src/lib/ecore_evas'
make[3]: *** [all-recursive] Error 1
make[3]: Leaving directory `/var/tmp/portage/x11-libs/ecore-9999/work/
e17/libs/ecore/src/lib'
make[2]: *** [all-recursive] Error 1
make[2]: Leaving directory `/var/tmp/portage/x11-libs/ecore-9999/work/
e17/libs/ecore/src'
make[1]: *** [all-recursive] Error 1
make[1]: Leaving directory `/var/tmp/portage/x11-libs/ecore-9999/work/
e17/libs/ecore'
make: *** [all] Error 2
 * This is a LIVE CVS ebuild.
 * That means there are NO promises it will work.
 * If it fails to build, FIX THE CODE YOURSELF
 * before reporting any issues.

!!! ERROR: x11-libs/ecore-9999 failed.
Call stack:
  ebuild.sh, line 1569:   Called dyn_compile
  ebuild.sh, line 938:   Called src_compile
  ecore-9999.ebuild, line 47:   Called enlightenment_src_compile
  enlightenment.eclass, line 156:   Called enlightenment_die 'emake fa
iled'
  enlightenment.eclass, line 106:   Called die

!!! emake failed
!!! SEND BUG REPORTS TO vapier@gentoo.org NOT THE E TEAM
!!! If you need support, post the topmost build error, and the call st
ack if relevant.